SuccessConsole Output

Collecting metadata...
Metadata collection done.
Started calculate disk usage of build
Finished Calculation of disk usage of build in 0 seconds
Started calculate disk usage of workspace
Finished Calculation of disk usage of workspace in 0 seconds
[Checks API] No suitable checks publisher found.
[INFO] 
[INFO] ------------------------------------------------------------------------
[INFO] Building AssertionManagerGui-EJB 4.1.1-SNAPSHOT
[INFO] ------------------------------------------------------------------------
[INFO] 
[INFO] --- maven-clean-plugin:3.0.0:clean (default-clean) @ AssertionManagerGui-ejb ---
[INFO] Deleting /home/jenkins/.hudson/jobs/AssertionManager-Gui-Git-SNAPSHOT/workspace/AssertionManagerGui-ejb/target
[INFO] 
[INFO] --- maven-enforcer-plugin:1.2:enforce (enforce-java-version) @ AssertionManagerGui-ejb ---
[INFO] 
[INFO] --- maven-enforcer-plugin:1.2:enforce (enforce-maven-version) @ AssertionManagerGui-ejb ---
[INFO] 
[INFO] --- buildnumber-maven-plugin:1.2:create-timestamp (get-build-timestamp) @ AssertionManagerGui-ejb ---
[INFO] 
[INFO] --- buildnumber-maven-plugin:1.2:create (get-scm-revision) @ AssertionManagerGui-ejb ---
[INFO] 
[INFO] --- maven-buildmetadata-plugin:1.1.0.IHE.3:provide-buildmetadata (default) @ AssertionManagerGui-ejb ---
[INFO] Executing: /bin/sh -c cd /home/jenkins/.hudson/jobs/AssertionManager-Gui-Git-SNAPSHOT/workspace/AssertionManagerGui-ejb && git whatchanged '--since=2020-09-29 12:50:40 +0000' '--until=2020-10-30 12:50:40 +0000' --date=iso -- /home/jenkins/.hudson/jobs/AssertionManager-Gui-Git-SNAPSHOT/workspace/AssertionManagerGui-ejb
[INFO] Working directory: /home/jenkins/.hudson/jobs/AssertionManager-Gui-Git-SNAPSHOT/workspace/AssertionManagerGui-ejb
[INFO] Executing: /bin/sh -c cd /home/jenkins/.hudson/jobs/AssertionManager-Gui-Git-SNAPSHOT/workspace/AssertionManagerGui-ejb && git status
[INFO] Working directory: /home/jenkins/.hudson/jobs/AssertionManager-Gui-Git-SNAPSHOT/workspace/AssertionManagerGui-ejb
[INFO] Writing properties '/home/jenkins/.hudson/jobs/AssertionManager-Gui-Git-SNAPSHOT/workspace/AssertionManagerGui-ejb/target/classes/META-INF/build.properties'...
[INFO] Writing XML report '/home/jenkins/.hudson/jobs/AssertionManager-Gui-Git-SNAPSHOT/workspace/AssertionManagerGui-ejb/target/buildmetadata.xml'...
[INFO] 
[INFO] --- jacoco-maven-plugin:0.7.9:prepare-agent (default-prepare-agent) @ AssertionManagerGui-ejb ---
[INFO] argLine set to -javaagent:/home/jenkins/.m2/repository/org/jacoco/org.jacoco.agent/0.7.9/org.jacoco.agent-0.7.9-runtime.jar=destfile=/home/jenkins/.hudson/jobs/AssertionManager-Gui-Git-SNAPSHOT/workspace/AssertionManagerGui-ejb/target/jacoco.exec,append=true
[INFO] 
[INFO] --- jacoco-maven-plugin:0.7.9:prepare-agent (default) @ AssertionManagerGui-ejb ---
[INFO] argLine set to -javaagent:/home/jenkins/.m2/repository/org/jacoco/org.jacoco.agent/0.7.9/org.jacoco.agent-0.7.9-runtime.jar=destfile=/home/jenkins/.hudson/jobs/AssertionManager-Gui-Git-SNAPSHOT/workspace/AssertionManagerGui-ejb/target/jacoco.exec,append=true
[INFO] 
[INFO] >>> maven-javadoc-plugin:2.8:javadoc (generate-service-docs) > generate-sources @ AssertionManagerGui-ejb >>>
[INFO] 
[INFO] --- maven-enforcer-plugin:1.2:enforce (enforce-java-version) @ AssertionManagerGui-ejb ---
[INFO] 
[INFO] --- maven-enforcer-plugin:1.2:enforce (enforce-maven-version) @ AssertionManagerGui-ejb ---
[INFO] 
[INFO] --- buildnumber-maven-plugin:1.2:create-timestamp (get-build-timestamp) @ AssertionManagerGui-ejb ---
[INFO] 
[INFO] --- buildnumber-maven-plugin:1.2:create (get-scm-revision) @ AssertionManagerGui-ejb ---
[INFO] 
[INFO] --- maven-buildmetadata-plugin:1.1.0.IHE.3:provide-buildmetadata (default) @ AssertionManagerGui-ejb ---
[INFO] 
[INFO] --- jacoco-maven-plugin:0.7.9:prepare-agent (default-prepare-agent) @ AssertionManagerGui-ejb ---
[INFO] argLine set to -javaagent:/home/jenkins/.m2/repository/org/jacoco/org.jacoco.agent/0.7.9/org.jacoco.agent-0.7.9-runtime.jar=destfile=/home/jenkins/.hudson/jobs/AssertionManager-Gui-Git-SNAPSHOT/workspace/AssertionManagerGui-ejb/target/jacoco.exec,append=true
[INFO] 
[INFO] --- jacoco-maven-plugin:0.7.9:prepare-agent (default) @ AssertionManagerGui-ejb ---
[INFO] argLine set to -javaagent:/home/jenkins/.m2/repository/org/jacoco/org.jacoco.agent/0.7.9/org.jacoco.agent-0.7.9-runtime.jar=destfile=/home/jenkins/.hudson/jobs/AssertionManager-Gui-Git-SNAPSHOT/workspace/AssertionManagerGui-ejb/target/jacoco.exec,append=true
Oct 29, 2020 1:50:40 PM hudson.maven.ExecutedMojo <init>
WARNING: Failed to getClass for org.apache.maven.plugin.javadoc.JavadocReport
[JENKINS] Archiving  javadoc
[INFO] 
[INFO] <<< maven-javadoc-plugin:2.8:javadoc (generate-service-docs) < generate-sources @ AssertionManagerGui-ejb <<<
[INFO] 
[INFO] 
[INFO] --- maven-javadoc-plugin:2.8:javadoc (generate-service-docs) @ AssertionManagerGui-ejb ---
[INFO] 
Loading source files for package net.ihe.gazelle.AssertionManager.scope...
Loading source files for package net.ihe.gazelle.AssertionManager.validator...
Loading source files for package net.ihe.gazelle.AssertionManager.utils...
Loading source files for package net.ihe.gazelle.AssertionManager.document...
Loading source files for package net.ihe.gazelle.AssertionManager.cache...
Loading source files for package net.ihe.gazelle.AssertionManager.ws.wrapper...
Loading source files for package net.ihe.gazelle.AssertionManager.idScheme...
Loading source files for package net.ihe.gazelle.AssertionManager.mbv...
Loading source files for package net.ihe.gazelle.AssertionManager.assertion...
Loading source files for package net.ihe.gazelle.AssertionManager.assertion.xml.response...
Loading source files for package net.ihe.gazelle.AssertionManager.assertion.pdf...
Loading source files for package net.ihe.gazelle.AssertionManager.assertion.ws...
Loading source files for package net.ihe.gazelle.AssertionManager.assertion.ws.api...
Loading source files for package net.ihe.gazelle.AssertionManager.assertion.link.appliesTo...
Loading source files for package net.ihe.gazelle.AssertionManager.assertion.link...
Loading source files for package net.ihe.gazelle.AssertionManager.assertion.link.coverage...
Constructing Javadoc information...
19 warnings
[WARNING] Javadoc Warnings
[WARNING] /home/jenkins/.hudson/jobs/AssertionManager-Gui-Git-SNAPSHOT/workspace/AssertionManagerGui-ejb/src/main/java/net/ihe/gazelle/AssertionManager/scope/AssertionScopeManager.java:23: error: cannot find symbol
[WARNING] public class AssertionScopeManager implements AssertionScopeManagerLocal, Serializable {
[WARNING] ^
[WARNING] symbol: class AssertionScopeManagerLocal
[WARNING] /home/jenkins/.hudson/jobs/AssertionManager-Gui-Git-SNAPSHOT/workspace/AssertionManagerGui-ejb/src/main/java/net/ihe/gazelle/AssertionManager/utils/PreferencesManager.java:15: error: cannot find symbol
[WARNING] public class PreferencesManager implements PreferencesManagerLocal {
[WARNING] ^
[WARNING] symbol: class PreferencesManagerLocal
[WARNING] /home/jenkins/.hudson/jobs/AssertionManager-Gui-Git-SNAPSHOT/workspace/AssertionManagerGui-ejb/src/main/java/net/ihe/gazelle/AssertionManager/idScheme/AssertionImporter.java:46: error: cannot find symbol
[WARNING] public class AssertionImporter implements AssertionImporterLocal, Serializable {
[WARNING] ^
[WARNING] symbol: class AssertionImporterLocal
[WARNING] /home/jenkins/.hudson/jobs/AssertionManager-Gui-Git-SNAPSHOT/workspace/AssertionManagerGui-ejb/src/main/java/net/ihe/gazelle/AssertionManager/idScheme/IdSchemesManager.java:25: error: cannot find symbol
[WARNING] public class IdSchemesManager implements IdSchemesManagerLocal, Serializable {
[WARNING] ^
[WARNING] symbol: class IdSchemesManagerLocal
[WARNING] /home/jenkins/.hudson/jobs/AssertionManager-Gui-Git-SNAPSHOT/workspace/AssertionManagerGui-ejb/src/main/java/net/ihe/gazelle/AssertionManager/idScheme/UploadManager.java:23: error: cannot find symbol
[WARNING] public class UploadManager implements UploadManagerLocal {
[WARNING] ^
[WARNING] symbol: class UploadManagerLocal
[WARNING] /home/jenkins/.hudson/jobs/AssertionManager-Gui-Git-SNAPSHOT/workspace/AssertionManagerGui-ejb/src/main/java/net/ihe/gazelle/AssertionManager/mbv/MbvServiceRefresher.java:30: error: cannot find symbol
[WARNING] public class MbvServiceRefresher implements MbvServiceRefresherLocal, Serializable {
[WARNING] ^
[WARNING] symbol: class MbvServiceRefresherLocal
[WARNING] /home/jenkins/.hudson/jobs/AssertionManager-Gui-Git-SNAPSHOT/workspace/AssertionManagerGui-ejb/src/main/java/net/ihe/gazelle/AssertionManager/mbv/MbvServiceManager.java:28: error: cannot find symbol
[WARNING] public class MbvServiceManager implements MbvServiceManagerLocal, Serializable {
[WARNING] ^
[WARNING] symbol: class MbvServiceManagerLocal
[WARNING] /home/jenkins/.hudson/jobs/AssertionManager-Gui-Git-SNAPSHOT/workspace/AssertionManagerGui-ejb/src/main/java/net/ihe/gazelle/AssertionManager/assertion/AssertionManager.java:33: error: cannot find symbol
[WARNING] public class AssertionManager implements AssertionManagerLocal, Serializable {
[WARNING] ^
[WARNING] symbol: class AssertionManagerLocal
[WARNING] /home/jenkins/.hudson/jobs/AssertionManager-Gui-Git-SNAPSHOT/workspace/AssertionManagerGui-ejb/src/main/java/net/ihe/gazelle/AssertionManager/assertion/link/AssertionLinkManager.java:23: error: cannot find symbol
[WARNING] public abstract class AssertionLinkManager implements AssertionLinkManagerLocal {
[WARNING] ^
[WARNING] symbol: class AssertionLinkManagerLocal
[WARNING] /home/jenkins/.hudson/jobs/AssertionManager-Gui-Git-SNAPSHOT/workspace/AssertionManagerGui-ejb/src/main/java/net/ihe/gazelle/AssertionManager/assertion/link/appliesTo/AppliesToAuditMessageManager.java:26: error: cannot find symbol
[WARNING] implements AppliesToAuditMessageManagerLocal, Serializable {
[WARNING] ^
[WARNING] symbol: class AppliesToAuditMessageManagerLocal
[WARNING] /home/jenkins/.hudson/jobs/AssertionManager-Gui-Git-SNAPSHOT/workspace/AssertionManagerGui-ejb/src/main/java/net/ihe/gazelle/AssertionManager/assertion/link/appliesTo/AppliesToIntegrationProfileManager.java:23: error: cannot find symbol
[WARNING] public class AppliesToIntegrationProfileManager extends AssertionLinkManager implements AppliesToIntegrationProfileManagerLocal, Serializable {
[WARNING] ^
[WARNING] symbol: class AppliesToIntegrationProfileManagerLocal
[WARNING] /home/jenkins/.hudson/jobs/AssertionManager-Gui-Git-SNAPSHOT/workspace/AssertionManagerGui-ejb/src/main/java/net/ihe/gazelle/AssertionManager/assertion/link/appliesTo/AppliesToStandardManager.java:23: error: cannot find symbol
[WARNING] public class AppliesToStandardManager extends AssertionLinkManager implements AppliesToStandardManagerLocal, Serializable {
[WARNING] ^
[WARNING] symbol: class AppliesToStandardManagerLocal
[WARNING] /home/jenkins/.hudson/jobs/AssertionManager-Gui-Git-SNAPSHOT/workspace/AssertionManagerGui-ejb/src/main/java/net/ihe/gazelle/AssertionManager/assertion/link/appliesTo/AppliesToAipoManager.java:23: error: cannot find symbol
[WARNING] public class AppliesToAipoManager extends AssertionLinkManager implements AppliesToAipoManagerLocal, Serializable {
[WARNING] ^
[WARNING] symbol: class AppliesToAipoManagerLocal
[WARNING] /home/jenkins/.hudson/jobs/AssertionManager-Gui-Git-SNAPSHOT/workspace/AssertionManagerGui-ejb/src/main/java/net/ihe/gazelle/AssertionManager/assertion/link/appliesTo/AppliesToTransactionManager.java:25: error: cannot find symbol
[WARNING] public class AppliesToTransactionManager extends AssertionLinkManager implements AppliesToTransactionManagerLocal, Serializable {
[WARNING] ^
[WARNING] symbol: class AppliesToTransactionManagerLocal
[WARNING] /home/jenkins/.hudson/jobs/AssertionManager-Gui-Git-SNAPSHOT/workspace/AssertionManagerGui-ejb/src/main/java/net/ihe/gazelle/AssertionManager/assertion/link/appliesTo/AppliesToActorManager.java:25: error: cannot find symbol
[WARNING] public class AppliesToActorManager extends AssertionLinkManager implements AppliesToActorManagerLocal, Serializable {
[WARNING] ^
[WARNING] symbol: class AppliesToActorManagerLocal
[WARNING] /home/jenkins/.hudson/jobs/AssertionManager-Gui-Git-SNAPSHOT/workspace/AssertionManagerGui-ejb/src/main/java/net/ihe/gazelle/AssertionManager/assertion/link/coverage/RuleLinkManager.java:23: error: cannot find symbol
[WARNING] public class RuleLinkManager extends AssertionLinkManager implements RuleLinkManagerLocal, Serializable {
[WARNING] ^
[WARNING] symbol: class RuleLinkManagerLocal
[WARNING] /home/jenkins/.hudson/jobs/AssertionManager-Gui-Git-SNAPSHOT/workspace/AssertionManagerGui-ejb/src/main/java/net/ihe/gazelle/AssertionManager/assertion/link/coverage/TestStepLinkManager.java:23: error: cannot find symbol
[WARNING] public class TestStepLinkManager extends AssertionLinkManager implements TestStepLinkManagerLocal, Serializable {
[WARNING] ^
[JENKINS] Archiving  javadoc[WARNING] symbol: class TestStepLinkManagerLocal

[WARNING] /home/jenkins/.hudson/jobs/AssertionManager-Gui-Git-SNAPSHOT/workspace/AssertionManagerGui-ejb/src/main/java/net/ihe/gazelle/AssertionManager/assertion/link/coverage/TestLinkManager.java:24: error: cannot find symbol
[WARNING] public class TestLinkManager extends AssertionLinkManager implements TestLinkManagerLocal, Serializable {
[WARNING] ^
[WARNING] symbol: class TestLinkManagerLocal
[WARNING] /home/jenkins/.hudson/jobs/AssertionManager-Gui-Git-SNAPSHOT/workspace/AssertionManagerGui-ejb/src/main/java/net/ihe/gazelle/AssertionManager/assertion/link/coverage/TestLinkRefresher.java:25: error: cannot find symbol
[WARNING] public class TestLinkRefresher implements TestLinkRefresherLocal, Serializable {
[WARNING] ^
[WARNING] symbol: class TestLinkRefresherLocal
[INFO] 
[INFO] --- maven-resources-plugin:2.6:resources (default-resources) @ AssertionManagerGui-ejb ---
[INFO] Using 'UTF-8' encoding to copy filtered resources.
[INFO] Copying 7 resources
[INFO] 
[INFO] --- maven-compiler-plugin:3.5.1:compile (default-compile) @ AssertionManagerGui-ejb ---
[INFO] Changes detected - recompiling the module!
[INFO] Compiling 50 source files to /home/jenkins/.hudson/jobs/AssertionManager-Gui-Git-SNAPSHOT/workspace/AssertionManagerGui-ejb/target/classes
[INFO] 
[INFO] --- maven-resources-plugin:2.6:testResources (default-testResources) @ AssertionManagerGui-ejb ---
[INFO] Using 'UTF-8' encoding to copy filtered resources.
[INFO] skip non existing resourceDirectory /home/jenkins/.hudson/jobs/AssertionManager-Gui-Git-SNAPSHOT/workspace/AssertionManagerGui-ejb/src/test/resources
[INFO] 
[INFO] --- maven-compiler-plugin:3.5.1:testCompile (default-testCompile) @ AssertionManagerGui-ejb ---
[INFO] Changes detected - recompiling the module!
[INFO] Compiling 8 source files to /home/jenkins/.hudson/jobs/AssertionManager-Gui-Git-SNAPSHOT/workspace/AssertionManagerGui-ejb/target/test-classes
[INFO] 
[INFO] --- maven-surefire-plugin:2.20:test (default-test) @ AssertionManagerGui-ejb ---
[INFO] 
[INFO] -------------------------------------------------------
[INFO]  T E S T S
[INFO] -------------------------------------------------------
[INFO] Running net.ihe.gazelle.AssertionManager.utils.UrlHelperTest
SLF4J: Class path contains multiple SLF4J bindings.
SLF4J: Found binding in [jar:file:/home/jenkins/.m2/repository/org/slf4j/slf4j-log4j12/1.7.25/slf4j-log4j12-1.7.25.jar!/org/slf4j/impl/StaticLoggerBinder.class]
SLF4J: Found binding in [jar:file:/home/jenkins/.m2/repository/org/slf4j/slf4j-simple/1.7.12/slf4j-simple-1.7.12.jar!/org/slf4j/impl/StaticLoggerBinder.class]
SLF4J: See http://www.slf4j.org/codes.html#multiple_bindings for an explanation.
SLF4J: Actual binding is of type [org.slf4j.impl.Log4jLoggerFactory]
[INFO] Tests run: 4, Failures: 0, Errors: 0, Skipped: 0, Time elapsed: 0.164 s - in net.ihe.gazelle.AssertionManager.utils.UrlHelperTest
[INFO] Running net.ihe.gazelle.AssertionManager.document.DocumentManagerTest
[WARNING] Tests run: 1, Failures: 0, Errors: 0, Skipped: 1, Time elapsed: 0 s - in net.ihe.gazelle.AssertionManager.document.DocumentManagerTest
[INFO] Running net.ihe.gazelle.AssertionManager.idScheme.OasisTestAssertionCoverageQueryHelperTest
[WARNING] Tests run: 1, Failures: 0, Errors: 0, Skipped: 1, Time elapsed: 0 s - in net.ihe.gazelle.AssertionManager.idScheme.OasisTestAssertionCoverageQueryHelperTest
[INFO] Running net.ihe.gazelle.AssertionManager.idScheme.IdSchemesCoverageTest
[WARNING] Tests run: 1, Failures: 0, Errors: 0, Skipped: 1, Time elapsed: 0 s - in net.ihe.gazelle.AssertionManager.idScheme.IdSchemesCoverageTest
[INFO] Running net.ihe.gazelle.AssertionManager.mbv.MbvServiceRefresherTest
[WARNING] Tests run: 1, Failures: 0, Errors: 0, Skipped: 1, Time elapsed: 0 s - in net.ihe.gazelle.AssertionManager.mbv.MbvServiceRefresherTest
[INFO] Running net.ihe.gazelle.AssertionManager.assertion.TestAssertion.AssertionIdGeneratorTest
[INFO] Tests run: 3, Failures: 0, Errors: 0, Skipped: 0, Time elapsed: 0.003 s - in net.ihe.gazelle.AssertionManager.assertion.TestAssertion.AssertionIdGeneratorTest
[INFO] Running net.ihe.gazelle.AssertionManager.assertion.link.coverage.TestLinkRefresherTest
[WARNING] Tests run: 1, Failures: 0, Errors: 0, Skipped: 1, Time elapsed: 0 s - in net.ihe.gazelle.AssertionManager.assertion.link.coverage.TestLinkRefresherTest
[INFO] 
[INFO] Results:
[INFO] 
[WARNING] Tests run: 12, Failures: 0, Errors: 0, Skipped: 5
[INFO] 
[JENKINS] Recording test results
[INFO] 
[INFO] --- jacoco-maven-plugin:0.7.9:report (post-unit-test) @ AssertionManagerGui-ejb ---
[INFO] Skipping JaCoCo execution due to missing execution data file.
[INFO] 
[INFO] --- jacoco-maven-plugin:0.7.9:report (default-report) @ AssertionManagerGui-ejb ---
[INFO] Skipping JaCoCo execution due to missing execution data file.
[INFO] 
[INFO] --- maven-ejb-plugin:2.3:ejb (default-ejb) @ AssertionManagerGui-ejb ---
[INFO] Building EJB AssertionManagerGui-ejb with EJB version 3.0
[INFO] Building jar: /home/jenkins/.hudson/jobs/AssertionManager-Gui-Git-SNAPSHOT/workspace/AssertionManagerGui-ejb/target/AssertionManagerGui-ejb.jar
[INFO] 
[INFO] --- maven-source-plugin:3.0.1:jar-no-fork (attach-sources) @ AssertionManagerGui-ejb ---
[INFO] Building jar: /home/jenkins/.hudson/jobs/AssertionManager-Gui-Git-SNAPSHOT/workspace/AssertionManagerGui-ejb/target/AssertionManagerGui-ejb-sources.jar
[INFO] 
[INFO] --- maven-jar-plugin:2.6:test-jar (default) @ AssertionManagerGui-ejb ---
[INFO] Building jar: /home/jenkins/.hudson/jobs/AssertionManager-Gui-Git-SNAPSHOT/workspace/AssertionManagerGui-ejb/target/AssertionManagerGui-ejb-tests.jar
[INFO] 
[INFO] --- maven-install-plugin:2.4:install (default-install) @ AssertionManagerGui-ejb ---
[INFO] Installing /home/jenkins/.hudson/jobs/AssertionManager-Gui-Git-SNAPSHOT/workspace/AssertionManagerGui-ejb/target/AssertionManagerGui-ejb.jar to /home/jenkins/.m2/repository/net/ihe/gazelle/AssertionManagerGui-ejb/4.1.1-SNAPSHOT/AssertionManagerGui-ejb-4.1.1-SNAPSHOT.jar
[INFO] Installing /home/jenkins/.hudson/jobs/AssertionManager-Gui-Git-SNAPSHOT/workspace/AssertionManagerGui-ejb/pom.xml to /home/jenkins/.m2/repository/net/ihe/gazelle/AssertionManagerGui-ejb/4.1.1-SNAPSHOT/AssertionManagerGui-ejb-4.1.1-SNAPSHOT.pom
[INFO] Installing /home/jenkins/.hudson/jobs/AssertionManager-Gui-Git-SNAPSHOT/workspace/AssertionManagerGui-ejb/target/AssertionManagerGui-ejb-sources.jar to /home/jenkins/.m2/repository/net/ihe/gazelle/AssertionManagerGui-ejb/4.1.1-SNAPSHOT/AssertionManagerGui-ejb-4.1.1-SNAPSHOT-sources.jar
[INFO] Installing /home/jenkins/.hudson/jobs/AssertionManager-Gui-Git-SNAPSHOT/workspace/AssertionManagerGui-ejb/target/AssertionManagerGui-ejb-tests.jar to /home/jenkins/.m2/repository/net/ihe/gazelle/AssertionManagerGui-ejb/4.1.1-SNAPSHOT/AssertionManagerGui-ejb-4.1.1-SNAPSHOT-tests.jar