FailedConsole Output

Skipping 350 KB.. Full Log
[WARNING] public class TestLinkRefresher implements TestLinkRefresherLocal, Serializable {
[INFO] [WARNING] ^
[INFO] [WARNING] symbol: class TestLinkRefresherLocal
[INFO] [INFO] 
[INFO] [INFO] --- maven-buildmetadata-plugin:1.1.0.IHE.3:provide-buildmetadata (default) @ AssertionManagerGui-ejb ---
[INFO] [INFO] Reusing previously built metadata file.
[INFO] [INFO] 
[INFO] [INFO] --- maven-resources-plugin:2.7:resources (default-resources) @ AssertionManagerGui-ejb ---
[INFO] [INFO] Using 'UTF-8' encoding to copy filtered resources.
[INFO] [INFO] Copying 6 resources
[INFO] [INFO] 
[INFO] [INFO] --- maven-compiler-plugin:3.5.1:compile (default-compile) @ AssertionManagerGui-ejb ---
[INFO] [INFO] Changes detected - recompiling the module!
[INFO] [INFO] Compiling 50 source files to /home/jenkins/.hudson/jobs/AssertionManager-Gui-SNAPSHOT/workspace/target/checkout/AssertionManagerGui-ejb/target/classes
[INFO] net.ihe.gazelle.common.interfacegenerator.InterfaceGeneratorProcessor processor
[INFO] Generating interfaces thanks to @GenerateInterface
[INFO] [WARNING] No SupportedSourceVersion annotation found on org.kohsuke.metainf_services.AnnotationProcessorImpl, returning RELEASE_6.
[INFO] [WARNING] Supported source version 'RELEASE_6' from annotation processor 'org.kohsuke.metainf_services.AnnotationProcessorImpl' less than -source '1.7'
[INFO] [INFO] Writing META-INF/services/net.ihe.gazelle.preferences.PreferenceProvider
[INFO] [INFO] Hibernate JPA 2 Static-Metamodel Generator [WORKING]
[INFO] [INFO] /home/jenkins/.hudson/jobs/AssertionManager-Gui-SNAPSHOT/workspace/target/checkout/AssertionManagerGui-ejb/src/main/java/net/ihe/gazelle/AssertionManager/assertion/link/AssertionLinkManager.java: /home/jenkins/.hudson/jobs/AssertionManager-Gui-SNAPSHOT/workspace/target/checkout/AssertionManagerGui-ejb/src/main/java/net/ihe/gazelle/AssertionManager/assertion/link/AssertionLinkManager.java uses unchecked or unsafe operations.
[INFO] [INFO] /home/jenkins/.hudson/jobs/AssertionManager-Gui-SNAPSHOT/workspace/target/checkout/AssertionManagerGui-ejb/src/main/java/net/ihe/gazelle/AssertionManager/assertion/link/AssertionLinkManager.java: Recompile with -Xlint:unchecked for details.
[INFO] [INFO] 
[INFO] [INFO] --- maven-resources-plugin:2.7:testResources (default-testResources) @ AssertionManagerGui-ejb ---
[INFO] [INFO] Using 'UTF-8' encoding to copy filtered resources.
[INFO] [INFO] skip non existing resourceDirectory /home/jenkins/.hudson/jobs/AssertionManager-Gui-SNAPSHOT/workspace/target/checkout/AssertionManagerGui-ejb/src/test/resources
[INFO] [INFO] 
[INFO] [INFO] --- maven-compiler-plugin:3.5.1:testCompile (default-testCompile) @ AssertionManagerGui-ejb ---
[INFO] [INFO] Changes detected - recompiling the module!
[INFO] [INFO] Compiling 8 source files to /home/jenkins/.hudson/jobs/AssertionManager-Gui-SNAPSHOT/workspace/target/checkout/AssertionManagerGui-ejb/target/test-classes
[INFO] [WARNING] No SupportedSourceVersion annotation found on org.kohsuke.metainf_services.AnnotationProcessorImpl, returning RELEASE_6.
[INFO] [WARNING] Supported source version 'RELEASE_6' from annotation processor 'org.kohsuke.metainf_services.AnnotationProcessorImpl' less than -source '1.7'
[INFO] [INFO] Hibernate JPA 2 Static-Metamodel Generator [WORKING]
[INFO] [INFO] 
[INFO] [INFO] --- maven-surefire-plugin:2.12.3:test (default-test) @ AssertionManagerGui-ejb ---
[INFO] [INFO] Surefire report directory: /home/jenkins/.hudson/jobs/AssertionManager-Gui-SNAPSHOT/workspace/target/checkout/AssertionManagerGui-ejb/target/surefire-reports
[INFO] [INFO] Using configured provider org.apache.maven.surefire.junitcore.JUnitCoreProvider
[INFO] 
[INFO] -------------------------------------------------------
[INFO]  T E S T S
[INFO] -------------------------------------------------------
[INFO] Concurrency config is parallel='none', perCoreThreadCount=true, threadCount=2, useUnlimitedThreads=false
[INFO] Running net.ihe.gazelle.AssertionManager.utils.UrlHelperTest
[INFO] Tests run: 4, Failures: 0, Errors: 0, Skipped: 0, Time elapsed: 0.005 sec
[INFO] Running net.ihe.gazelle.AssertionManager.idScheme.OasisTestAssertionCoverageQueryHelperTest
[INFO] [main] INFO org.reflections.Reflections - Reflections took 382 ms to scan 19 urls, producing 625 keys and 2447 values 
[INFO] [main] WARN net.sf.ehcache.config.ConfigurationFactory - No configuration found. Configuring ehcache from ehcache-failsafe.xml  found in the classpath: jar:file:/home/jenkins/.m2/repository/net/sf/ehcache/ehcache-core/2.6.6/ehcache-core-2.6.6.jar!/ehcache-failsafe.xml
[INFO] [main] INFO org.hibernate.validator.util.Version - Hibernate Validator 4.2.0.Final
[INFO] INFO  2016-10-04 09:28:07,768 [main] org.hibernate.annotations.common.Version: HCANN000001: Hibernate Commons Annotations {4.0.1.Final}
[INFO] INFO  2016-10-04 09:28:07,772 [main] org.hibernate.Version: HHH000412: Hibernate Core {4.2.20.Final}
[INFO] INFO  2016-10-04 09:28:07,774 [main] org.hibernate.cfg.Environment: HHH000206: hibernate.properties not found
[INFO] INFO  2016-10-04 09:28:07,775 [main] org.hibernate.cfg.Environment: HHH000021: Bytecode provider name : javassist
[INFO] INFO  2016-10-04 09:28:07,794 [main] org.hibernate.cfg.Configuration: HHH000043: Configuring from resource: META-INF/hibernate.cfg.xml
[INFO] INFO  2016-10-04 09:28:07,795 [main] org.hibernate.cfg.Configuration: HHH000040: Configuration resource: META-INF/hibernate.cfg.xml
[INFO] WARN  2016-10-04 09:28:07,826 [main] org.hibernate.internal.util.xml.DTDEntityResolver: HHH000223: Recognized obsolete hibernate namespace http://hibernate.sourceforge.net/. Use namespace http://www.hibernate.org/dtd/ instead. Refer to Hibernate 3.6 Migration Guide!
[INFO] INFO  2016-10-04 09:28:07,850 [main] org.hibernate.cfg.Configuration: HHH000041: Configured SessionFactory: null
[INFO] WARN  2016-10-04 09:28:07,889 [main] org.hibernate.service.jdbc.connections.internal.ConnectionProviderInitiator: HHH000208: org.hibernate.connection.C3P0ConnectionProvider has been deprecated in favor of org.hibernate.service.jdbc.connections.internal.C3P0ConnectionProvider; that provider will be used instead.
[INFO] INFO  2016-10-04 09:28:07,889 [main] org.hibernate.service.jdbc.connections.internal.ConnectionProviderInitiator: HHH000130: Instantiating explicit connection provider: org.hibernate.service.jdbc.connections.internal.C3P0ConnectionProvider
[INFO] INFO  2016-10-04 09:28:07,898 [main] org.hibernate.service.jdbc.connections.internal.C3P0ConnectionProvider: HHH010002: C3P0 using driver: org.postgresql.Driver at URL: jdbc:postgresql://localhost/assertion-manager-junit
[INFO] INFO  2016-10-04 09:28:07,899 [main] org.hibernate.service.jdbc.connections.internal.C3P0ConnectionProvider: HHH000046: Connection properties: {user=gazelle, password=****, autocommit=true, release_mode=auto}
[INFO] INFO  2016-10-04 09:28:07,899 [main] org.hibernate.service.jdbc.connections.internal.C3P0ConnectionProvider: HHH000006: Autocommit mode: true
[INFO] INFO  2016-10-04 09:28:07,911 [main] com.mchange.v2.log.MLog: MLog clients using log4j logging.
[INFO] INFO  2016-10-04 09:28:08,004 [main] com.mchange.v2.c3p0.C3P0Registry: Initializing c3p0-0.9.1.2 [built 21-May-2007 15:04:56; debug? true; trace: 10]
[INFO] INFO  2016-10-04 09:28:08,080 [main] com.mchange.v2.c3p0.impl.AbstractPoolBackedDataSource: Initializing c3p0 pool... com.mchange.v2.c3p0.PoolBackedDataSource@8b0a541b [ connectionPoolDataSource -> com.mchange.v2.c3p0.WrapperConnectionPoolDataSource@612f18cd [ acquireIncrement -> 1, acquireRetryAttempts -> 30, acquireRetryDelay -> 1000, autoCommitOnClose -> false, automaticTestTable -> null, breakAfterAcquireFailure -> false, checkoutTimeout -> 0, connectionCustomizerClassName -> null, connectionTesterClassName -> com.mchange.v2.c3p0.impl.DefaultConnectionTester, debugUnreturnedConnectionStackTraces -> false, factoryClassLocation -> null, forceIgnoreUnresolvedTransactions -> false, identityToken -> 1gccios9j13kbeoc1lmx8pl|3ac04f43, idleConnectionTestPeriod -> 3000, initialPoolSize -> 0, maxAdministrativeTaskTime -> 0, maxConnectionAge -> 0, maxIdleTime -> 18000, maxIdleTimeExcessConnections -> 0, maxPoolSize -> 3, maxStatements -> 50, maxStatementsPerConnection -> 0, minPoolSize -> 0, nestedDataSource -> com.mchange.v2.c3p0.DriverManagerDataSource@1de5aa47 [ description -> null, driverClass -> null, factoryClassLocation -> null, identityToken -> 1gccios9j13kbeoc1lmx8pl|9d5cf1b, jdbcUrl -> jdbc:postgresql://localhost/assertion-manager-junit, properties -> {user=******, password=******, autocommit=true, release_mode=auto} ], preferredTestQuery -> null, propertyCycle -> 0, testConnectionOnCheckin -> false, testConnectionOnCheckout -> false, unreturnedConnectionTimeout -> 0, usesTraditionalReflectiveProxies -> false; userOverrides: {} ], dataSourceName -> null, factoryClassLocation -> null, identityToken -> 1gccios9j13kbeoc1lmx8pl|5aef577f, numHelperThreads -> 3 ]
[INFO] INFO  2016-10-04 09:28:08,297 [main] org.hibernate.dialect.Dialect: HHH000400: Using dialect: org.hibernate.dialect.PostgreSQLDialect
[INFO] INFO  2016-10-04 09:28:08,304 [main] org.hibernate.engine.jdbc.internal.LobCreatorBuilder: HHH000424: Disabling contextual LOB creation as createClob() method threw error : java.lang.reflect.InvocationTargetException
[INFO] INFO  2016-10-04 09:28:08,652 [main] org.hibernate.engine.transaction.internal.TransactionFactoryInitiator: HHH000268: Transaction strategy: org.hibernate.engine.transaction.internal.jdbc.JdbcTransactionFactory
[INFO] INFO  2016-10-04 09:28:08,655 [main] org.hibernate.hql.internal.ast.ASTQueryTranslatorFactory: HHH000397: Using ASTQueryTranslatorFactory
[INFO] INFO  2016-10-04 09:28:08,757 [main] org.hibernate.cache.spi.UpdateTimestampsCache: HHH000250: Starting update timestamps cache at region: org.hibernate.cache.spi.UpdateTimestampsCache
[INFO] WARN  2016-10-04 09:28:08,758 [main] org.hibernate.cache.ehcache.AbstractEhcacheRegionFactory: HHH020003: Could not find a specific ehcache configuration for cache named [org.hibernate.cache.spi.UpdateTimestampsCache]; using defaults.
[INFO] INFO  2016-10-04 09:28:08,786 [main] org.hibernate.cache.internal.StandardQueryCache: HHH000248: Starting query cache at region: org.hibernate.cache.internal.StandardQueryCache
[INFO] WARN  2016-10-04 09:28:08,786 [main] org.hibernate.cache.ehcache.AbstractEhcacheRegionFactory: HHH020003: Could not find a specific ehcache configuration for cache named [org.hibernate.cache.internal.StandardQueryCache]; using defaults.
[INFO] WARN  2016-10-04 09:28:09,141 [main] org.hibernate.cache.ehcache.AbstractEhcacheRegionFactory: HHH020003: Could not find a specific ehcache configuration for cache named [instances]; using defaults.
[INFO] WARN  2016-10-04 09:28:09,173 [main] org.hibernate.cache.ehcache.AbstractEhcacheRegionFactory: HHH020003: Could not find a specific ehcache configuration for cache named [net.ihe.gazelle.common.model.PathLinkingADocument]; using defaults.
[INFO] WARN  2016-10-04 09:28:09,213 [main] org.hibernate.cache.ehcache.AbstractEhcacheRegionFactory: HHH020003: Could not find a specific ehcache configuration for cache named [net.ihe.gazelle.common.model.ApplicationPreference]; using defaults.
[INFO] INFO  2016-10-04 09:28:09,514 [main] org.hibernate.tool.hbm2ddl.SchemaExport: HHH000227: Running hbm2ddl schema export
[INFO] INFO  2016-10-04 09:28:10,059 [main] org.hibernate.tool.hbm2ddl.SchemaExport: HHH000230: Schema export complete
[INFO] Tests run: 5, Failures: 0, Errors: 0, Skipped: 0, Time elapsed: 3.791 sec
[INFO] Running net.ihe.gazelle.AssertionManager.idScheme.IdSchemesCoverageTest
[INFO] Tests run: 2, Failures: 0, Errors: 0, Skipped: 0, Time elapsed: 0.103 sec
[INFO] Running net.ihe.gazelle.AssertionManager.mbv.MbvServiceRefresherTest
[INFO] Tests run: 1, Failures: 0, Errors: 0, Skipped: 0, Time elapsed: 0.055 sec
[INFO] Running net.ihe.gazelle.AssertionManager.assertion.TestAssertion.AssertionIdGeneratorTest
[INFO] Tests run: 3, Failures: 0, Errors: 0, Skipped: 0, Time elapsed: 0.004 sec
[INFO] Running net.ihe.gazelle.AssertionManager.assertion.link.coverage.TestLinkRefresherTest
[INFO] Tests run: 5, Failures: 0, Errors: 0, Skipped: 0, Time elapsed: 0.223 sec
[INFO] Running net.ihe.gazelle.AssertionManager.utils.UrlHelperTest
[INFO] Tests run: 1, Failures: 0, Errors: 0, Skipped: 1, Time elapsed: 0 sec
[INFO] 
[INFO] Results :
[INFO] 
[INFO] Tests run: 21, Failures: 0, Errors: 0, Skipped: 1
[INFO] 
[INFO] [INFO] 
[INFO] [INFO] --- maven-ejb-plugin:2.3:ejb (default-ejb) @ AssertionManagerGui-ejb ---
[INFO] [INFO] Building EJB AssertionManagerGui-ejb with EJB version 3.0
[INFO] [INFO] Building jar: /home/jenkins/.hudson/jobs/AssertionManager-Gui-SNAPSHOT/workspace/target/checkout/AssertionManagerGui-ejb/target/AssertionManagerGui-ejb.jar
[INFO] [INFO] 
[INFO] [INFO] --- maven-source-plugin:2.2.1:jar-no-fork (attach-sources) @ AssertionManagerGui-ejb ---
[INFO] [INFO] Building jar: /home/jenkins/.hudson/jobs/AssertionManager-Gui-SNAPSHOT/workspace/target/checkout/AssertionManagerGui-ejb/target/AssertionManagerGui-ejb-sources.jar
[INFO] [INFO] 
[INFO] [INFO] --- maven-assembly-plugin:2.4:single (source-release-assembly) @ AssertionManagerGui-ejb ---
[INFO] [INFO] Skipping the assembly in this project because it's not the Execution Root
[INFO] [INFO] 
[INFO] [INFO] --- maven-javadoc-plugin:2.8:jar (attach-javadocs) @ AssertionManagerGui-ejb ---
[INFO] [INFO] 
[INFO] Loading source files for package net.ihe.gazelle.AssertionManager.scope...
[INFO] Loading source files for package net.ihe.gazelle.AssertionManager.validator...
[INFO] Loading source files for package net.ihe.gazelle.AssertionManager.utils...
[INFO] Loading source files for package net.ihe.gazelle.AssertionManager.document...
[INFO] Loading source files for package net.ihe.gazelle.AssertionManager.cache...
[INFO] Loading source files for package net.ihe.gazelle.AssertionManager.ws.wrapper...
[INFO] Loading source files for package net.ihe.gazelle.AssertionManager.idScheme...
[INFO] Loading source files for package net.ihe.gazelle.AssertionManager.mbv...
[INFO] Loading source files for package net.ihe.gazelle.AssertionManager.assertion...
[INFO] Loading source files for package net.ihe.gazelle.AssertionManager.assertion.xml.response...
[INFO] Loading source files for package net.ihe.gazelle.AssertionManager.assertion.pdf...
[INFO] Loading source files for package net.ihe.gazelle.AssertionManager.assertion.ws...
[INFO] Loading source files for package net.ihe.gazelle.AssertionManager.assertion.ws.api...
[INFO] Loading source files for package net.ihe.gazelle.AssertionManager.assertion.link.appliesTo...
[INFO] Loading source files for package net.ihe.gazelle.AssertionManager.assertion.link...
[INFO] Loading source files for package net.ihe.gazelle.AssertionManager.assertion.link.coverage...
[INFO] Constructing Javadoc information...
[INFO] Standard Doclet version 1.7.0_80
[INFO] Building tree for all the packages and classes...
[INFO] Generating /home/jenkins/.hudson/jobs/AssertionManager-Gui-SNAPSHOT/workspace/target/checkout/AssertionManagerGui-ejb/target/apidocs/net/ihe/gazelle/AssertionManager/scope/AssertionScopeConverter.html...
[INFO] Generating /home/jenkins/.hudson/jobs/AssertionManager-Gui-SNAPSHOT/workspace/target/checkout/AssertionManagerGui-ejb/target/apidocs/net/ihe/gazelle/AssertionManager/scope/AssertionScopeFilter.html...
[INFO] Generating /home/jenkins/.hudson/jobs/AssertionManager-Gui-SNAPSHOT/workspace/target/checkout/AssertionManagerGui-ejb/target/apidocs/net/ihe/gazelle/AssertionManager/scope/AssertionScopeManager.html...
[INFO] Generating /home/jenkins/.hudson/jobs/AssertionManager-Gui-SNAPSHOT/workspace/target/checkout/AssertionManagerGui-ejb/target/apidocs/net/ihe/gazelle/AssertionManager/scope/AssertionScopeManagerLocal.html...
[INFO] Generating /home/jenkins/.hudson/jobs/AssertionManager-Gui-SNAPSHOT/workspace/target/checkout/AssertionManagerGui-ejb/target/apidocs/net/ihe/gazelle/AssertionManager/scope/OasisTestAssertionConverter.html...
[INFO] Generating /home/jenkins/.hudson/jobs/AssertionManager-Gui-SNAPSHOT/workspace/target/checkout/AssertionManagerGui-ejb/target/apidocs/net/ihe/gazelle/AssertionManager/scope/ScopeCoverage.html...
[INFO] Generating /home/jenkins/.hudson/jobs/AssertionManager-Gui-SNAPSHOT/workspace/target/checkout/AssertionManagerGui-ejb/target/apidocs/net/ihe/gazelle/AssertionManager/validator/UriValidator.html...
[INFO] Generating /home/jenkins/.hudson/jobs/AssertionManager-Gui-SNAPSHOT/workspace/target/checkout/AssertionManagerGui-ejb/target/apidocs/net/ihe/gazelle/AssertionManager/utils/AssertionManagerGuiPreferencesProvider.html...
[INFO] Generating /home/jenkins/.hudson/jobs/AssertionManager-Gui-SNAPSHOT/workspace/target/checkout/AssertionManagerGui-ejb/target/apidocs/net/ihe/gazelle/AssertionManager/utils/PreferencesManager.html...
[INFO] Generating /home/jenkins/.hudson/jobs/AssertionManager-Gui-SNAPSHOT/workspace/target/checkout/AssertionManagerGui-ejb/target/apidocs/net/ihe/gazelle/AssertionManager/utils/PreferencesManagerLocal.html...
[INFO] Generating /home/jenkins/.hudson/jobs/AssertionManager-Gui-SNAPSHOT/workspace/target/checkout/AssertionManagerGui-ejb/target/apidocs/net/ihe/gazelle/AssertionManager/utils/UrlHelper.html...
[INFO] Generating /home/jenkins/.hudson/jobs/AssertionManager-Gui-SNAPSHOT/workspace/target/checkout/AssertionManagerGui-ejb/target/apidocs/net/ihe/gazelle/AssertionManager/document/DocumentFilter.html...
[INFO] Generating /home/jenkins/.hudson/jobs/AssertionManager-Gui-SNAPSHOT/workspace/target/checkout/AssertionManagerGui-ejb/target/apidocs/net/ihe/gazelle/AssertionManager/document/DocumentManager.html...
[INFO] Generating /home/jenkins/.hudson/jobs/AssertionManager-Gui-SNAPSHOT/workspace/target/checkout/AssertionManagerGui-ejb/target/apidocs/net/ihe/gazelle/AssertionManager/cache/FileCache.html...
[INFO] Generating /home/jenkins/.hudson/jobs/AssertionManager-Gui-SNAPSHOT/workspace/target/checkout/AssertionManagerGui-ejb/target/apidocs/net/ihe/gazelle/AssertionManager/ws/wrapper/TmWsClient.html...
[INFO] Generating /home/jenkins/.hudson/jobs/AssertionManager-Gui-SNAPSHOT/workspace/target/checkout/AssertionManagerGui-ejb/target/apidocs/net/ihe/gazelle/AssertionManager/idScheme/AssertionImporter.html...
[INFO] Generating /home/jenkins/.hudson/jobs/AssertionManager-Gui-SNAPSHOT/workspace/target/checkout/AssertionManagerGui-ejb/target/apidocs/net/ihe/gazelle/AssertionManager/idScheme/AssertionImporterLocal.html...
[INFO] Generating /home/jenkins/.hudson/jobs/AssertionManager-Gui-SNAPSHOT/workspace/target/checkout/AssertionManagerGui-ejb/target/apidocs/net/ihe/gazelle/AssertionManager/idScheme/IdSchemesCoverage.html...
[INFO] Generating /home/jenkins/.hudson/jobs/AssertionManager-Gui-SNAPSHOT/workspace/target/checkout/AssertionManagerGui-ejb/target/apidocs/net/ihe/gazelle/AssertionManager/idScheme/IdSchemesFilter.html...
[INFO] Generating /home/jenkins/.hudson/jobs/AssertionManager-Gui-SNAPSHOT/workspace/target/checkout/AssertionManagerGui-ejb/target/apidocs/net/ihe/gazelle/AssertionManager/idScheme/IdSchemesManager.html...
[INFO] Generating /home/jenkins/.hudson/jobs/AssertionManager-Gui-SNAPSHOT/workspace/target/checkout/AssertionManagerGui-ejb/target/apidocs/net/ihe/gazelle/AssertionManager/idScheme/IdSchemesManagerLocal.html...
[INFO] Generating /home/jenkins/.hudson/jobs/AssertionManager-Gui-SNAPSHOT/workspace/target/checkout/AssertionManagerGui-ejb/target/apidocs/net/ihe/gazelle/AssertionManager/idScheme/OasisTestAssertionCoverageQueryHelper.html...
[INFO] Generating /home/jenkins/.hudson/jobs/AssertionManager-Gui-SNAPSHOT/workspace/target/checkout/AssertionManagerGui-ejb/target/apidocs/net/ihe/gazelle/AssertionManager/idScheme/UploadManager.html...
[INFO] Generating /home/jenkins/.hudson/jobs/AssertionManager-Gui-SNAPSHOT/workspace/target/checkout/AssertionManagerGui-ejb/target/apidocs/net/ihe/gazelle/AssertionManager/idScheme/UploadManagerLocal.html...
[INFO] Generating /home/jenkins/.hudson/jobs/AssertionManager-Gui-SNAPSHOT/workspace/target/checkout/AssertionManagerGui-ejb/target/apidocs/net/ihe/gazelle/AssertionManager/mbv/MbvServiceManager.html...
[INFO] Generating /home/jenkins/.hudson/jobs/AssertionManager-Gui-SNAPSHOT/workspace/target/checkout/AssertionManagerGui-ejb/target/apidocs/net/ihe/gazelle/AssertionManager/mbv/MbvServiceManagerLocal.html...
[INFO] Generating /home/jenkins/.hudson/jobs/AssertionManager-Gui-SNAPSHOT/workspace/target/checkout/AssertionManagerGui-ejb/target/apidocs/net/ihe/gazelle/AssertionManager/mbv/MbvServiceRefresher.html...
[INFO] Generating /home/jenkins/.hudson/jobs/AssertionManager-Gui-SNAPSHOT/workspace/target/checkout/AssertionManagerGui-ejb/target/apidocs/net/ihe/gazelle/AssertionManager/mbv/MbvServiceRefresherLocal.html...
[INFO] Generating /home/jenkins/.hudson/jobs/AssertionManager-Gui-SNAPSHOT/workspace/target/checkout/AssertionManagerGui-ejb/target/apidocs/net/ihe/gazelle/AssertionManager/assertion/AssertionIdGenerator.html...
[INFO] Generating /home/jenkins/.hudson/jobs/AssertionManager-Gui-SNAPSHOT/workspace/target/checkout/AssertionManagerGui-ejb/target/apidocs/net/ihe/gazelle/AssertionManager/assertion/AssertionManager.html...
[INFO] Generating /home/jenkins/.hudson/jobs/AssertionManager-Gui-SNAPSHOT/workspace/target/checkout/AssertionManagerGui-ejb/target/apidocs/net/ihe/gazelle/AssertionManager/assertion/AssertionManagerLocal.html...
[INFO] Generating /home/jenkins/.hudson/jobs/AssertionManager-Gui-SNAPSHOT/workspace/target/checkout/AssertionManagerGui-ejb/target/apidocs/net/ihe/gazelle/AssertionManager/assertion/CheckBoxesFilter.html...
[INFO] Generating /home/jenkins/.hudson/jobs/AssertionManager-Gui-SNAPSHOT/workspace/target/checkout/AssertionManagerGui-ejb/target/apidocs/net/ihe/gazelle/AssertionManager/assertion/OasisTargetConverter.html...
[INFO] Generating /home/jenkins/.hudson/jobs/AssertionManager-Gui-SNAPSHOT/workspace/target/checkout/AssertionManagerGui-ejb/target/apidocs/net/ihe/gazelle/AssertionManager/assertion/OasisTestAssertionFilter.html...
[INFO] Generating /home/jenkins/.hudson/jobs/AssertionManager-Gui-SNAPSHOT/workspace/target/checkout/AssertionManagerGui-ejb/target/apidocs/net/ihe/gazelle/AssertionManager/assertion/xml/response/DocumentResponse.html...
[INFO] Generating /home/jenkins/.hudson/jobs/AssertionManager-Gui-SNAPSHOT/workspace/target/checkout/AssertionManagerGui-ejb/target/apidocs/net/ihe/gazelle/AssertionManager/assertion/xml/response/DocumentSectionResponse.html...
[INFO] Generating /home/jenkins/.hudson/jobs/AssertionManager-Gui-SNAPSHOT/workspace/target/checkout/AssertionManagerGui-ejb/target/apidocs/net/ihe/gazelle/AssertionManager/assertion/xml/response/IdSchemeResponse.html...
[INFO] Generating /home/jenkins/.hudson/jobs/AssertionManager-Gui-SNAPSHOT/workspace/target/checkout/AssertionManagerGui-ejb/target/apidocs/net/ihe/gazelle/AssertionManager/assertion/xml/response/JaxbString.html...
[INFO] Generating /home/jenkins/.hudson/jobs/AssertionManager-Gui-SNAPSHOT/workspace/target/checkout/AssertionManagerGui-ejb/target/apidocs/net/ihe/gazelle/AssertionManager/assertion/pdf/DocumentClient.html...
[INFO] Generating /home/jenkins/.hudson/jobs/AssertionManager-Gui-SNAPSHOT/workspace/target/checkout/AssertionManagerGui-ejb/target/apidocs/net/ihe/gazelle/AssertionManager/assertion/pdf/OpenPDFDocument.html...
[INFO] Generating /home/jenkins/.hudson/jobs/AssertionManager-Gui-SNAPSHOT/workspace/target/checkout/AssertionManagerGui-ejb/target/apidocs/net/ihe/gazelle/AssertionManager/assertion/ws/Common.html...
[INFO] Generating /home/jenkins/.hudson/jobs/AssertionManager-Gui-SNAPSHOT/workspace/target/checkout/AssertionManagerGui-ejb/target/apidocs/net/ihe/gazelle/AssertionManager/assertion/ws/OasisTestAssertionWrapper.html...
[INFO] Generating /home/jenkins/.hudson/jobs/AssertionManager-Gui-SNAPSHOT/workspace/target/checkout/AssertionManagerGui-ejb/target/apidocs/net/ihe/gazelle/AssertionManager/assertion/ws/Parameters.html...
[INFO] Generating /home/jenkins/.hudson/jobs/AssertionManager-Gui-SNAPSHOT/workspace/target/checkout/AssertionManagerGui-ejb/target/apidocs/net/ihe/gazelle/AssertionManager/assertion/ws/TestAssertion.html...
[INFO] Generating /home/jenkins/.hudson/jobs/AssertionManager-Gui-SNAPSHOT/workspace/target/checkout/AssertionManagerGui-ejb/target/apidocs/net/ihe/gazelle/AssertionManager/assertion/ws/TestAssertionRequest.html...
[INFO] Generating /home/jenkins/.hudson/jobs/AssertionManager-Gui-SNAPSHOT/workspace/target/checkout/AssertionManagerGui-ejb/target/apidocs/net/ihe/gazelle/AssertionManager/assertion/ws/api/TestAssertionApi.html...
[INFO] Generating /home/jenkins/.hudson/jobs/AssertionManager-Gui-SNAPSHOT/workspace/target/checkout/AssertionManagerGui-ejb/target/apidocs/net/ihe/gazelle/AssertionManager/assertion/link/appliesTo/AppliesToActorManager.html...
[INFO] Generating /home/jenkins/.hudson/jobs/AssertionManager-Gui-SNAPSHOT/workspace/target/checkout/AssertionManagerGui-ejb/target/apidocs/net/ihe/gazelle/AssertionManager/assertion/link/appliesTo/AppliesToActorManagerLocal.html...
[INFO] Generating /home/jenkins/.hudson/jobs/AssertionManager-Gui-SNAPSHOT/workspace/target/checkout/AssertionManagerGui-ejb/target/apidocs/net/ihe/gazelle/AssertionManager/assertion/link/appliesTo/AppliesToAipoManager.html...
[INFO] Generating /home/jenkins/.hudson/jobs/AssertionManager-Gui-SNAPSHOT/workspace/target/checkout/AssertionManagerGui-ejb/target/apidocs/net/ihe/gazelle/AssertionManager/assertion/link/appliesTo/AppliesToAipoManagerLocal.html...
[INFO] Generating /home/jenkins/.hudson/jobs/AssertionManager-Gui-SNAPSHOT/workspace/target/checkout/AssertionManagerGui-ejb/target/apidocs/net/ihe/gazelle/AssertionManager/assertion/link/appliesTo/AppliesToAuditMessageManager.html...
[INFO] Generating /home/jenkins/.hudson/jobs/AssertionManager-Gui-SNAPSHOT/workspace/target/checkout/AssertionManagerGui-ejb/target/apidocs/net/ihe/gazelle/AssertionManager/assertion/link/appliesTo/AppliesToAuditMessageManagerLocal.html...
[INFO] Generating /home/jenkins/.hudson/jobs/AssertionManager-Gui-SNAPSHOT/workspace/target/checkout/AssertionManagerGui-ejb/target/apidocs/net/ihe/gazelle/AssertionManager/assertion/link/appliesTo/AppliesToIntegrationProfileManager.html...
[INFO] Generating /home/jenkins/.hudson/jobs/AssertionManager-Gui-SNAPSHOT/workspace/target/checkout/AssertionManagerGui-ejb/target/apidocs/net/ihe/gazelle/AssertionManager/assertion/link/appliesTo/AppliesToIntegrationProfileManagerLocal.html...
[INFO] Generating /home/jenkins/.hudson/jobs/AssertionManager-Gui-SNAPSHOT/workspace/target/checkout/AssertionManagerGui-ejb/target/apidocs/net/ihe/gazelle/AssertionManager/assertion/link/appliesTo/AppliesToStandardManager.html...
[INFO] Generating /home/jenkins/.hudson/jobs/AssertionManager-Gui-SNAPSHOT/workspace/target/checkout/AssertionManagerGui-ejb/target/apidocs/net/ihe/gazelle/AssertionManager/assertion/link/appliesTo/AppliesToStandardManagerLocal.html...
[INFO] Generating /home/jenkins/.hudson/jobs/AssertionManager-Gui-SNAPSHOT/workspace/target/checkout/AssertionManagerGui-ejb/target/apidocs/net/ihe/gazelle/AssertionManager/assertion/link/appliesTo/AppliesToTransactionManager.html...
[INFO] Generating /home/jenkins/.hudson/jobs/AssertionManager-Gui-SNAPSHOT/workspace/target/checkout/AssertionManagerGui-ejb/target/apidocs/net/ihe/gazelle/AssertionManager/assertion/link/appliesTo/AppliesToTransactionManagerLocal.html...
[INFO] Generating /home/jenkins/.hudson/jobs/AssertionManager-Gui-SNAPSHOT/workspace/target/checkout/AssertionManagerGui-ejb/target/apidocs/net/ihe/gazelle/AssertionManager/assertion/link/AssertionLinkManager.html...
[INFO] Generating /home/jenkins/.hudson/jobs/AssertionManager-Gui-SNAPSHOT/workspace/target/checkout/AssertionManagerGui-ejb/target/apidocs/net/ihe/gazelle/AssertionManager/assertion/link/AssertionLinkManagerLocal.html...
[INFO] Generating /home/jenkins/.hudson/jobs/AssertionManager-Gui-SNAPSHOT/workspace/target/checkout/AssertionManagerGui-ejb/target/apidocs/net/ihe/gazelle/AssertionManager/assertion/link/coverage/RuleFilteringBean.html...
[INFO] Generating /home/jenkins/.hudson/jobs/AssertionManager-Gui-SNAPSHOT/workspace/target/checkout/AssertionManagerGui-ejb/target/apidocs/net/ihe/gazelle/AssertionManager/assertion/link/coverage/RuleLinkManager.html...
[INFO] Generating /home/jenkins/.hudson/jobs/AssertionManager-Gui-SNAPSHOT/workspace/target/checkout/AssertionManagerGui-ejb/target/apidocs/net/ihe/gazelle/AssertionManager/assertion/link/coverage/RuleLinkManagerLocal.html...
[INFO] Generating /home/jenkins/.hudson/jobs/AssertionManager-Gui-SNAPSHOT/workspace/target/checkout/AssertionManagerGui-ejb/target/apidocs/net/ihe/gazelle/AssertionManager/assertion/link/coverage/TestLinkManager.html...
[INFO] Generating /home/jenkins/.hudson/jobs/AssertionManager-Gui-SNAPSHOT/workspace/target/checkout/AssertionManagerGui-ejb/target/apidocs/net/ihe/gazelle/AssertionManager/assertion/link/coverage/TestLinkManagerLocal.html...
[INFO] Generating /home/jenkins/.hudson/jobs/AssertionManager-Gui-SNAPSHOT/workspace/target/checkout/AssertionManagerGui-ejb/target/apidocs/net/ihe/gazelle/AssertionManager/assertion/link/coverage/TestLinkRefresher.html...
[INFO] Generating /home/jenkins/.hudson/jobs/AssertionManager-Gui-SNAPSHOT/workspace/target/checkout/AssertionManagerGui-ejb/target/apidocs/net/ihe/gazelle/AssertionManager/assertion/link/coverage/TestLinkRefresherLocal.html...
[INFO] Generating /home/jenkins/.hudson/jobs/AssertionManager-Gui-SNAPSHOT/workspace/target/checkout/AssertionManagerGui-ejb/target/apidocs/net/ihe/gazelle/AssertionManager/assertion/link/coverage/TestStepLinkManager.html...
[INFO] Generating /home/jenkins/.hudson/jobs/AssertionManager-Gui-SNAPSHOT/workspace/target/checkout/AssertionManagerGui-ejb/target/apidocs/net/ihe/gazelle/AssertionManager/assertion/link/coverage/TestStepLinkManagerLocal.html...
[INFO] Generating /home/jenkins/.hudson/jobs/AssertionManager-Gui-SNAPSHOT/workspace/target/checkout/AssertionManagerGui-ejb/target/apidocs/overview-frame.html...
[INFO] Generating /home/jenkins/.hudson/jobs/AssertionManager-Gui-SNAPSHOT/workspace/target/checkout/AssertionManagerGui-ejb/target/apidocs/net/ihe/gazelle/AssertionManager/assertion/package-frame.html...
[INFO] Generating /home/jenkins/.hudson/jobs/AssertionManager-Gui-SNAPSHOT/workspace/target/checkout/AssertionManagerGui-ejb/target/apidocs/net/ihe/gazelle/AssertionManager/assertion/package-summary.html...
[INFO] Generating /home/jenkins/.hudson/jobs/AssertionManager-Gui-SNAPSHOT/workspace/target/checkout/AssertionManagerGui-ejb/target/apidocs/net/ihe/gazelle/AssertionManager/assertion/package-tree.html...
[INFO] Generating /home/jenkins/.hudson/jobs/AssertionManager-Gui-SNAPSHOT/workspace/target/checkout/AssertionManagerGui-ejb/target/apidocs/net/ihe/gazelle/AssertionManager/assertion/link/package-frame.html...
[INFO] Generating /home/jenkins/.hudson/jobs/AssertionManager-Gui-SNAPSHOT/workspace/target/checkout/AssertionManagerGui-ejb/target/apidocs/net/ihe/gazelle/AssertionManager/assertion/link/package-summary.html...
[INFO] Generating /home/jenkins/.hudson/jobs/AssertionManager-Gui-SNAPSHOT/workspace/target/checkout/AssertionManagerGui-ejb/target/apidocs/net/ihe/gazelle/AssertionManager/assertion/link/package-tree.html...
[INFO] Generating /home/jenkins/.hudson/jobs/AssertionManager-Gui-SNAPSHOT/workspace/target/checkout/AssertionManagerGui-ejb/target/apidocs/net/ihe/gazelle/AssertionManager/assertion/link/appliesTo/package-frame.html...
[INFO] Generating /home/jenkins/.hudson/jobs/AssertionManager-Gui-SNAPSHOT/workspace/target/checkout/AssertionManagerGui-ejb/target/apidocs/net/ihe/gazelle/AssertionManager/assertion/link/appliesTo/package-summary.html...
[INFO] Generating /home/jenkins/.hudson/jobs/AssertionManager-Gui-SNAPSHOT/workspace/target/checkout/AssertionManagerGui-ejb/target/apidocs/net/ihe/gazelle/AssertionManager/assertion/link/appliesTo/package-tree.html...
[INFO] Generating /home/jenkins/.hudson/jobs/AssertionManager-Gui-SNAPSHOT/workspace/target/checkout/AssertionManagerGui-ejb/target/apidocs/net/ihe/gazelle/AssertionManager/assertion/link/coverage/package-frame.html...
[INFO] Generating /home/jenkins/.hudson/jobs/AssertionManager-Gui-SNAPSHOT/workspace/target/checkout/AssertionManagerGui-ejb/target/apidocs/net/ihe/gazelle/AssertionManager/assertion/link/coverage/package-summary.html...
[INFO] Generating /home/jenkins/.hudson/jobs/AssertionManager-Gui-SNAPSHOT/workspace/target/checkout/AssertionManagerGui-ejb/target/apidocs/net/ihe/gazelle/AssertionManager/assertion/link/coverage/package-tree.html...
[INFO] Generating /home/jenkins/.hudson/jobs/AssertionManager-Gui-SNAPSHOT/workspace/target/checkout/AssertionManagerGui-ejb/target/apidocs/net/ihe/gazelle/AssertionManager/assertion/pdf/package-frame.html...
[INFO] Generating /home/jenkins/.hudson/jobs/AssertionManager-Gui-SNAPSHOT/workspace/target/checkout/AssertionManagerGui-ejb/target/apidocs/net/ihe/gazelle/AssertionManager/assertion/pdf/package-summary.html...
[INFO] Generating /home/jenkins/.hudson/jobs/AssertionManager-Gui-SNAPSHOT/workspace/target/checkout/AssertionManagerGui-ejb/target/apidocs/net/ihe/gazelle/AssertionManager/assertion/pdf/package-tree.html...
[INFO] Generating /home/jenkins/.hudson/jobs/AssertionManager-Gui-SNAPSHOT/workspace/target/checkout/AssertionManagerGui-ejb/target/apidocs/net/ihe/gazelle/AssertionManager/assertion/ws/package-frame.html...
[INFO] Generating /home/jenkins/.hudson/jobs/AssertionManager-Gui-SNAPSHOT/workspace/target/checkout/AssertionManagerGui-ejb/target/apidocs/net/ihe/gazelle/AssertionManager/assertion/ws/package-summary.html...
[INFO] Generating /home/jenkins/.hudson/jobs/AssertionManager-Gui-SNAPSHOT/workspace/target/checkout/AssertionManagerGui-ejb/target/apidocs/net/ihe/gazelle/AssertionManager/assertion/ws/package-tree.html...
[INFO] Generating /home/jenkins/.hudson/jobs/AssertionManager-Gui-SNAPSHOT/workspace/target/checkout/AssertionManagerGui-ejb/target/apidocs/net/ihe/gazelle/AssertionManager/assertion/ws/api/package-frame.html...
[INFO] Generating /home/jenkins/.hudson/jobs/AssertionManager-Gui-SNAPSHOT/workspace/target/checkout/AssertionManagerGui-ejb/target/apidocs/net/ihe/gazelle/AssertionManager/assertion/ws/api/package-summary.html...
[INFO] Generating /home/jenkins/.hudson/jobs/AssertionManager-Gui-SNAPSHOT/workspace/target/checkout/AssertionManagerGui-ejb/target/apidocs/net/ihe/gazelle/AssertionManager/assertion/ws/api/package-tree.html...
[INFO] Generating /home/jenkins/.hudson/jobs/AssertionManager-Gui-SNAPSHOT/workspace/target/checkout/AssertionManagerGui-ejb/target/apidocs/net/ihe/gazelle/AssertionManager/assertion/xml/response/package-frame.html...
[INFO] Generating /home/jenkins/.hudson/jobs/AssertionManager-Gui-SNAPSHOT/workspace/target/checkout/AssertionManagerGui-ejb/target/apidocs/net/ihe/gazelle/AssertionManager/assertion/xml/response/package-summary.html...
[INFO] Generating /home/jenkins/.hudson/jobs/AssertionManager-Gui-SNAPSHOT/workspace/target/checkout/AssertionManagerGui-ejb/target/apidocs/net/ihe/gazelle/AssertionManager/assertion/xml/response/package-tree.html...
[INFO] Generating /home/jenkins/.hudson/jobs/AssertionManager-Gui-SNAPSHOT/workspace/target/checkout/AssertionManagerGui-ejb/target/apidocs/net/ihe/gazelle/AssertionManager/cache/package-frame.html...
[INFO] Generating /home/jenkins/.hudson/jobs/AssertionManager-Gui-SNAPSHOT/workspace/target/checkout/AssertionManagerGui-ejb/target/apidocs/net/ihe/gazelle/AssertionManager/cache/package-summary.html...
[INFO] Generating /home/jenkins/.hudson/jobs/AssertionManager-Gui-SNAPSHOT/workspace/target/checkout/AssertionManagerGui-ejb/target/apidocs/net/ihe/gazelle/AssertionManager/cache/package-tree.html...
[INFO] Generating /home/jenkins/.hudson/jobs/AssertionManager-Gui-SNAPSHOT/workspace/target/checkout/AssertionManagerGui-ejb/target/apidocs/net/ihe/gazelle/AssertionManager/document/package-frame.html...
[INFO] Generating /home/jenkins/.hudson/jobs/AssertionManager-Gui-SNAPSHOT/workspace/target/checkout/AssertionManagerGui-ejb/target/apidocs/net/ihe/gazelle/AssertionManager/document/package-summary.html...
[INFO] Generating /home/jenkins/.hudson/jobs/AssertionManager-Gui-SNAPSHOT/workspace/target/checkout/AssertionManagerGui-ejb/target/apidocs/net/ihe/gazelle/AssertionManager/document/package-tree.html...
[INFO] Generating /home/jenkins/.hudson/jobs/AssertionManager-Gui-SNAPSHOT/workspace/target/checkout/AssertionManagerGui-ejb/target/apidocs/net/ihe/gazelle/AssertionManager/idScheme/package-frame.html...
[INFO] Generating /home/jenkins/.hudson/jobs/AssertionManager-Gui-SNAPSHOT/workspace/target/checkout/AssertionManagerGui-ejb/target/apidocs/net/ihe/gazelle/AssertionManager/idScheme/package-summary.html...
[INFO] Generating /home/jenkins/.hudson/jobs/AssertionManager-Gui-SNAPSHOT/workspace/target/checkout/AssertionManagerGui-ejb/target/apidocs/net/ihe/gazelle/AssertionManager/idScheme/package-tree.html...
[INFO] Generating /home/jenkins/.hudson/jobs/AssertionManager-Gui-SNAPSHOT/workspace/target/checkout/AssertionManagerGui-ejb/target/apidocs/net/ihe/gazelle/AssertionManager/mbv/package-frame.html...
[INFO] Generating /home/jenkins/.hudson/jobs/AssertionManager-Gui-SNAPSHOT/workspace/target/checkout/AssertionManagerGui-ejb/target/apidocs/net/ihe/gazelle/AssertionManager/mbv/package-summary.html...
[INFO] Generating /home/jenkins/.hudson/jobs/AssertionManager-Gui-SNAPSHOT/workspace/target/checkout/AssertionManagerGui-ejb/target/apidocs/net/ihe/gazelle/AssertionManager/mbv/package-tree.html...
[INFO] Generating /home/jenkins/.hudson/jobs/AssertionManager-Gui-SNAPSHOT/workspace/target/checkout/AssertionManagerGui-ejb/target/apidocs/net/ihe/gazelle/AssertionManager/scope/package-frame.html...
[INFO] Generating /home/jenkins/.hudson/jobs/AssertionManager-Gui-SNAPSHOT/workspace/target/checkout/AssertionManagerGui-ejb/target/apidocs/net/ihe/gazelle/AssertionManager/scope/package-summary.html...
[INFO] Generating /home/jenkins/.hudson/jobs/AssertionManager-Gui-SNAPSHOT/workspace/target/checkout/AssertionManagerGui-ejb/target/apidocs/net/ihe/gazelle/AssertionManager/scope/package-tree.html...
[INFO] Generating /home/jenkins/.hudson/jobs/AssertionManager-Gui-SNAPSHOT/workspace/target/checkout/AssertionManagerGui-ejb/target/apidocs/net/ihe/gazelle/AssertionManager/utils/package-frame.html...
[INFO] Generating /home/jenkins/.hudson/jobs/AssertionManager-Gui-SNAPSHOT/workspace/target/checkout/AssertionManagerGui-ejb/target/apidocs/net/ihe/gazelle/AssertionManager/utils/package-summary.html...
[INFO] Generating /home/jenkins/.hudson/jobs/AssertionManager-Gui-SNAPSHOT/workspace/target/checkout/AssertionManagerGui-ejb/target/apidocs/net/ihe/gazelle/AssertionManager/utils/package-tree.html...
[INFO] Generating /home/jenkins/.hudson/jobs/AssertionManager-Gui-SNAPSHOT/workspace/target/checkout/AssertionManagerGui-ejb/target/apidocs/net/ihe/gazelle/AssertionManager/validator/package-frame.html...
[INFO] Generating /home/jenkins/.hudson/jobs/AssertionManager-Gui-SNAPSHOT/workspace/target/checkout/AssertionManagerGui-ejb/target/apidocs/net/ihe/gazelle/AssertionManager/validator/package-summary.html...
[INFO] Generating /home/jenkins/.hudson/jobs/AssertionManager-Gui-SNAPSHOT/workspace/target/checkout/AssertionManagerGui-ejb/target/apidocs/net/ihe/gazelle/AssertionManager/validator/package-tree.html...
[INFO] Generating /home/jenkins/.hudson/jobs/AssertionManager-Gui-SNAPSHOT/workspace/target/checkout/AssertionManagerGui-ejb/target/apidocs/net/ihe/gazelle/AssertionManager/ws/wrapper/package-frame.html...
[INFO] Generating /home/jenkins/.hudson/jobs/AssertionManager-Gui-SNAPSHOT/workspace/target/checkout/AssertionManagerGui-ejb/target/apidocs/net/ihe/gazelle/AssertionManager/ws/wrapper/package-summary.html...
[INFO] Generating /home/jenkins/.hudson/jobs/AssertionManager-Gui-SNAPSHOT/workspace/target/checkout/AssertionManagerGui-ejb/target/apidocs/net/ihe/gazelle/AssertionManager/ws/wrapper/package-tree.html...
[INFO] Generating /home/jenkins/.hudson/jobs/AssertionManager-Gui-SNAPSHOT/workspace/target/checkout/AssertionManagerGui-ejb/target/apidocs/constant-values.html...
[INFO] Generating /home/jenkins/.hudson/jobs/AssertionManager-Gui-SNAPSHOT/workspace/target/checkout/AssertionManagerGui-ejb/target/apidocs/serialized-form.html...
[INFO] Generating /home/jenkins/.hudson/jobs/AssertionManager-Gui-SNAPSHOT/workspace/target/checkout/AssertionManagerGui-ejb/target/apidocs/net/ihe/gazelle/AssertionManager/scope/class-use/AssertionScopeManager.html...
[INFO] Generating /home/jenkins/.hudson/jobs/AssertionManager-Gui-SNAPSHOT/workspace/target/checkout/AssertionManagerGui-ejb/target/apidocs/net/ihe/gazelle/AssertionManager/scope/class-use/ScopeCoverage.html...
[INFO] Generating /home/jenkins/.hudson/jobs/AssertionManager-Gui-SNAPSHOT/workspace/target/checkout/AssertionManagerGui-ejb/target/apidocs/net/ihe/gazelle/AssertionManager/scope/class-use/OasisTestAssertionConverter.html...
[INFO] Generating /home/jenkins/.hudson/jobs/AssertionManager-Gui-SNAPSHOT/workspace/target/checkout/AssertionManagerGui-ejb/target/apidocs/net/ihe/gazelle/AssertionManager/scope/class-use/AssertionScopeConverter.html...
[INFO] Generating /home/jenkins/.hudson/jobs/AssertionManager-Gui-SNAPSHOT/workspace/target/checkout/AssertionManagerGui-ejb/target/apidocs/net/ihe/gazelle/AssertionManager/scope/class-use/AssertionScopeFilter.html...
[INFO] Generating /home/jenkins/.hudson/jobs/AssertionManager-Gui-SNAPSHOT/workspace/target/checkout/AssertionManagerGui-ejb/target/apidocs/net/ihe/gazelle/AssertionManager/scope/class-use/AssertionScopeManagerLocal.html...
[INFO] Generating /home/jenkins/.hudson/jobs/AssertionManager-Gui-SNAPSHOT/workspace/target/checkout/AssertionManagerGui-ejb/target/apidocs/net/ihe/gazelle/AssertionManager/validator/class-use/UriValidator.html...
[INFO] Generating /home/jenkins/.hudson/jobs/AssertionManager-Gui-SNAPSHOT/workspace/target/checkout/AssertionManagerGui-ejb/target/apidocs/net/ihe/gazelle/AssertionManager/utils/class-use/PreferencesManagerLocal.html...
[INFO] Generating /home/jenkins/.hudson/jobs/AssertionManager-Gui-SNAPSHOT/workspace/target/checkout/AssertionManagerGui-ejb/target/apidocs/net/ihe/gazelle/AssertionManager/utils/class-use/PreferencesManager.html...
[INFO] Generating /home/jenkins/.hudson/jobs/AssertionManager-Gui-SNAPSHOT/workspace/target/checkout/AssertionManagerGui-ejb/target/apidocs/net/ihe/gazelle/AssertionManager/utils/class-use/UrlHelper.html...
[INFO] Generating /home/jenkins/.hudson/jobs/AssertionManager-Gui-SNAPSHOT/workspace/target/checkout/AssertionManagerGui-ejb/target/apidocs/net/ihe/gazelle/AssertionManager/utils/class-use/AssertionManagerGuiPreferencesProvider.html...
[INFO] Generating /home/jenkins/.hudson/jobs/AssertionManager-Gui-SNAPSHOT/workspace/target/checkout/AssertionManagerGui-ejb/target/apidocs/net/ihe/gazelle/AssertionManager/document/class-use/DocumentFilter.html...
[INFO] Generating /home/jenkins/.hudson/jobs/AssertionManager-Gui-SNAPSHOT/workspace/target/checkout/AssertionManagerGui-ejb/target/apidocs/net/ihe/gazelle/AssertionManager/document/class-use/DocumentManager.html...
[INFO] Generating /home/jenkins/.hudson/jobs/AssertionManager-Gui-SNAPSHOT/workspace/target/checkout/AssertionManagerGui-ejb/target/apidocs/net/ihe/gazelle/AssertionManager/cache/class-use/FileCache.html...
[INFO] Generating /home/jenkins/.hudson/jobs/AssertionManager-Gui-SNAPSHOT/workspace/target/checkout/AssertionManagerGui-ejb/target/apidocs/net/ihe/gazelle/AssertionManager/ws/wrapper/class-use/TmWsClient.html...
[INFO] Generating /home/jenkins/.hudson/jobs/AssertionManager-Gui-SNAPSHOT/workspace/target/checkout/AssertionManagerGui-ejb/target/apidocs/net/ihe/gazelle/AssertionManager/idScheme/class-use/AssertionImporter.html...
[INFO] Generating /home/jenkins/.hudson/jobs/AssertionManager-Gui-SNAPSHOT/workspace/target/checkout/AssertionManagerGui-ejb/target/apidocs/net/ihe/gazelle/AssertionManager/idScheme/class-use/AssertionImporterLocal.html...
[INFO] Generating /home/jenkins/.hudson/jobs/AssertionManager-Gui-SNAPSHOT/workspace/target/checkout/AssertionManagerGui-ejb/target/apidocs/net/ihe/gazelle/AssertionManager/idScheme/class-use/IdSchemesCoverage.html...
[INFO] Generating /home/jenkins/.hudson/jobs/AssertionManager-Gui-SNAPSHOT/workspace/target/checkout/AssertionManagerGui-ejb/target/apidocs/net/ihe/gazelle/AssertionManager/idScheme/class-use/IdSchemesManager.html...
[INFO] Generating /home/jenkins/.hudson/jobs/AssertionManager-Gui-SNAPSHOT/workspace/target/checkout/AssertionManagerGui-ejb/target/apidocs/net/ihe/gazelle/AssertionManager/idScheme/class-use/IdSchemesManagerLocal.html...
[INFO] Generating /home/jenkins/.hudson/jobs/AssertionManager-Gui-SNAPSHOT/workspace/target/checkout/AssertionManagerGui-ejb/target/apidocs/net/ihe/gazelle/AssertionManager/idScheme/class-use/OasisTestAssertionCoverageQueryHelper.html...
[INFO] Generating /home/jenkins/.hudson/jobs/AssertionManager-Gui-SNAPSHOT/workspace/target/checkout/AssertionManagerGui-ejb/target/apidocs/net/ihe/gazelle/AssertionManager/idScheme/class-use/IdSchemesFilter.html...
[INFO] Generating /home/jenkins/.hudson/jobs/AssertionManager-Gui-SNAPSHOT/workspace/target/checkout/AssertionManagerGui-ejb/target/apidocs/net/ihe/gazelle/AssertionManager/idScheme/class-use/UploadManager.html...
[INFO] Generating /home/jenkins/.hudson/jobs/AssertionManager-Gui-SNAPSHOT/workspace/target/checkout/AssertionManagerGui-ejb/target/apidocs/net/ihe/gazelle/AssertionManager/idScheme/class-use/UploadManagerLocal.html...
[INFO] Generating /home/jenkins/.hudson/jobs/AssertionManager-Gui-SNAPSHOT/workspace/target/checkout/AssertionManagerGui-ejb/target/apidocs/net/ihe/gazelle/AssertionManager/mbv/class-use/MbvServiceRefresher.html...
[INFO] Generating /home/jenkins/.hudson/jobs/AssertionManager-Gui-SNAPSHOT/workspace/target/checkout/AssertionManagerGui-ejb/target/apidocs/net/ihe/gazelle/AssertionManager/mbv/class-use/MbvServiceManagerLocal.html...
[INFO] Generating /home/jenkins/.hudson/jobs/AssertionManager-Gui-SNAPSHOT/workspace/target/checkout/AssertionManagerGui-ejb/target/apidocs/net/ihe/gazelle/AssertionManager/mbv/class-use/MbvServiceRefresherLocal.html...
[INFO] Generating /home/jenkins/.hudson/jobs/AssertionManager-Gui-SNAPSHOT/workspace/target/checkout/AssertionManagerGui-ejb/target/apidocs/net/ihe/gazelle/AssertionManager/mbv/class-use/MbvServiceManager.html...
[INFO] Generating /home/jenkins/.hudson/jobs/AssertionManager-Gui-SNAPSHOT/workspace/target/checkout/AssertionManagerGui-ejb/target/apidocs/net/ihe/gazelle/AssertionManager/assertion/class-use/OasisTargetConverter.html...
[INFO] Generating /home/jenkins/.hudson/jobs/AssertionManager-Gui-SNAPSHOT/workspace/target/checkout/AssertionManagerGui-ejb/target/apidocs/net/ihe/gazelle/AssertionManager/assertion/class-use/AssertionManagerLocal.html...
[INFO] Generating /home/jenkins/.hudson/jobs/AssertionManager-Gui-SNAPSHOT/workspace/target/checkout/AssertionManagerGui-ejb/target/apidocs/net/ihe/gazelle/AssertionManager/assertion/class-use/AssertionManager.html...
[INFO] Generating /home/jenkins/.hudson/jobs/AssertionManager-Gui-SNAPSHOT/workspace/target/checkout/AssertionManagerGui-ejb/target/apidocs/net/ihe/gazelle/AssertionManager/assertion/class-use/AssertionIdGenerator.html...
[INFO] Generating /home/jenkins/.hudson/jobs/AssertionManager-Gui-SNAPSHOT/workspace/target/checkout/AssertionManagerGui-ejb/target/apidocs/net/ihe/gazelle/AssertionManager/assertion/class-use/OasisTestAssertionFilter.html...
[INFO] Generating /home/jenkins/.hudson/jobs/AssertionManager-Gui-SNAPSHOT/workspace/target/checkout/AssertionManagerGui-ejb/target/apidocs/net/ihe/gazelle/AssertionManager/assertion/class-use/CheckBoxesFilter.html...
[INFO] Generating /home/jenkins/.hudson/jobs/AssertionManager-Gui-SNAPSHOT/workspace/target/checkout/AssertionManagerGui-ejb/target/apidocs/net/ihe/gazelle/AssertionManager/assertion/xml/response/class-use/IdSchemeResponse.html...
[INFO] Generating /home/jenkins/.hudson/jobs/AssertionManager-Gui-SNAPSHOT/workspace/target/checkout/AssertionManagerGui-ejb/target/apidocs/net/ihe/gazelle/AssertionManager/assertion/xml/response/class-use/DocumentResponse.html...
[INFO] Generating /home/jenkins/.hudson/jobs/AssertionManager-Gui-SNAPSHOT/workspace/target/checkout/AssertionManagerGui-ejb/target/apidocs/net/ihe/gazelle/AssertionManager/assertion/xml/response/class-use/DocumentSectionResponse.html...
[INFO] Generating /home/jenkins/.hudson/jobs/AssertionManager-Gui-SNAPSHOT/workspace/target/checkout/AssertionManagerGui-ejb/target/apidocs/net/ihe/gazelle/AssertionManager/assertion/xml/response/class-use/JaxbString.html...
[INFO] Generating /home/jenkins/.hudson/jobs/AssertionManager-Gui-SNAPSHOT/workspace/target/checkout/AssertionManagerGui-ejb/target/apidocs/net/ihe/gazelle/AssertionManager/assertion/pdf/class-use/DocumentClient.html...
[INFO] Generating /home/jenkins/.hudson/jobs/AssertionManager-Gui-SNAPSHOT/workspace/target/checkout/AssertionManagerGui-ejb/target/apidocs/net/ihe/gazelle/AssertionManager/assertion/pdf/class-use/OpenPDFDocument.html...
[INFO] Generating /home/jenkins/.hudson/jobs/AssertionManager-Gui-SNAPSHOT/workspace/target/checkout/AssertionManagerGui-ejb/target/apidocs/net/ihe/gazelle/AssertionManager/assertion/ws/class-use/OasisTestAssertionWrapper.html...
[INFO] Generating /home/jenkins/.hudson/jobs/AssertionManager-Gui-SNAPSHOT/workspace/target/checkout/AssertionManagerGui-ejb/target/apidocs/net/ihe/gazelle/AssertionManager/assertion/ws/class-use/TestAssertionRequest.html...
[INFO] Generating /home/jenkins/.hudson/jobs/AssertionManager-Gui-SNAPSHOT/workspace/target/checkout/AssertionManagerGui-ejb/target/apidocs/net/ihe/gazelle/AssertionManager/assertion/ws/class-use/Common.html...
[INFO] Generating /home/jenkins/.hudson/jobs/AssertionManager-Gui-SNAPSHOT/workspace/target/checkout/AssertionManagerGui-ejb/target/apidocs/net/ihe/gazelle/AssertionManager/assertion/ws/class-use/TestAssertion.html...
[INFO] Generating /home/jenkins/.hudson/jobs/AssertionManager-Gui-SNAPSHOT/workspace/target/checkout/AssertionManagerGui-ejb/target/apidocs/net/ihe/gazelle/AssertionManager/assertion/ws/class-use/Parameters.html...
[INFO] Generating /home/jenkins/.hudson/jobs/AssertionManager-Gui-SNAPSHOT/workspace/target/checkout/AssertionManagerGui-ejb/target/apidocs/net/ihe/gazelle/AssertionManager/assertion/ws/api/class-use/TestAssertionApi.html...
[INFO] Generating /home/jenkins/.hudson/jobs/AssertionManager-Gui-SNAPSHOT/workspace/target/checkout/AssertionManagerGui-ejb/target/apidocs/net/ihe/gazelle/AssertionManager/assertion/link/appliesTo/class-use/AppliesToIntegrationProfileManagerLocal.html...
[INFO] Generating /home/jenkins/.hudson/jobs/AssertionManager-Gui-SNAPSHOT/workspace/target/checkout/AssertionManagerGui-ejb/target/apidocs/net/ihe/gazelle/AssertionManager/assertion/link/appliesTo/class-use/AppliesToTransactionManager.html...
[INFO] Generating /home/jenkins/.hudson/jobs/AssertionManager-Gui-SNAPSHOT/workspace/target/checkout/AssertionManagerGui-ejb/target/apidocs/net/ihe/gazelle/AssertionManager/assertion/link/appliesTo/class-use/AppliesToAipoManagerLocal.html...
[INFO] Generating /home/jenkins/.hudson/jobs/AssertionManager-Gui-SNAPSHOT/workspace/target/checkout/AssertionManagerGui-ejb/target/apidocs/net/ihe/gazelle/AssertionManager/assertion/link/appliesTo/class-use/AppliesToActorManagerLocal.html...
[INFO] Generating /home/jenkins/.hudson/jobs/AssertionManager-Gui-SNAPSHOT/workspace/target/checkout/AssertionManagerGui-ejb/target/apidocs/net/ihe/gazelle/AssertionManager/assertion/link/appliesTo/class-use/AppliesToAipoManager.html...
[INFO] Generating /home/jenkins/.hudson/jobs/AssertionManager-Gui-SNAPSHOT/workspace/target/checkout/AssertionManagerGui-ejb/target/apidocs/net/ihe/gazelle/AssertionManager/assertion/link/appliesTo/class-use/AppliesToIntegrationProfileManager.html...
[INFO] Generating /home/jenkins/.hudson/jobs/AssertionManager-Gui-SNAPSHOT/workspace/target/checkout/AssertionManagerGui-ejb/target/apidocs/net/ihe/gazelle/AssertionManager/assertion/link/appliesTo/class-use/AppliesToAuditMessageManager.html...
[INFO] Generating /home/jenkins/.hudson/jobs/AssertionManager-Gui-SNAPSHOT/workspace/target/checkout/AssertionManagerGui-ejb/target/apidocs/net/ihe/gazelle/AssertionManager/assertion/link/appliesTo/class-use/AppliesToAuditMessageManagerLocal.html...
[INFO] Generating /home/jenkins/.hudson/jobs/AssertionManager-Gui-SNAPSHOT/workspace/target/checkout/AssertionManagerGui-ejb/target/apidocs/net/ihe/gazelle/AssertionManager/assertion/link/appliesTo/class-use/AppliesToStandardManagerLocal.html...
[INFO] Generating /home/jenkins/.hudson/jobs/AssertionManager-Gui-SNAPSHOT/workspace/target/checkout/AssertionManagerGui-ejb/target/apidocs/net/ihe/gazelle/AssertionManager/assertion/link/appliesTo/class-use/AppliesToActorManager.html...
[INFO] Generating /home/jenkins/.hudson/jobs/AssertionManager-Gui-SNAPSHOT/workspace/target/checkout/AssertionManagerGui-ejb/target/apidocs/net/ihe/gazelle/AssertionManager/assertion/link/appliesTo/class-use/AppliesToTransactionManagerLocal.html...
[INFO] Generating /home/jenkins/.hudson/jobs/AssertionManager-Gui-SNAPSHOT/workspace/target/checkout/AssertionManagerGui-ejb/target/apidocs/net/ihe/gazelle/AssertionManager/assertion/link/appliesTo/class-use/AppliesToStandardManager.html...
[INFO] Generating /home/jenkins/.hudson/jobs/AssertionManager-Gui-SNAPSHOT/workspace/target/checkout/AssertionManagerGui-ejb/target/apidocs/net/ihe/gazelle/AssertionManager/assertion/link/class-use/AssertionLinkManager.html...
[INFO] Generating /home/jenkins/.hudson/jobs/AssertionManager-Gui-SNAPSHOT/workspace/target/checkout/AssertionManagerGui-ejb/target/apidocs/net/ihe/gazelle/AssertionManager/assertion/link/class-use/AssertionLinkManagerLocal.html...
[INFO] Generating /home/jenkins/.hudson/jobs/AssertionManager-Gui-SNAPSHOT/workspace/target/checkout/AssertionManagerGui-ejb/target/apidocs/net/ihe/gazelle/AssertionManager/assertion/link/coverage/class-use/TestStepLinkManager.html...
[INFO] Generating /home/jenkins/.hudson/jobs/AssertionManager-Gui-SNAPSHOT/workspace/target/checkout/AssertionManagerGui-ejb/target/apidocs/net/ihe/gazelle/AssertionManager/assertion/link/coverage/class-use/TestLinkManager.html...
[INFO] Generating /home/jenkins/.hudson/jobs/AssertionManager-Gui-SNAPSHOT/workspace/target/checkout/AssertionManagerGui-ejb/target/apidocs/net/ihe/gazelle/AssertionManager/assertion/link/coverage/class-use/TestStepLinkManagerLocal.html...
[INFO] Generating /home/jenkins/.hudson/jobs/AssertionManager-Gui-SNAPSHOT/workspace/target/checkout/AssertionManagerGui-ejb/target/apidocs/net/ihe/gazelle/AssertionManager/assertion/link/coverage/class-use/TestLinkRefresherLocal.html...
[INFO] Generating /home/jenkins/.hudson/jobs/AssertionManager-Gui-SNAPSHOT/workspace/target/checkout/AssertionManagerGui-ejb/target/apidocs/net/ihe/gazelle/AssertionManager/assertion/link/coverage/class-use/RuleLinkManagerLocal.html...
[INFO] Generating /home/jenkins/.hudson/jobs/AssertionManager-Gui-SNAPSHOT/workspace/target/checkout/AssertionManagerGui-ejb/target/apidocs/net/ihe/gazelle/AssertionManager/assertion/link/coverage/class-use/RuleFilteringBean.html...
[INFO] Generating /home/jenkins/.hudson/jobs/AssertionManager-Gui-SNAPSHOT/workspace/target/checkout/AssertionManagerGui-ejb/target/apidocs/net/ihe/gazelle/AssertionManager/assertion/link/coverage/class-use/TestLinkRefresher.html...
[INFO] Generating /home/jenkins/.hudson/jobs/AssertionManager-Gui-SNAPSHOT/workspace/target/checkout/AssertionManagerGui-ejb/target/apidocs/net/ihe/gazelle/AssertionManager/assertion/link/coverage/class-use/TestLinkManagerLocal.html...
[INFO] Generating /home/jenkins/.hudson/jobs/AssertionManager-Gui-SNAPSHOT/workspace/target/checkout/AssertionManagerGui-ejb/target/apidocs/net/ihe/gazelle/AssertionManager/assertion/link/coverage/class-use/RuleLinkManager.html...
[INFO] Generating /home/jenkins/.hudson/jobs/AssertionManager-Gui-SNAPSHOT/workspace/target/checkout/AssertionManagerGui-ejb/target/apidocs/net/ihe/gazelle/AssertionManager/assertion/package-use.html...
[INFO] Generating /home/jenkins/.hudson/jobs/AssertionManager-Gui-SNAPSHOT/workspace/target/checkout/AssertionManagerGui-ejb/target/apidocs/net/ihe/gazelle/AssertionManager/assertion/link/package-use.html...
[INFO] Generating /home/jenkins/.hudson/jobs/AssertionManager-Gui-SNAPSHOT/workspace/target/checkout/AssertionManagerGui-ejb/target/apidocs/net/ihe/gazelle/AssertionManager/assertion/link/appliesTo/package-use.html...
[INFO] Generating /home/jenkins/.hudson/jobs/AssertionManager-Gui-SNAPSHOT/workspace/target/checkout/AssertionManagerGui-ejb/target/apidocs/net/ihe/gazelle/AssertionManager/assertion/link/coverage/package-use.html...
[INFO] Generating /home/jenkins/.hudson/jobs/AssertionManager-Gui-SNAPSHOT/workspace/target/checkout/AssertionManagerGui-ejb/target/apidocs/net/ihe/gazelle/AssertionManager/assertion/pdf/package-use.html...
[INFO] Generating /home/jenkins/.hudson/jobs/AssertionManager-Gui-SNAPSHOT/workspace/target/checkout/AssertionManagerGui-ejb/target/apidocs/net/ihe/gazelle/AssertionManager/assertion/ws/package-use.html...
[INFO] Generating /home/jenkins/.hudson/jobs/AssertionManager-Gui-SNAPSHOT/workspace/target/checkout/AssertionManagerGui-ejb/target/apidocs/net/ihe/gazelle/AssertionManager/assertion/ws/api/package-use.html...
[INFO] Generating /home/jenkins/.hudson/jobs/AssertionManager-Gui-SNAPSHOT/workspace/target/checkout/AssertionManagerGui-ejb/target/apidocs/net/ihe/gazelle/AssertionManager/assertion/xml/response/package-use.html...
[INFO] Generating /home/jenkins/.hudson/jobs/AssertionManager-Gui-SNAPSHOT/workspace/target/checkout/AssertionManagerGui-ejb/target/apidocs/net/ihe/gazelle/AssertionManager/cache/package-use.html...
[INFO] Generating /home/jenkins/.hudson/jobs/AssertionManager-Gui-SNAPSHOT/workspace/target/checkout/AssertionManagerGui-ejb/target/apidocs/net/ihe/gazelle/AssertionManager/document/package-use.html...
[INFO] Generating /home/jenkins/.hudson/jobs/AssertionManager-Gui-SNAPSHOT/workspace/target/checkout/AssertionManagerGui-ejb/target/apidocs/net/ihe/gazelle/AssertionManager/idScheme/package-use.html...
[INFO] Generating /home/jenkins/.hudson/jobs/AssertionManager-Gui-SNAPSHOT/workspace/target/checkout/AssertionManagerGui-ejb/target/apidocs/net/ihe/gazelle/AssertionManager/mbv/package-use.html...
[INFO] Generating /home/jenkins/.hudson/jobs/AssertionManager-Gui-SNAPSHOT/workspace/target/checkout/AssertionManagerGui-ejb/target/apidocs/net/ihe/gazelle/AssertionManager/scope/package-use.html...
[INFO] Generating /home/jenkins/.hudson/jobs/AssertionManager-Gui-SNAPSHOT/workspace/target/checkout/AssertionManagerGui-ejb/target/apidocs/net/ihe/gazelle/AssertionManager/utils/package-use.html...
[INFO] Generating /home/jenkins/.hudson/jobs/AssertionManager-Gui-SNAPSHOT/workspace/target/checkout/AssertionManagerGui-ejb/target/apidocs/net/ihe/gazelle/AssertionManager/validator/package-use.html...
[INFO] Generating /home/jenkins/.hudson/jobs/AssertionManager-Gui-SNAPSHOT/workspace/target/checkout/AssertionManagerGui-ejb/target/apidocs/net/ihe/gazelle/AssertionManager/ws/wrapper/package-use.html...
[INFO] Building index for all the packages and classes...
[INFO] Generating /home/jenkins/.hudson/jobs/AssertionManager-Gui-SNAPSHOT/workspace/target/checkout/AssertionManagerGui-ejb/target/apidocs/overview-tree.html...
[INFO] Generating /home/jenkins/.hudson/jobs/AssertionManager-Gui-SNAPSHOT/workspace/target/checkout/AssertionManagerGui-ejb/target/apidocs/index-all.html...
[INFO] Generating /home/jenkins/.hudson/jobs/AssertionManager-Gui-SNAPSHOT/workspace/target/checkout/AssertionManagerGui-ejb/target/apidocs/deprecated-list.html...
[INFO] Building index for all classes...
[INFO] Generating /home/jenkins/.hudson/jobs/AssertionManager-Gui-SNAPSHOT/workspace/target/checkout/AssertionManagerGui-ejb/target/apidocs/allclasses-frame.html...
[INFO] Generating /home/jenkins/.hudson/jobs/AssertionManager-Gui-SNAPSHOT/workspace/target/checkout/AssertionManagerGui-ejb/target/apidocs/allclasses-noframe.html...
[INFO] Generating /home/jenkins/.hudson/jobs/AssertionManager-Gui-SNAPSHOT/workspace/target/checkout/AssertionManagerGui-ejb/target/apidocs/index.html...
[INFO] Generating /home/jenkins/.hudson/jobs/AssertionManager-Gui-SNAPSHOT/workspace/target/checkout/AssertionManagerGui-ejb/target/apidocs/overview-summary.html...
[INFO] Generating /home/jenkins/.hudson/jobs/AssertionManager-Gui-SNAPSHOT/workspace/target/checkout/AssertionManagerGui-ejb/target/apidocs/help-doc.html...
[INFO] 42 warnings
[INFO] [WARNING] Javadoc Warnings
[INFO] [WARNING] /home/jenkins/.hudson/jobs/AssertionManager-Gui-SNAPSHOT/workspace/target/checkout/AssertionManagerGui-ejb/src/main/java/net/ihe/gazelle/AssertionManager/validator/UriValidator.java:27: warning - Tag @see:illegal character: "45" in "jean-francois.labbe@ihe-europe.net - http://gazelle.ihe.net"
[INFO] [WARNING] /home/jenkins/.hudson/jobs/AssertionManager-Gui-SNAPSHOT/workspace/target/checkout/AssertionManagerGui-ejb/src/main/java/net/ihe/gazelle/AssertionManager/validator/UriValidator.java:27: warning - Tag @see:illegal character: "64" in "jean-francois.labbe@ihe-europe.net - http://gazelle.ihe.net"
[INFO] [WARNING] /home/jenkins/.hudson/jobs/AssertionManager-Gui-SNAPSHOT/workspace/target/checkout/AssertionManagerGui-ejb/src/main/java/net/ihe/gazelle/AssertionManager/validator/UriValidator.java:27: warning - Tag @see:illegal character: "45" in "jean-francois.labbe@ihe-europe.net - http://gazelle.ihe.net"
[INFO] [WARNING] /home/jenkins/.hudson/jobs/AssertionManager-Gui-SNAPSHOT/workspace/target/checkout/AssertionManagerGui-ejb/src/main/java/net/ihe/gazelle/AssertionManager/document/DocumentFilter.java:25: warning - Tag @see:illegal character: "45" in "jean-francois.labbe@ihe-europe.net - http://gazelle.ihe.net"
[INFO] [WARNING] /home/jenkins/.hudson/jobs/AssertionManager-Gui-SNAPSHOT/workspace/target/checkout/AssertionManagerGui-ejb/src/main/java/net/ihe/gazelle/AssertionManager/document/DocumentFilter.java:25: warning - Tag @see:illegal character: "64" in "jean-francois.labbe@ihe-europe.net - http://gazelle.ihe.net"
[INFO] [WARNING] /home/jenkins/.hudson/jobs/AssertionManager-Gui-SNAPSHOT/workspace/target/checkout/AssertionManagerGui-ejb/src/main/java/net/ihe/gazelle/AssertionManager/document/DocumentFilter.java:25: warning - Tag @see:illegal character: "45" in "jean-francois.labbe@ihe-europe.net - http://gazelle.ihe.net"
[INFO] [WARNING] /home/jenkins/.hudson/jobs/AssertionManager-Gui-SNAPSHOT/workspace/target/checkout/AssertionManagerGui-ejb/src/main/java/net/ihe/gazelle/AssertionManager/document/DocumentManager.java:32: warning - Tag @see:illegal character: "45" in "jean-francois.labbe@ihe-europe.net - http://gazelle.ihe.net"
[INFO] [WARNING] /home/jenkins/.hudson/jobs/AssertionManager-Gui-SNAPSHOT/workspace/target/checkout/AssertionManagerGui-ejb/src/main/java/net/ihe/gazelle/AssertionManager/document/DocumentManager.java:32: warning - Tag @see:illegal character: "64" in "jean-francois.labbe@ihe-europe.net - http://gazelle.ihe.net"
[INFO] [WARNING] /home/jenkins/.hudson/jobs/AssertionManager-Gui-SNAPSHOT/workspace/target/checkout/AssertionManagerGui-ejb/src/main/java/net/ihe/gazelle/AssertionManager/document/DocumentManager.java:32: warning - Tag @see:illegal character: "45" in "jean-francois.labbe@ihe-europe.net - http://gazelle.ihe.net"
[INFO] [WARNING] /home/jenkins/.hudson/jobs/AssertionManager-Gui-SNAPSHOT/workspace/target/checkout/AssertionManagerGui-ejb/src/main/java/net/ihe/gazelle/AssertionManager/cache/FileCache.java:19: warning - Tag @see:illegal character: "45" in "jean-francois.labbe@ihe-europe.net - http://gazelle.ihe.net"
[INFO] [WARNING] /home/jenkins/.hudson/jobs/AssertionManager-Gui-SNAPSHOT/workspace/target/checkout/AssertionManagerGui-ejb/src/main/java/net/ihe/gazelle/AssertionManager/cache/FileCache.java:19: warning - Tag @see:illegal character: "64" in "jean-francois.labbe@ihe-europe.net - http://gazelle.ihe.net"
[INFO] [WARNING] /home/jenkins/.hudson/jobs/AssertionManager-Gui-SNAPSHOT/workspace/target/checkout/AssertionManagerGui-ejb/src/main/java/net/ihe/gazelle/AssertionManager/cache/FileCache.java:19: warning - Tag @see:illegal character: "45" in "jean-francois.labbe@ihe-europe.net - http://gazelle.ihe.net"
[INFO] [WARNING] /home/jenkins/.hudson/jobs/AssertionManager-Gui-SNAPSHOT/workspace/target/checkout/AssertionManagerGui-ejb/src/main/java/net/ihe/gazelle/AssertionManager/idScheme/AssertionImporter.java:42: warning - Tag @see:illegal character: "45" in "jean-francois.labbe@ihe-europe.net - http://gazelle.ihe.net"
[INFO] [WARNING] /home/jenkins/.hudson/jobs/AssertionManager-Gui-SNAPSHOT/workspace/target/checkout/AssertionManagerGui-ejb/src/main/java/net/ihe/gazelle/AssertionManager/idScheme/AssertionImporter.java:42: warning - Tag @see:illegal character: "64" in "jean-francois.labbe@ihe-europe.net - http://gazelle.ihe.net"
[INFO] [WARNING] /home/jenkins/.hudson/jobs/AssertionManager-Gui-SNAPSHOT/workspace/target/checkout/AssertionManagerGui-ejb/src/main/java/net/ihe/gazelle/AssertionManager/idScheme/AssertionImporter.java:42: warning - Tag @see:illegal character: "45" in "jean-francois.labbe@ihe-europe.net - http://gazelle.ihe.net"
[INFO] [WARNING] /home/jenkins/.hudson/jobs/AssertionManager-Gui-SNAPSHOT/workspace/target/checkout/AssertionManagerGui-ejb/src/main/java/net/ihe/gazelle/AssertionManager/idScheme/OasisTestAssertionCoverageQueryHelper.java:22: warning - Tag @see:illegal character: "45" in "jean-francois.labbe@ihe-europe.net - http://gazelle.ihe.net"
[INFO] [WARNING] /home/jenkins/.hudson/jobs/AssertionManager-Gui-SNAPSHOT/workspace/target/checkout/AssertionManagerGui-ejb/src/main/java/net/ihe/gazelle/AssertionManager/idScheme/OasisTestAssertionCoverageQueryHelper.java:22: warning - Tag @see:illegal character: "64" in "jean-francois.labbe@ihe-europe.net - http://gazelle.ihe.net"
[INFO] [WARNING] /home/jenkins/.hudson/jobs/AssertionManager-Gui-SNAPSHOT/workspace/target/checkout/AssertionManagerGui-ejb/src/main/java/net/ihe/gazelle/AssertionManager/idScheme/OasisTestAssertionCoverageQueryHelper.java:22: warning - Tag @see:illegal character: "45" in "jean-francois.labbe@ihe-europe.net - http://gazelle.ihe.net"
[INFO] [WARNING] /home/jenkins/.hudson/jobs/AssertionManager-Gui-SNAPSHOT/workspace/target/checkout/AssertionManagerGui-ejb/src/main/java/net/ihe/gazelle/AssertionManager/assertion/AssertionIdGenerator.java:15: warning - Tag @see:illegal character: "45" in "jean-francois.labbe@ihe-europe.net - http://gazelle.ihe.net"
[INFO] [WARNING] /home/jenkins/.hudson/jobs/AssertionManager-Gui-SNAPSHOT/workspace/target/checkout/AssertionManagerGui-ejb/src/main/java/net/ihe/gazelle/AssertionManager/assertion/AssertionIdGenerator.java:15: warning - Tag @see:illegal character: "64" in "jean-francois.labbe@ihe-europe.net - http://gazelle.ihe.net"
[INFO] [WARNING] /home/jenkins/.hudson/jobs/AssertionManager-Gui-SNAPSHOT/workspace/target/checkout/AssertionManagerGui-ejb/src/main/java/net/ihe/gazelle/AssertionManager/assertion/AssertionIdGenerator.java:15: warning - Tag @see:illegal character: "45" in "jean-francois.labbe@ihe-europe.net - http://gazelle.ihe.net"
[INFO] [WARNING] /home/jenkins/.hudson/jobs/AssertionManager-Gui-SNAPSHOT/workspace/target/checkout/AssertionManagerGui-ejb/src/main/java/net/ihe/gazelle/AssertionManager/validator/UriValidator.java:27: warning - @class is an unknown tag.
[INFO] [WARNING] /home/jenkins/.hudson/jobs/AssertionManager-Gui-SNAPSHOT/workspace/target/checkout/AssertionManagerGui-ejb/src/main/java/net/ihe/gazelle/AssertionManager/validator/UriValidator.java:27: warning - @package is an unknown tag.
[INFO] [WARNING] /home/jenkins/.hudson/jobs/AssertionManager-Gui-SNAPSHOT/workspace/target/checkout/AssertionManagerGui-ejb/src/main/java/net/ihe/gazelle/AssertionManager/validator/UriValidator.java:27: warning - Tag @see: reference not found: jean-francois.labbe@ihe-europe.net - http://gazelle.ihe.net
[INFO] [WARNING] /home/jenkins/.hudson/jobs/AssertionManager-Gui-SNAPSHOT/workspace/target/checkout/AssertionManagerGui-ejb/src/main/java/net/ihe/gazelle/AssertionManager/document/DocumentFilter.java:25: warning - @class is an unknown tag.
[INFO] [WARNING] /home/jenkins/.hudson/jobs/AssertionManager-Gui-SNAPSHOT/workspace/target/checkout/AssertionManagerGui-ejb/src/main/java/net/ihe/gazelle/AssertionManager/document/DocumentFilter.java:25: warning - @package is an unknown tag.
[INFO] [WARNING] /home/jenkins/.hudson/jobs/AssertionManager-Gui-SNAPSHOT/workspace/target/checkout/AssertionManagerGui-ejb/src/main/java/net/ihe/gazelle/AssertionManager/document/DocumentFilter.java:25: warning - Tag @see: reference not found: jean-francois.labbe@ihe-europe.net - http://gazelle.ihe.net
[INFO] [WARNING] /home/jenkins/.hudson/jobs/AssertionManager-Gui-SNAPSHOT/workspace/target/checkout/AssertionManagerGui-ejb/src/main/java/net/ihe/gazelle/AssertionManager/document/DocumentManager.java:32: warning - @class is an unknown tag.
[INFO] [WARNING] /home/jenkins/.hudson/jobs/AssertionManager-Gui-SNAPSHOT/workspace/target/checkout/AssertionManagerGui-ejb/src/main/java/net/ihe/gazelle/AssertionManager/document/DocumentManager.java:32: warning - @package is an unknown tag.
[INFO] [WARNING] /home/jenkins/.hudson/jobs/AssertionManager-Gui-SNAPSHOT/workspace/target/checkout/AssertionManagerGui-ejb/src/main/java/net/ihe/gazelle/AssertionManager/document/DocumentManager.java:32: warning - Tag @see: reference not found: jean-francois.labbe@ihe-europe.net - http://gazelle.ihe.net
[INFO] [WARNING] /home/jenkins/.hudson/jobs/AssertionManager-Gui-SNAPSHOT/workspace/target/checkout/AssertionManagerGui-ejb/src/main/java/net/ihe/gazelle/AssertionManager/cache/FileCache.java:19: warning - @class is an unknown tag.
[INFO] [WARNING] /home/jenkins/.hudson/jobs/AssertionManager-Gui-SNAPSHOT/workspace/target/checkout/AssertionManagerGui-ejb/src/main/java/net/ihe/gazelle/AssertionManager/cache/FileCache.java:19: warning - @package is an unknown tag.
[INFO] [WARNING] /home/jenkins/.hudson/jobs/AssertionManager-Gui-SNAPSHOT/workspace/target/checkout/AssertionManagerGui-ejb/src/main/java/net/ihe/gazelle/AssertionManager/cache/FileCache.java:19: warning - Tag @see: reference not found: jean-francois.labbe@ihe-europe.net - http://gazelle.ihe.net
[INFO] [WARNING] /home/jenkins/.hudson/jobs/AssertionManager-Gui-SNAPSHOT/workspace/target/checkout/AssertionManagerGui-ejb/src/main/java/net/ihe/gazelle/AssertionManager/idScheme/AssertionImporter.java:42: warning - @class is an unknown tag.
[INFO] [WARNING] /home/jenkins/.hudson/jobs/AssertionManager-Gui-SNAPSHOT/workspace/target/checkout/AssertionManagerGui-ejb/src/main/java/net/ihe/gazelle/AssertionManager/idScheme/AssertionImporter.java:42: warning - @package is an unknown tag.
[INFO] [WARNING] /home/jenkins/.hudson/jobs/AssertionManager-Gui-SNAPSHOT/workspace/target/checkout/AssertionManagerGui-ejb/src/main/java/net/ihe/gazelle/AssertionManager/idScheme/AssertionImporter.java:42: warning - Tag @see: reference not found: jean-francois.labbe@ihe-europe.net - http://gazelle.ihe.net
[INFO] [WARNING] /home/jenkins/.hudson/jobs/AssertionManager-Gui-SNAPSHOT/workspace/target/checkout/AssertionManagerGui-ejb/src/main/java/net/ihe/gazelle/AssertionManager/idScheme/OasisTestAssertionCoverageQueryHelper.java:22: warning - @class is an unknown tag.
[INFO] [WARNING] /home/jenkins/.hudson/jobs/AssertionManager-Gui-SNAPSHOT/workspace/target/checkout/AssertionManagerGui-ejb/src/main/java/net/ihe/gazelle/AssertionManager/idScheme/OasisTestAssertionCoverageQueryHelper.java:22: warning - @package is an unknown tag.
[INFO] [WARNING] /home/jenkins/.hudson/jobs/AssertionManager-Gui-SNAPSHOT/workspace/target/checkout/AssertionManagerGui-ejb/src/main/java/net/ihe/gazelle/AssertionManager/idScheme/OasisTestAssertionCoverageQueryHelper.java:22: warning - Tag @see: reference not found: jean-francois.labbe@ihe-europe.net - http://gazelle.ihe.net
[INFO] [WARNING] /home/jenkins/.hudson/jobs/AssertionManager-Gui-SNAPSHOT/workspace/target/checkout/AssertionManagerGui-ejb/src/main/java/net/ihe/gazelle/AssertionManager/assertion/AssertionIdGenerator.java:15: warning - @class is an unknown tag.
[INFO] [WARNING] /home/jenkins/.hudson/jobs/AssertionManager-Gui-SNAPSHOT/workspace/target/checkout/AssertionManagerGui-ejb/src/main/java/net/ihe/gazelle/AssertionManager/assertion/AssertionIdGenerator.java:15: warning - @package is an unknown tag.
[INFO] [WARNING] /home/jenkins/.hudson/jobs/AssertionManager-Gui-SNAPSHOT/workspace/target/checkout/AssertionManagerGui-ejb/src/main/java/net/ihe/gazelle/AssertionManager/assertion/AssertionIdGenerator.java:15: warning - Tag @see: reference not found: jean-francois.labbe@ihe-europe.net - http://gazelle.ihe.net
[INFO] [INFO] Building jar: /home/jenkins/.hudson/jobs/AssertionManager-Gui-SNAPSHOT/workspace/target/checkout/AssertionManagerGui-ejb/target/AssertionManagerGui-ejb-javadoc.jar
[INFO] [INFO] 
[INFO] [INFO] --- maven-jar-plugin:2.4:test-jar (default) @ AssertionManagerGui-ejb ---
[INFO] [INFO] Building jar: /home/jenkins/.hudson/jobs/AssertionManager-Gui-SNAPSHOT/workspace/target/checkout/AssertionManagerGui-ejb/target/AssertionManagerGui-ejb-tests.jar
[INFO] [INFO] 
[INFO] [INFO] --- maven-install-plugin:2.4:install (default-install) @ AssertionManagerGui-ejb ---
[INFO] [INFO] Installing /home/jenkins/.hudson/jobs/AssertionManager-Gui-SNAPSHOT/workspace/target/checkout/AssertionManagerGui-ejb/target/AssertionManagerGui-ejb.jar to /home/jenkins/.m2/repository/net/ihe/gazelle/AssertionManagerGui-ejb/4.0.1/AssertionManagerGui-ejb-4.0.1.jar
[INFO] [INFO] Installing /home/jenkins/.hudson/jobs/AssertionManager-Gui-SNAPSHOT/workspace/target/checkout/AssertionManagerGui-ejb/pom.xml to /home/jenkins/.m2/repository/net/ihe/gazelle/AssertionManagerGui-ejb/4.0.1/AssertionManagerGui-ejb-4.0.1.pom
[INFO] [INFO] Installing /home/jenkins/.hudson/jobs/AssertionManager-Gui-SNAPSHOT/workspace/target/checkout/AssertionManagerGui-ejb/target/AssertionManagerGui-ejb-sources.jar to /home/jenkins/.m2/repository/net/ihe/gazelle/AssertionManagerGui-ejb/4.0.1/AssertionManagerGui-ejb-4.0.1-sources.jar
[INFO] [INFO] Installing /home/jenkins/.hudson/jobs/AssertionManager-Gui-SNAPSHOT/workspace/target/checkout/AssertionManagerGui-ejb/target/AssertionManagerGui-ejb-javadoc.jar to /home/jenkins/.m2/repository/net/ihe/gazelle/AssertionManagerGui-ejb/4.0.1/AssertionManagerGui-ejb-4.0.1-javadoc.jar
[INFO] [INFO] Installing /home/jenkins/.hudson/jobs/AssertionManager-Gui-SNAPSHOT/workspace/target/checkout/AssertionManagerGui-ejb/target/AssertionManagerGui-ejb-tests.jar to /home/jenkins/.m2/repository/net/ihe/gazelle/AssertionManagerGui-ejb/4.0.1/AssertionManagerGui-ejb-4.0.1-tests.jar
[INFO] [INFO] 
[INFO] [INFO] --- maven-deploy-plugin:2.7:deploy (default-deploy) @ AssertionManagerGui-ejb ---
[INFO] [INFO] Uploading: https://gazelle.ihe.net/nexus/content/repositories/releases/net/ihe/gazelle/AssertionManagerGui-ejb/4.0.1/AssertionManagerGui-ejb-4.0.1.jar
[INFO] [INFO] Uploaded: https://gazelle.ihe.net/nexus/content/repositories/releases/net/ihe/gazelle/AssertionManagerGui-ejb/4.0.1/AssertionManagerGui-ejb-4.0.1.jar (169 KB at 122.9 KB/sec)
[INFO] [INFO] Uploading: https://gazelle.ihe.net/nexus/content/repositories/releases/net/ihe/gazelle/AssertionManagerGui-ejb/4.0.1/AssertionManagerGui-ejb-4.0.1.pom
[INFO] [INFO] Uploaded: https://gazelle.ihe.net/nexus/content/repositories/releases/net/ihe/gazelle/AssertionManagerGui-ejb/4.0.1/AssertionManagerGui-ejb-4.0.1.pom (10 KB at 7.5 KB/sec)
[INFO] [INFO] Downloading: https://gazelle.ihe.net/nexus/content/repositories/releases/net/ihe/gazelle/AssertionManagerGui-ejb/maven-metadata.xml
[INFO] [INFO] Downloaded: https://gazelle.ihe.net/nexus/content/repositories/releases/net/ihe/gazelle/AssertionManagerGui-ejb/maven-metadata.xml (2 KB at 1.7 KB/sec)
[INFO] [INFO] Uploading: https://gazelle.ihe.net/nexus/content/repositories/releases/net/ihe/gazelle/AssertionManagerGui-ejb/maven-metadata.xml
[INFO] [INFO] Uploaded: https://gazelle.ihe.net/nexus/content/repositories/releases/net/ihe/gazelle/AssertionManagerGui-ejb/maven-metadata.xml (2 KB at 1.0 KB/sec)
[INFO] [INFO] Uploading: https://gazelle.ihe.net/nexus/content/repositories/releases/net/ihe/gazelle/AssertionManagerGui-ejb/4.0.1/AssertionManagerGui-ejb-4.0.1-sources.jar
[INFO] [INFO] Uploaded: https://gazelle.ihe.net/nexus/content/repositories/releases/net/ihe/gazelle/AssertionManagerGui-ejb/4.0.1/AssertionManagerGui-ejb-4.0.1-sources.jar (87 KB at 59.3 KB/sec)
[INFO] [INFO] Uploading: https://gazelle.ihe.net/nexus/content/repositories/releases/net/ihe/gazelle/AssertionManagerGui-ejb/4.0.1/AssertionManagerGui-ejb-4.0.1-javadoc.jar
[INFO] [INFO] Uploaded: https://gazelle.ihe.net/nexus/content/repositories/releases/net/ihe/gazelle/AssertionManagerGui-ejb/4.0.1/AssertionManagerGui-ejb-4.0.1-javadoc.jar (527 KB at 388.4 KB/sec)
[INFO] [INFO] Uploading: https://gazelle.ihe.net/nexus/content/repositories/releases/net/ihe/gazelle/AssertionManagerGui-ejb/4.0.1/AssertionManagerGui-ejb-4.0.1-tests.jar
[INFO] [INFO] Uploaded: https://gazelle.ihe.net/nexus/content/repositories/releases/net/ihe/gazelle/AssertionManagerGui-ejb/4.0.1/AssertionManagerGui-ejb-4.0.1-tests.jar (18 KB at 14.5 KB/sec)
[INFO] [INFO]                                                                         
[INFO] [INFO] ------------------------------------------------------------------------
[INFO] [INFO] Building AssertionManagerGui-WAR 4.0.1
[INFO] [INFO] ------------------------------------------------------------------------
[INFO] [INFO] 
[INFO] [INFO] --- maven-enforcer-plugin:1.2:enforce (enforce-java-version) @ AssertionManagerGui-war ---
[INFO] [INFO] 
[INFO] [INFO] --- maven-enforcer-plugin:1.2:enforce (enforce-maven-version) @ AssertionManagerGui-war ---
[INFO] [INFO] 
[INFO] [INFO] --- buildnumber-maven-plugin:1.2:create-timestamp (get-build-timestamp) @ AssertionManagerGui-war ---
[INFO] [INFO] 
[INFO] [INFO] --- buildnumber-maven-plugin:1.2:create (get-scm-revision) @ AssertionManagerGui-war ---
[INFO] [INFO] 
[INFO] [INFO] --- maven-buildmetadata-plugin:1.1.0.IHE.3:provide-buildmetadata (default) @ AssertionManagerGui-war ---
[INFO] [INFO] Executing: /bin/sh -c cd /home/jenkins/.hudson/jobs/AssertionManager-Gui-SNAPSHOT/workspace/target/checkout/AssertionManagerGui-war && svn --non-interactive log -v -r '{2016-09-04 07:28:23 +0000}:{2016-10-05 07:28:23 +0000}' svn+ssh://scm.gforge.inria.fr/svn/gazelle/Maven/gazelle-assertion-gui/tags/AssertionManagerGui-4.0.1/AssertionManagerGui-war
[INFO] [INFO] Working directory: /home/jenkins/.hudson/jobs/AssertionManager-Gui-SNAPSHOT/workspace/target/checkout/AssertionManagerGui-war
[INFO] [INFO] Executing: /bin/sh -c cd /home/jenkins/.hudson/jobs/AssertionManager-Gui-SNAPSHOT/workspace/target/checkout/AssertionManagerGui-war && svn --non-interactive status
[INFO] [INFO] Working directory: /home/jenkins/.hudson/jobs/AssertionManager-Gui-SNAPSHOT/workspace/target/checkout/AssertionManagerGui-war
[INFO] [INFO] Writing properties '/home/jenkins/.hudson/jobs/AssertionManager-Gui-SNAPSHOT/workspace/target/checkout/AssertionManagerGui-war/target/AssertionManagerGui-war/META-INF/build.properties'...
[INFO] [INFO] Writing XML report '/home/jenkins/.hudson/jobs/AssertionManager-Gui-SNAPSHOT/workspace/target/checkout/AssertionManagerGui-war/target/buildmetadata.xml'...
[INFO] [INFO] 
[INFO] [INFO] --- gazelle-plugins:1.54:generate-messages (build-messages-from-xml) @ AssertionManagerGui-war ---
[INFO] [INFO] Skipped, using crowdin as messages.mode
[INFO] [INFO] 
[INFO] [INFO] --- gazelle-plugins:1.54:aggregate-messages (aggregate-messages) @ AssertionManagerGui-war ---
[INFO] [INFO] Using crowdin as messages.mode
[INFO] [info] Aggregating all message properties from dependencies
[INFO] [info] Aggregate properties for lang en
[INFO] [info] Adding /home/jenkins/.hudson/jobs/AssertionManager-Gui-SNAPSHOT/workspace/target/checkout/AssertionManagerGui-war/src/main/crowdin/en/net.ihe.gazelle.maven.gazelle-seam-tools-war/gazelle-seam-tools.properties
[INFO] [info] Adding /home/jenkins/.hudson/jobs/AssertionManager-Gui-SNAPSHOT/workspace/target/checkout/AssertionManagerGui-war/src/main/crowdin/en/net.ihe.gazelle.simulators.simulator-common-war/simulator-common-war.properties
[INFO] [info] Adding /home/jenkins/.hudson/jobs/AssertionManager-Gui-SNAPSHOT/workspace/target/checkout/AssertionManagerGui-war/src/main/crowdin/en/net.ihe.gazelle.AssertionManagerGui-war/AssertionManagerGui.properties
[INFO] [info] Adding /home/jenkins/.hudson/jobs/AssertionManager-Gui-SNAPSHOT/workspace/target/checkout/AssertionManagerGui-war/src/main/crowdin/en/net.ihe.gazelle.gazelle-assets/assets.properties
[INFO] [info] Aggregate properties for lang sv-SE
[INFO] [info] Adding /home/jenkins/.hudson/jobs/AssertionManager-Gui-SNAPSHOT/workspace/target/checkout/AssertionManagerGui-war/src/main/crowdin/sv-SE/net.ihe.gazelle.maven.gazelle-seam-tools-war/gazelle-seam-tools.properties
[INFO] [info] Adding /home/jenkins/.hudson/jobs/AssertionManager-Gui-SNAPSHOT/workspace/target/checkout/AssertionManagerGui-war/src/main/crowdin/sv-SE/net.ihe.gazelle.simulators.simulator-common-war/simulator-common-war.properties
[INFO] [info] Adding /home/jenkins/.hudson/jobs/AssertionManager-Gui-SNAPSHOT/workspace/target/checkout/AssertionManagerGui-war/src/main/crowdin/sv-SE/net.ihe.gazelle.AssertionManagerGui-war/AssertionManagerGui.properties
[INFO] [info] Adding /home/jenkins/.hudson/jobs/AssertionManager-Gui-SNAPSHOT/workspace/target/checkout/AssertionManagerGui-war/src/main/crowdin/sv-SE/net.ihe.gazelle.gazelle-assets/assets.properties
[INFO] [info] Aggregate properties for lang fr
[INFO] [info] Adding /home/jenkins/.hudson/jobs/AssertionManager-Gui-SNAPSHOT/workspace/target/checkout/AssertionManagerGui-war/src/main/crowdin/fr/net.ihe.gazelle.maven.gazelle-seam-tools-war/gazelle-seam-tools.properties
[INFO] [info] Adding /home/jenkins/.hudson/jobs/AssertionManager-Gui-SNAPSHOT/workspace/target/checkout/AssertionManagerGui-war/src/main/crowdin/fr/net.ihe.gazelle.simulators.simulator-common-war/simulator-common-war.properties
[INFO] [info] Adding /home/jenkins/.hudson/jobs/AssertionManager-Gui-SNAPSHOT/workspace/target/checkout/AssertionManagerGui-war/src/main/crowdin/fr/net.ihe.gazelle.AssertionManagerGui-war/AssertionManagerGui.properties
[INFO] [info] Adding /home/jenkins/.hudson/jobs/AssertionManager-Gui-SNAPSHOT/workspace/target/checkout/AssertionManagerGui-war/src/main/crowdin/fr/net.ihe.gazelle.gazelle-assets/assets.properties
[INFO] [info] Aggregate properties for lang fi
[INFO] [info] Adding /home/jenkins/.hudson/jobs/AssertionManager-Gui-SNAPSHOT/workspace/target/checkout/AssertionManagerGui-war/src/main/crowdin/fi/net.ihe.gazelle.maven.gazelle-seam-tools-war/gazelle-seam-tools.properties
[INFO] [info] Adding /home/jenkins/.hudson/jobs/AssertionManager-Gui-SNAPSHOT/workspace/target/checkout/AssertionManagerGui-war/src/main/crowdin/fi/net.ihe.gazelle.simulators.simulator-common-war/simulator-common-war.properties
[INFO] [info] Adding /home/jenkins/.hudson/jobs/AssertionManager-Gui-SNAPSHOT/workspace/target/checkout/AssertionManagerGui-war/src/main/crowdin/fi/net.ihe.gazelle.AssertionManagerGui-war/AssertionManagerGui.properties
[INFO] [info] Adding /home/jenkins/.hudson/jobs/AssertionManager-Gui-SNAPSHOT/workspace/target/checkout/AssertionManagerGui-war/src/main/crowdin/fi/net.ihe.gazelle.gazelle-assets/assets.properties
[INFO] [info] Aggregate properties for lang ja
[INFO] [info] Adding /home/jenkins/.hudson/jobs/AssertionManager-Gui-SNAPSHOT/workspace/target/checkout/AssertionManagerGui-war/src/main/crowdin/ja/net.ihe.gazelle.maven.gazelle-seam-tools-war/gazelle-seam-tools.properties
[INFO] [info] Adding /home/jenkins/.hudson/jobs/AssertionManager-Gui-SNAPSHOT/workspace/target/checkout/AssertionManagerGui-war/src/main/crowdin/ja/net.ihe.gazelle.simulators.simulator-common-war/simulator-common-war.properties
[INFO] [info] Adding /home/jenkins/.hudson/jobs/AssertionManager-Gui-SNAPSHOT/workspace/target/checkout/AssertionManagerGui-war/src/main/crowdin/ja/net.ihe.gazelle.AssertionManagerGui-war/AssertionManagerGui.properties
[INFO] [info] Adding /home/jenkins/.hudson/jobs/AssertionManager-Gui-SNAPSHOT/workspace/target/checkout/AssertionManagerGui-war/src/main/crowdin/ja/net.ihe.gazelle.gazelle-assets/assets.properties
[INFO] [info] Aggregate properties for lang zh-TW
[INFO] [info] Adding /home/jenkins/.hudson/jobs/AssertionManager-Gui-SNAPSHOT/workspace/target/checkout/AssertionManagerGui-war/src/main/crowdin/zh-TW/net.ihe.gazelle.maven.gazelle-seam-tools-war/gazelle-seam-tools.properties
[INFO] [info] Adding /home/jenkins/.hudson/jobs/AssertionManager-Gui-SNAPSHOT/workspace/target/checkout/AssertionManagerGui-war/src/main/crowdin/zh-TW/net.ihe.gazelle.simulators.simulator-common-war/simulator-common-war.properties
[INFO] [info] Adding /home/jenkins/.hudson/jobs/AssertionManager-Gui-SNAPSHOT/workspace/target/checkout/AssertionManagerGui-war/src/main/crowdin/zh-TW/net.ihe.gazelle.AssertionManagerGui-war/AssertionManagerGui.properties
[INFO] [info] Adding /home/jenkins/.hudson/jobs/AssertionManager-Gui-SNAPSHOT/workspace/target/checkout/AssertionManagerGui-war/src/main/crowdin/zh-TW/net.ihe.gazelle.gazelle-assets/assets.properties
[INFO] [info] Aggregate properties for lang es-ES
[INFO] [info] Adding /home/jenkins/.hudson/jobs/AssertionManager-Gui-SNAPSHOT/workspace/target/checkout/AssertionManagerGui-war/src/main/crowdin/es-ES/net.ihe.gazelle.maven.gazelle-seam-tools-war/gazelle-seam-tools.properties
[INFO] [info] Adding /home/jenkins/.hudson/jobs/AssertionManager-Gui-SNAPSHOT/workspace/target/checkout/AssertionManagerGui-war/src/main/crowdin/es-ES/net.ihe.gazelle.simulators.simulator-common-war/simulator-common-war.properties
[INFO] [info] Adding /home/jenkins/.hudson/jobs/AssertionManager-Gui-SNAPSHOT/workspace/target/checkout/AssertionManagerGui-war/src/main/crowdin/es-ES/net.ihe.gazelle.AssertionManagerGui-war/AssertionManagerGui.properties
[INFO] [info] Adding /home/jenkins/.hudson/jobs/AssertionManager-Gui-SNAPSHOT/workspace/target/checkout/AssertionManagerGui-war/src/main/crowdin/es-ES/net.ihe.gazelle.gazelle-assets/assets.properties
[INFO] [info] Aggregate properties for lang zh-CN
[INFO] [info] Adding /home/jenkins/.hudson/jobs/AssertionManager-Gui-SNAPSHOT/workspace/target/checkout/AssertionManagerGui-war/src/main/crowdin/zh-CN/net.ihe.gazelle.maven.gazelle-seam-tools-war/gazelle-seam-tools.properties
[INFO] [info] Adding /home/jenkins/.hudson/jobs/AssertionManager-Gui-SNAPSHOT/workspace/target/checkout/AssertionManagerGui-war/src/main/crowdin/zh-CN/net.ihe.gazelle.simulators.simulator-common-war/simulator-common-war.properties
[INFO] [info] Adding /home/jenkins/.hudson/jobs/AssertionManager-Gui-SNAPSHOT/workspace/target/checkout/AssertionManagerGui-war/src/main/crowdin/zh-CN/net.ihe.gazelle.AssertionManagerGui-war/AssertionManagerGui.properties
[INFO] [info] Adding /home/jenkins/.hudson/jobs/AssertionManager-Gui-SNAPSHOT/workspace/target/checkout/AssertionManagerGui-war/src/main/crowdin/zh-CN/net.ihe.gazelle.gazelle-assets/assets.properties
[INFO] [info] Aggregate properties for lang de
[INFO] [info] Adding /home/jenkins/.hudson/jobs/AssertionManager-Gui-SNAPSHOT/workspace/target/checkout/AssertionManagerGui-war/src/main/crowdin/de/net.ihe.gazelle.maven.gazelle-seam-tools-war/gazelle-seam-tools.properties
[INFO] [info] Adding /home/jenkins/.hudson/jobs/AssertionManager-Gui-SNAPSHOT/workspace/target/checkout/AssertionManagerGui-war/src/main/crowdin/de/net.ihe.gazelle.simulators.simulator-common-war/simulator-common-war.properties
[INFO] [info] Adding /home/jenkins/.hudson/jobs/AssertionManager-Gui-SNAPSHOT/workspace/target/checkout/AssertionManagerGui-war/src/main/crowdin/de/net.ihe.gazelle.AssertionManagerGui-war/AssertionManagerGui.properties
[INFO] [info] Adding /home/jenkins/.hudson/jobs/AssertionManager-Gui-SNAPSHOT/workspace/target/checkout/AssertionManagerGui-war/src/main/crowdin/de/net.ihe.gazelle.gazelle-assets/assets.properties
[INFO] [INFO] 
[INFO] [INFO] --- maven-resources-plugin:2.7:resources (default-resources) @ AssertionManagerGui-war ---
[INFO] [INFO] Using 'UTF-8' encoding to copy filtered resources.
[INFO] [INFO] skip non existing resourceDirectory /home/jenkins/.hudson/jobs/AssertionManager-Gui-SNAPSHOT/workspace/target/checkout/AssertionManagerGui-war/src/main/resources
[INFO] [INFO] Copying 9 resources
[INFO] [INFO] 
[INFO] [INFO] --- gazelle-plugins:1.54:check-xhtml-messages (check-translations-xml) @ AssertionManagerGui-war ---
[INFO] [INFO] Ignoring ui:param/f:param with name in [id, sectionToReRender, panelId, panelsToReRender, SuffixForID, panel2refresh, required, filterId, filterForm, divIdVar, dataListIdVar, editorIdVar, containerPanelId, varList, varTableId, varColor, tableName, onchange_callback, save_callback, convert_urls, theme_advanced_statusbar_location, theme_advanced_resizing, theme_advanced_toolbar_location, theme_advanced_toolbar_align, theme_advanced_buttons1, theme_advanced_buttons2, dataScrollerId, dataTableId, idToRerender, beanName, multiple, extensions, popup_id, panel_id, styleClass, headerStyleClass, bodyStyleClass, footerStyleClass, openByDefault, icon_class, dt_styleClass, dd_styleClass, dataScrollerId, mainDivId, position, idToRerender, beanName, extensions, multiple, dataTableId, formParam, callerPageParam, showActions, formId, idSuffix, selectedActorForConfigs, idSchemeIdToRefresh, tabId, pageName, hideRowsSelect]
[INFO] [INFO] Names can be added using ignoredParamNames in gazelle-plugins configuration. (see mvn gazelle:help -Ddetail=true -Dgoal=check-xhtml-messages)
[INFO] [WARNING] Missing translation in index.xhtml (line:17,col:114) attribute: value = documents found for this search
[INFO] [WARNING] Missing translation in index.xhtml (line:51,col:65) attribute: value = uri
[INFO] [WARNING] Missing translation in index.xhtml (line:62,col:66) attribute: value = name
[INFO] [WARNING] Missing translation in index.xhtml (line:73,col:72) attribute: value = revisionId
[INFO] [WARNING] Missing translation in index.xhtml (line:84,col:81) attribute: value = resource provenance
[INFO] [WARNING] Missing translation in index.xhtml (line:100,col:41) text = Unused document
[INFO] [WARNING] Missing translation in index.xhtml (line:115,col:45) text = Duplicated document
[INFO] [WARNING] Missing translation in index.xhtml (line:134,col:62) attribute: value = Add a document
[INFO] [WARNING] Missing translation in index.xhtml (line:146,col:13) text = Documents
[INFO] [WARNING] Missing translation in index.xhtml (line:154,col:25) text = id
[INFO] [WARNING] Missing translation in index.xhtml (line:160,col:25) text = name
[INFO] [WARNING] Missing translation in index.xhtml (line:166,col:25) text = url
[INFO] [WARNING] Missing translation in index.xhtml (line:186,col:25) text = documentId
[INFO] [WARNING] Missing translation in index.xhtml (line:192,col:25) text = revisionId
[INFO] [WARNING] Missing translation in index.xhtml (line:198,col:25) text = resource provenance
[INFO] [WARNING] Missing translation in index.xhtml (line:204,col:25) text = Links
[INFO] [WARNING] Missing translation in index.xhtml (line:206,col:61) attribute: title = view assertions
[INFO] [WARNING] Missing translation in index.xhtml (line:215,col:25) text = id schemes
[INFO] [WARNING] Missing translation in index.xhtml (line:219,col:69) attribute: title = view scheme
[INFO] [WARNING] Missing translation in index.xhtml (line:232,col:25) text = action
[INFO] [WARNING] Missing translation in index.xhtml (line:234,col:75) attribute: title = link document to idScheme
[INFO] [WARNING] Missing translation in index.xhtml (line:241,col:63) attribute: title = edit document
[INFO] [WARNING] Missing translation in index.xhtml (line:275,col:17) text = Confirm deletion of document
[INFO] [WARNING] Missing translation in link.xhtml (line:12,col:45) text = Cannot find document
[INFO] [WARNING] Missing translation in link.xhtml (line:15,col:49) attribute: value = Back
[INFO] [WARNING] Missing translation in link.xhtml (line:22,col:25) text = Link document to an idScheme
[INFO] [WARNING] Missing translation in edit.xhtml (line:13,col:45) text = Cannot find document
[INFO] [WARNING] Missing translation in edit.xhtml (line:16,col:49) attribute: value = Back
[INFO] [WARNING] Missing translation in edit.xhtml (line:23,col:67) attribute: value = Edit document
[INFO] [WARNING] Missing translation in edit.xhtml (line:25,col:66) attribute: value = New document
[INFO] [WARNING] Missing translation in edit.xhtml (line:33,col:61) text = Name
[INFO] [WARNING] Missing translation in edit.xhtml (line:39,col:60) text = Uri
[INFO] [WARNING] Missing translation in edit.xhtml (line:49,col:68) text = document id
[INFO] [WARNING] Missing translation in edit.xhtml (line:55,col:67) text = version id
[INFO] [WARNING] Missing translation in edit.xhtml (line:61,col:68) text = revision Id
[INFO] [WARNING] Missing translation in edit.xhtml (line:65,col:76) attribute: value = right
[INFO] [WARNING] Missing translation in edit.xhtml (line:66,col:74) attribute: value = click
[INFO] [WARNING] Missing translation in edit.xhtml (line:69,col:227) attribute: value = The revision format depends on the one written on the document. If the revision is expressed with a date please enter the date with the following format : MM/DD/YYYY
[INFO] [WARNING] Missing translation in edit.xhtml (line:77,col:78) text = resourceProvenance Id
[INFO] [WARNING] Missing translation in index.xhtml (line:15,col:82) text = Model based validation services
[INFO] [WARNING] Missing translation in index.xhtml (line:45,col:67) attribute: value = Never updated
[INFO] [WARNING] Missing translation in index.xhtml (line:146,col:57) text = Running updates (background)
[INFO] [WARNING] Missing translation in index.xhtml (line:151,col:61) text = Job
[INFO] [WARNING] Missing translation in index.xhtml (line:155,col:68) text = Start date
[INFO] [WARNING] Missing translation in index.xhtml (line:169,col:55) attribute: value = Synchronize all
[INFO] [WARNING] Missing translation in coverageStatus.xhtml (line:16,col:62) text = Missing idSchemes
[INFO] [WARNING] Missing translation in coverageStatus.xhtml (line:18,col:202) attribute: value = Mbv service references oasis idSchemes that are unknown
[INFO] [WARNING] Missing translation in coverageStatus.xhtml (line:26,col:64) attribute: title = Add Missing IdScheme
[INFO] [WARNING] Missing translation in coverageStatus.xhtml (line:46,col:74) attribute: title = Create missing assertion
[INFO] [WARNING] Missing translation in index.xhtml (line:91,col:63) attribute: value = Create IdScheme
[INFO] [WARNING] Missing translation in index.xhtml (line:106,col:74) text = Idscheme xml template
[INFO] [WARNING] Missing translation in index.xhtml (line:119,col:37) text = Upload logs
[INFO] [WARNING] Missing translation in index.xhtml (line:121,col:71) attribute: title = clear logs
[INFO] [WARNING] Missing translation in index.xhtml (line:145,col:65) attribute: title = view assertions
[INFO] [WARNING] Missing translation in index.xhtml (line:156,col:65) text = Description
[INFO] [WARNING] Missing translation in index.xhtml (line:174,col:66) text = Not Testable
[INFO] [WARNING] Missing translation in index.xhtml (line:176,col:67) attribute: title = Not testable assertions
[INFO] [WARNING] Missing translation in index.xhtml (line:223,col:29) text = Covered by tests
[INFO] [WARNING] Missing translation in index.xhtml (line:239,col:29) text = Covered by TF rules
[INFO] [WARNING] Missing translation in index.xhtml (line:290,col:52) attribute: title = View
[INFO] [WARNING] Missing translation in index.xhtml (line:296,col:52) attribute: title = Edit
[INFO] [WARNING] Missing translation in index.xhtml (line:321,col:62) attribute: title = document
[INFO] [WARNING] Missing translation in edit.xhtml (line:6,col:56) attribute: value = Edit IdScheme
[INFO] [WARNING] Missing translation in new.xhtml (line:6,col:58) attribute: value = Create IdScheme
[INFO] [WARNING] Missing translation in show.xhtml (line:12,col:68) text = View idScheme
[INFO] [WARNING] Missing translation in show.xhtml (line:16,col:69) attribute: title = view assertions
[INFO] [WARNING] Missing translation in show.xhtml (line:77,col:49) text = Covered by tests
[INFO] [WARNING] Missing translation in show.xhtml (line:92,col:52) text = Covered by TF rules
[INFO] [WARNING] Missing translation in index.xhtml (line:91,col:66) text = Not Testable
[INFO] [WARNING] Missing translation in index.xhtml (line:93,col:67) attribute: title = Not testable assertions
[INFO] [WARNING] Missing translation in _footer.xhtml (line:16,col:52) attribute: value = true
[INFO] [WARNING] Missing translation in _menu.xhtml (line:39,col:45) attribute: value = Documents
[INFO] [WARNING] Missing translation in _clearFileCache.xhtml (line:5,col:47) attribute: value = Clear file cache
[INFO] [WARNING] Missing translation in index.xhtml (line:112,col:76) attribute: value = Prescription level
[INFO] [WARNING] Missing translation in index.xhtml (line:153,col:66) attribute: value = Testable
[INFO] [WARNING] Missing translation in index.xhtml (line:299,col:62) attribute: value = Rule
[INFO] [WARNING] Missing translation in index.xhtml (line:310,col:63) attribute: value = Tests
[INFO] [WARNING] Missing translation in index.xhtml (line:336,col:71) attribute: value = Update deprecated coverage
[INFO] [WARNING] Missing translation in index.xhtml (line:347,col:66) attribute: value = Review filtered assertions
[INFO] [WARNING] Missing translation in index.xhtml (line:401,col:55) text = Testable
[INFO] [WARNING] Missing translation in index.xhtml (line:405,col:70) attribute: value = line-height: 2
[INFO] [WARNING] Missing translation in index.xhtml (line:490,col:66) attribute: title = View resource attached
[INFO] [WARNING] Missing translation in transaction.xhtml (line:147,col:29) text = Assertions
[INFO] [WARNING] Missing translation in transaction.xhtml (line:186,col:78) attribute: value = transactionsForm
[INFO] [WARNING] Missing translation in standard.xhtml (line:145,col:29) text = Assertions
[INFO] [WARNING] Missing translation in standard.xhtml (line:184,col:75) attribute: value = standardsForm
[INFO] [WARNING] Missing translation in aipo.xhtml (line:192,col:33) text = Assertions
[INFO] [WARNING] Missing translation in aipo.xhtml (line:231,col:75) attribute: value = aiposForm
[INFO] [WARNING] Missing translation in actor.xhtml (line:58,col:100) attribute: value = filtered actors
[INFO] [WARNING] Missing translation in actor.xhtml (line:156,col:29) text = Assertions
[INFO] [WARNING] Missing translation in actor.xhtml (line:195,col:72) attribute: value = actorsForm
[INFO] [WARNING] Missing translation in integrationProfile.xhtml (line:152,col:29) text = Assertions
[INFO] [WARNING] Missing translation in integrationProfile.xhtml (line:192,col:85) attribute: value = integrationProfilesForm
[INFO] [WARNING] Missing translation in auditMessage.xhtml (line:170,col:29) text = Assertions
[INFO] [WARNING] Missing translation in auditMessage.xhtml (line:209,col:79) attribute: value = auditMessagesFrom
[INFO] [WARNING] Missing translation in _linkAllPopup.xhtml (line:9,col:98) text = Are you sure you want to link all the selected assertions
[INFO] [WARNING] Missing translation in _linkAllPopup.xhtml (line:12,col:146) attribute: value = By clicking on yes
[INFO] [WARNING] Missing translation in _linkAllPopup.xhtml (line:12,col:146) attribute: value = assertions will be added. This operation can take some time
[INFO] [WARNING] Missing translation in _linkAllPopup.xhtml (line:15,col:42) attribute: value = Yes
[INFO] [WARNING] Missing translation in _linkAllPopup.xhtml (line:19,col:41) attribute: value = No
[INFO] [WARNING] Missing translation in _linkAllPopup.xhtml (line:27,col:100) text = Are you sure you want to unlink all the selected assertions
[INFO] [WARNING] Missing translation in _linkAllPopup.xhtml (line:30,col:145) attribute: value = By clicking on yes
[INFO] [WARNING] Missing translation in _linkAllPopup.xhtml (line:30,col:145) attribute: value = assertions will be deleted. This operation can take some time
[INFO] [WARNING] Missing translation in _linkAllPopup.xhtml (line:33,col:42) attribute: value = Yes
[INFO] [WARNING] Missing translation in _linkAllPopup.xhtml (line:37,col:41) attribute: value = No
[INFO] [WARNING] Missing translation in _testable_label.xhtml (line:6,col:38) attribute: value = Testable
[INFO] [WARNING] Missing translation in _testable_label.xhtml (line:10,col:42) attribute: value = Not testable
[INFO] [WARNING] Missing translation in _linkAll.xhtml (line:9,col:39) attribute: value = Link all
[INFO] [WARNING] Missing translation in _linkAll.xhtml (line:16,col:41) attribute: value = Unlink all
[INFO] [WARNING] Missing translation in test.xhtml (line:19,col:84) attribute: value = testsForm,idSchemesForm
[INFO] [WARNING] Missing translation in test.xhtml (line:34,col:92) attribute: value = filtered tests
[INFO] [WARNING] Missing translation in test.xhtml (line:170,col:67) attribute: value = testsForm
[INFO] [WARNING] Missing translation in _template.xhtml (line:39,col:21) text = Assertions
[INFO] [WARNING] Missing translation in testStep.xhtml (line:19,col:110) attribute: value = testsForm,testStepsForm,idSchemesForm,description
[INFO] [WARNING] Missing translation in testStep.xhtml (line:33,col:29) text = filtered tests
[INFO] [WARNING] Missing translation in testStep.xhtml (line:268,col:71) attribute: value = testStepsForm
[INFO] [WARNING] Missing translation in rule.xhtml (line:77,col:97) attribute: value = filtered rules
[INFO] [WARNING] Missing translation in rule.xhtml (line:85,col:58) attribute: value = id
[INFO] [WARNING] Missing translation in rule.xhtml (line:132,col:37) text = ) is linked to the following assertions
[INFO] [WARNING] Missing translation in rule.xhtml (line:220,col:67) attribute: value = rulesForm
[INFO] [WARNING] Missing translation in _show.xhtml (line:155,col:62) attribute: value = View xml
[INFO] [WARNING] Missing translation in _show.xhtml (line:628,col:100) attribute: value = (Deprecated)
[INFO] [WARNING] Missing translation in _show.xhtml (line:758,col:21) text = Document
[INFO] [WARNING] Missing translation in _form.xhtml (line:56,col:25) text = This idScheme has no document linked
[INFO] [WARNING] Missing translation in _form.xhtml (line:62,col:29) text = Link a document to the IdScheme
[INFO] [WARNING] Missing translation in _form.xhtml (line:158,col:37) text = Type
[INFO] [WARNING] Missing translation in _form.xhtml (line:196,col:21) text = Testable
[INFO] [WARNING] Missing translation in _form.xhtml (line:200,col:68) attribute: value = right
[INFO] [WARNING] Missing translation in _form.xhtml (line:201,col:66) attribute: value = click
[INFO] [WARNING] Missing translation in _form.xhtml (line:204,col:125) attribute: value = Checked, assertion can be covered. It will count in coverage statistics
[INFO] [WARNING] Missing translation in _form.xhtml (line:206,col:178) attribute: value = Unchecked, the assertion is not testable then it wont appear in the covered by section. It wont count in coverage statistics
[INFO] [WARNING] Some translations are missing!
[INFO] [WARNING] For automatic translation, execute in this module : 
[INFO] [WARNING] mvn crowdin:pull crowdin:aggregate gazelle:xhtml-messages -DkeyPrefix=net.ihe.gazelle
[INFO] [INFO] 
[INFO] [INFO] --- maven-compiler-plugin:3.5.1:compile (default-compile) @ AssertionManagerGui-war ---
[INFO] [INFO] No sources to compile
[INFO] [INFO] 
[INFO] [INFO] --- maven-resources-plugin:2.7:testResources (default-testResources) @ AssertionManagerGui-war ---
[INFO] [INFO] Using 'UTF-8' encoding to copy filtered resources.
[INFO] [INFO] skip non existing resourceDirectory /home/jenkins/.hudson/jobs/AssertionManager-Gui-SNAPSHOT/workspace/target/checkout/AssertionManagerGui-war/src/test/resources
[INFO] [INFO] 
[INFO] [INFO] --- maven-compiler-plugin:3.5.1:testCompile (default-testCompile) @ AssertionManagerGui-war ---
[INFO] [INFO] No sources to compile
[INFO] [INFO] 
[INFO] [INFO] --- maven-surefire-plugin:2.12.3:test (default-test) @ AssertionManagerGui-war ---
[INFO] [INFO] No tests to run.
[INFO] [INFO] 
[INFO] [INFO] --- maven-war-plugin:2.3:exploded (default) @ AssertionManagerGui-war ---
[INFO] [INFO] Exploding webapp
[INFO] [INFO] Assembling webapp [AssertionManagerGui-war] in [/home/jenkins/.hudson/jobs/AssertionManager-Gui-SNAPSHOT/workspace/target/checkout/AssertionManagerGui-war/target/AssertionManagerGui-war]
[INFO] [INFO] Processing war project
[INFO] [INFO] Copying webapp webResources [/home/jenkins/.hudson/jobs/AssertionManager-Gui-SNAPSHOT/workspace/target/checkout/AssertionManagerGui-war/src/main/webapp] to [/home/jenkins/.hudson/jobs/AssertionManager-Gui-SNAPSHOT/workspace/target/checkout/AssertionManagerGui-war/target/AssertionManagerGui-war]
[INFO] [INFO] Copying webapp resources [/home/jenkins/.hudson/jobs/AssertionManager-Gui-SNAPSHOT/workspace/target/checkout/AssertionManagerGui-war/src/main/webapp]
[INFO] [INFO] Processing overlay [ id net.ihe.gazelle.simulators:simulator-common-war]
[INFO] [INFO] Processing overlay [ id net.ihe.gazelle.maven:gazelle-seam-tools-war]
[INFO] [INFO] Processing overlay [ id gazelle.ihe.net.rest:rest-service-doc-war]
[INFO] [INFO] Processing overlay [ id net.ihe.gazelle:gazelle-assets]
[INFO] [INFO] Webapp assembled in [2109 msecs]
[INFO] [INFO] 
[INFO] [INFO] --- maven-war-plugin:2.3:war (default-war) @ AssertionManagerGui-war ---
[INFO] [INFO] Packaging webapp
[INFO] [INFO] Assembling webapp [AssertionManagerGui-war] in [/home/jenkins/.hudson/jobs/AssertionManager-Gui-SNAPSHOT/workspace/target/checkout/AssertionManagerGui-war/target/AssertionManagerGui-war]
[INFO] [INFO] Processing war project
[INFO] [INFO] Copying webapp webResources [/home/jenkins/.hudson/jobs/AssertionManager-Gui-SNAPSHOT/workspace/target/checkout/AssertionManagerGui-war/src/main/webapp] to [/home/jenkins/.hudson/jobs/AssertionManager-Gui-SNAPSHOT/workspace/target/checkout/AssertionManagerGui-war/target/AssertionManagerGui-war]
[INFO] [INFO] Copying webapp resources [/home/jenkins/.hudson/jobs/AssertionManager-Gui-SNAPSHOT/workspace/target/checkout/AssertionManagerGui-war/src/main/webapp]
[INFO] [INFO] Processing overlay [ id net.ihe.gazelle.simulators:simulator-common-war]
[INFO] [INFO] Processing overlay [ id net.ihe.gazelle.maven:gazelle-seam-tools-war]
[INFO] [INFO] Processing overlay [ id gazelle.ihe.net.rest:rest-service-doc-war]
[INFO] [INFO] Processing overlay [ id net.ihe.gazelle:gazelle-assets]
[INFO] [INFO] Webapp assembled in [242 msecs]
[INFO] [INFO] Building war: /home/jenkins/.hudson/jobs/AssertionManager-Gui-SNAPSHOT/workspace/target/checkout/AssertionManagerGui-war/target/AssertionManagerGui-war.war
[INFO] [INFO] 
[INFO] [INFO] --- maven-source-plugin:2.2.1:jar-no-fork (attach-sources) @ AssertionManagerGui-war ---
[INFO] [INFO] Building jar: /home/jenkins/.hudson/jobs/AssertionManager-Gui-SNAPSHOT/workspace/target/checkout/AssertionManagerGui-war/target/AssertionManagerGui-war-sources.jar
[INFO] [INFO] 
[INFO] [INFO] --- maven-assembly-plugin:2.4:single (source-release-assembly) @ AssertionManagerGui-war ---
[INFO] [INFO] Skipping the assembly in this project because it's not the Execution Root
[INFO] [INFO] 
[INFO] [INFO] --- maven-javadoc-plugin:2.9:jar (attach-javadocs) @ AssertionManagerGui-war ---
[INFO] [INFO] 
[INFO] [INFO] --- maven-jar-plugin:2.4:test-jar (default) @ AssertionManagerGui-war ---
[INFO] [WARNING] JAR will be empty - no content was marked for inclusion!
[INFO] [INFO] Building jar: /home/jenkins/.hudson/jobs/AssertionManager-Gui-SNAPSHOT/workspace/target/checkout/AssertionManagerGui-war/target/AssertionManagerGui-war-tests.jar
[INFO] [INFO] 
[INFO] [INFO] --- maven-install-plugin:2.4:install (default-install) @ AssertionManagerGui-war ---
[INFO] [INFO] Installing /home/jenkins/.hudson/jobs/AssertionManager-Gui-SNAPSHOT/workspace/target/checkout/AssertionManagerGui-war/target/AssertionManagerGui-war.war to /home/jenkins/.m2/repository/net/ihe/gazelle/AssertionManagerGui-war/4.0.1/AssertionManagerGui-war-4.0.1.war
[INFO] [INFO] Installing /home/jenkins/.hudson/jobs/AssertionManager-Gui-SNAPSHOT/workspace/target/checkout/AssertionManagerGui-war/pom.xml to /home/jenkins/.m2/repository/net/ihe/gazelle/AssertionManagerGui-war/4.0.1/AssertionManagerGui-war-4.0.1.pom
[INFO] [INFO] Installing /home/jenkins/.hudson/jobs/AssertionManager-Gui-SNAPSHOT/workspace/target/checkout/AssertionManagerGui-war/target/AssertionManagerGui-war-sources.jar to /home/jenkins/.m2/repository/net/ihe/gazelle/AssertionManagerGui-war/4.0.1/AssertionManagerGui-war-4.0.1-sources.jar
[INFO] [INFO] Installing /home/jenkins/.hudson/jobs/AssertionManager-Gui-SNAPSHOT/workspace/target/checkout/AssertionManagerGui-war/target/AssertionManagerGui-war-tests.jar to /home/jenkins/.m2/repository/net/ihe/gazelle/AssertionManagerGui-war/4.0.1/AssertionManagerGui-war-4.0.1-tests.jar
[INFO] [INFO] 
[INFO] [INFO] --- maven-deploy-plugin:2.7:deploy (default-deploy) @ AssertionManagerGui-war ---
[INFO] [INFO] Uploading: https://gazelle.ihe.net/nexus/content/repositories/releases/net/ihe/gazelle/AssertionManagerGui-war/4.0.1/AssertionManagerGui-war-4.0.1.war
[INFO] [INFO] Uploaded: https://gazelle.ihe.net/nexus/content/repositories/releases/net/ihe/gazelle/AssertionManagerGui-war/4.0.1/AssertionManagerGui-war-4.0.1.war (3102 KB at 1567.0 KB/sec)
[INFO] [INFO] Uploading: https://gazelle.ihe.net/nexus/content/repositories/releases/net/ihe/gazelle/AssertionManagerGui-war/4.0.1/AssertionManagerGui-war-4.0.1.pom
[INFO] [INFO] Uploaded: https://gazelle.ihe.net/nexus/content/repositories/releases/net/ihe/gazelle/AssertionManagerGui-war/4.0.1/AssertionManagerGui-war-4.0.1.pom (7 KB at 6.2 KB/sec)
[INFO] [INFO] Downloading: https://gazelle.ihe.net/nexus/content/repositories/releases/net/ihe/gazelle/AssertionManagerGui-war/maven-metadata.xml
[INFO] [INFO] Downloaded: https://gazelle.ihe.net/nexus/content/repositories/releases/net/ihe/gazelle/AssertionManagerGui-war/maven-metadata.xml (2 KB at 2.4 KB/sec)
[INFO] [INFO] Uploading: https://gazelle.ihe.net/nexus/content/repositories/releases/net/ihe/gazelle/AssertionManagerGui-war/maven-metadata.xml
[INFO] [INFO] Uploaded: https://gazelle.ihe.net/nexus/content/repositories/releases/net/ihe/gazelle/AssertionManagerGui-war/maven-metadata.xml (2 KB at 1.0 KB/sec)
[INFO] [INFO] Uploading: https://gazelle.ihe.net/nexus/content/repositories/releases/net/ihe/gazelle/AssertionManagerGui-war/4.0.1/AssertionManagerGui-war-4.0.1-sources.jar
[INFO] [INFO] Uploaded: https://gazelle.ihe.net/nexus/content/repositories/releases/net/ihe/gazelle/AssertionManagerGui-war/4.0.1/AssertionManagerGui-war-4.0.1-sources.jar (68 KB at 51.7 KB/sec)
[INFO] [INFO] Uploading: https://gazelle.ihe.net/nexus/content/repositories/releases/net/ihe/gazelle/AssertionManagerGui-war/4.0.1/AssertionManagerGui-war-4.0.1-tests.jar
[INFO] [INFO] Uploaded: https://gazelle.ihe.net/nexus/content/repositories/releases/net/ihe/gazelle/AssertionManagerGui-war/4.0.1/AssertionManagerGui-war-4.0.1-tests.jar (4 KB at 2.0 KB/sec)
[INFO] [INFO]                                                                         
[INFO] [INFO] ------------------------------------------------------------------------
[INFO] [INFO] Building AssertionManagerGui - EAR 4.0.1
[INFO] [INFO] ------------------------------------------------------------------------
[INFO] [INFO] 
[INFO] [INFO] --- maven-enforcer-plugin:1.2:enforce (enforce-java-version) @ AssertionManagerGui-ear ---
[INFO] [INFO] 
[INFO] [INFO] --- maven-enforcer-plugin:1.2:enforce (enforce-maven-version) @ AssertionManagerGui-ear ---
[INFO] [INFO] 
[INFO] [INFO] --- buildnumber-maven-plugin:1.2:create-timestamp (get-build-timestamp) @ AssertionManagerGui-ear ---
[INFO] [INFO] 
[INFO] [INFO] --- buildnumber-maven-plugin:1.2:create (get-scm-revision) @ AssertionManagerGui-ear ---
[INFO] [INFO] 
[INFO] [INFO] --- maven-buildmetadata-plugin:1.1.0.IHE.3:provide-buildmetadata (default) @ AssertionManagerGui-ear ---
[INFO] [INFO] Executing: /bin/sh -c cd /home/jenkins/.hudson/jobs/AssertionManager-Gui-SNAPSHOT/workspace/target/checkout/AssertionManagerGui-ear && svn --non-interactive log -v -r '{2016-09-04 07:28:35 +0000}:{2016-10-05 07:28:35 +0000}' svn+ssh://scm.gforge.inria.fr/svn/gazelle/Maven/gazelle-assertion-gui/tags/AssertionManagerGui-4.0.1/AssertionManagerGui-ear
[INFO] [INFO] Working directory: /home/jenkins/.hudson/jobs/AssertionManager-Gui-SNAPSHOT/workspace/target/checkout/AssertionManagerGui-ear
[INFO] [INFO] Executing: /bin/sh -c cd /home/jenkins/.hudson/jobs/AssertionManager-Gui-SNAPSHOT/workspace/target/checkout/AssertionManagerGui-ear && svn --non-interactive status
[INFO] [INFO] Working directory: /home/jenkins/.hudson/jobs/AssertionManager-Gui-SNAPSHOT/workspace/target/checkout/AssertionManagerGui-ear
[INFO] [INFO] Writing properties '/home/jenkins/.hudson/jobs/AssertionManager-Gui-SNAPSHOT/workspace/target/checkout/AssertionManagerGui-ear/target/AssertionManagerGui-ear/META-INF/build.properties'...
[INFO] [INFO] Writing XML report '/home/jenkins/.hudson/jobs/AssertionManager-Gui-SNAPSHOT/workspace/target/checkout/AssertionManagerGui-ear/target/buildmetadata.xml'...
[INFO] [INFO] 
[INFO] [INFO] --- maven-ear-plugin:2.8:generate-application-xml (default-generate-application-xml) @ AssertionManagerGui-ear ---
[INFO] [INFO] Generating application.xml
[INFO] [INFO] 
[INFO] [INFO] --- maven-resources-plugin:2.7:resources (default-resources) @ AssertionManagerGui-ear ---
[INFO] [INFO] Using 'UTF-8' encoding to copy filtered resources.
[INFO] [INFO] Copying 3 resources
[INFO] [INFO] 
[INFO] [INFO] --- maven-ear-plugin:2.8:ear (default-ear) @ AssertionManagerGui-ear ---
[INFO] [INFO] Copying artifact [war:net.ihe.gazelle:AssertionManagerGui-war:4.0.1] to [AssertionManagerGui-war-4.0.1.war]
[INFO] [INFO] Copying artifact [ejb:org.jboss.seam:jboss-seam:2.3.1.Final] to [jboss-seam-2.3.1.Final.jar]
[INFO] [INFO] Copying artifact [ejb:net.ihe.gazelle.maven:gazelle-seam-tools-jar:3.0.22] to [gazelle-seam-tools-jar.jar]
[INFO] [INFO] Copying artifact [ejb:net.ihe.gazelle.simulators:simulator-common-ejb:4.3.4] to [simulator-common-ejb.jar]
[INFO] [INFO] Copying artifact [ejb:net.ihe.gazelle:AssertionManagerGui-ejb:4.0.1] to [AssertionManagerGui-ejb.jar]
[INFO] [INFO] Copying artifact [ejb:net.ihe.gazelle:AssertionManagerGui-model:4.0.1] to [AssertionManagerGui-model.jar]
[INFO] [INFO] Copying artifact [ejb:net.ihe.gazelle.maven:version:1.0.3] to [version.jar]
[INFO] [INFO] Copying artifact [jar:org.apache:xmlsec:1.4.3] to [lib/xmlsec-1.4.3.jar]
[INFO] [INFO] Copying artifact [jar:commons-lang:commons-lang:2.6] to [lib/commons-lang-2.6.jar]
[INFO] [INFO] Copying artifact [jar:org.picketlink:picketlink-fed-core:1.0.4.final] to [lib/picketlink-fed-core-1.0.4.final.jar]
[INFO] [INFO] Copying artifact [jar:org.picketlink:picketlink-fed-model:1.0.4.final] to [lib/picketlink-fed-model-1.0.4.final.jar]
[INFO] [INFO] Copying artifact [jar:org.picketlink:picketlink-xmlsec-model:1.0.4.final] to [lib/picketlink-xmlsec-model-1.0.4.final.jar]
[INFO] [INFO] Copying artifact [jar:org.jasig.cas:cas-client-core:3.1.10.IHE.1] to [lib/cas-client-core-3.1.10.IHE.1.jar]
[INFO] [INFO] Copying artifact [jar:net.ihe.gazelle:gazelle-validation-ws:2.0.2] to [lib/gazelle-validation-ws-2.0.2.jar]
[INFO] [INFO] Copying artifact [jar:c3p0:c3p0:0.9.1.2] to [lib/c3p0-0.9.1.2.jar]
[INFO] [INFO] Copying artifact [jar:org.hibernate:hibernate-c3p0:4.2.20.Final] to [lib/hibernate-c3p0-4.2.20.Final.jar]
[INFO] [INFO] Copying artifact [jar:org.jboss.logging:jboss-logging:3.1.2.GA] to [lib/jboss-logging-3.1.2.GA.jar]
[INFO] [INFO] Copying artifact [jar:org.kohsuke.metainf-services:metainf-services:1.1] to [lib/metainf-services-1.1.jar]
[INFO] [INFO] Copying artifact [jar:net.ihe.gazelle.maven:gazelle-tools-jar:3.0.22] to [lib/gazelle-tools-jar-3.0.22.jar]
[INFO] [INFO] Copying artifact [jar:org.jboss.envers:jboss-envers:1.2.2.GA-hibernate-3.3] to [lib/jboss-envers-1.2.2.GA-hibernate-3.3.jar]
[INFO] [INFO] Copying artifact [ejb:net.ihe.gazelle.model:gazelle-model-common:4.0.14] to [gazelle-model-common-4.0.14.jar]
[INFO] [INFO] Copying artifact [jar:org.reflections:reflections:0.9.10] to [lib/reflections-0.9.10.jar]
[INFO] [INFO] Copying artifact [jar:com.google.code.findbugs:annotations:2.0.1] to [lib/annotations-2.0.1.jar]
[INFO] [INFO] Copying artifact [jar:org.mapdb:mapdb:1.0.6] to [lib/mapdb-1.0.6.jar]
[INFO] [INFO] Copying artifact [jar:net.ihe.gazelle.assertion.coverage:gazelle-assertion-coverage-provider-client:5.0.1] to [lib/gazelle-assertion-coverage-provider-client-5.0.1.jar]
[INFO] [INFO] Copying artifact [jar:commons-httpclient:commons-httpclient:3.1-jbossorg-1] to [lib/commons-httpclient-3.1-jbossorg-1.jar]
[INFO] [INFO] Copying artifact [jar:org.jboss.resteasy:resteasy-client:3.0.1.Final] to [lib/resteasy-client-3.0.1.Final.jar]
[INFO] [INFO] Copying artifact [jar:javax.ws.rs:jsr311-api:1.1.1] to [lib/jsr311-api-1.1.1.jar]
[INFO] [INFO] Copying artifact [jar:commons-io:commons-io:2.1] to [lib/commons-io-2.1.jar]
[INFO] [INFO] Copying artifact [jar:owasp-java-html-sanitizer:owasp-java-html-sanitizer:r239] to [lib/owasp-java-html-sanitizer-r239.jar]
[INFO] [INFO] Copying artifact [jar:com.google.code.findbugs:jsr305:3.0.1] to [lib/jsr305-3.0.1.jar]
[INFO] [INFO] Copying artifact [jar:commons-fileupload:commons-fileupload:1.2.2] to [lib/commons-fileupload-1.2.2.jar]
[INFO] [INFO] Copying artifact [jar:commons-digester:commons-digester:2.1] to [lib/commons-digester-2.1.jar]
[INFO] [INFO] Copying artifact [jar:commons-logging:commons-logging:1.1.1] to [lib/commons-logging-1.1.1.jar]
[INFO] [INFO] Copying artifact [jar:javax.servlet:jstl:1.0] to [lib/jstl-1.0.jar]
[INFO] [INFO] Copying artifact [jar:org.apache.poi:poi:3.8] to [lib/poi-3.8.jar]
[INFO] [INFO] Copying artifact [jar:commons-codec:commons-codec:1.4] to [lib/commons-codec-1.4.jar]
[INFO] [INFO] Copying artifact [jar:org.jsoup:jsoup:1.6.3] to [lib/jsoup-1.6.3.jar]
[INFO] [INFO] Copying artifact [jar:net.sf.ehcache:ehcache-core:2.6.6] to [lib/ehcache-core-2.6.6.jar]
[INFO] [INFO] Copying artifact [jar:net.ihe.gazelle.tm.services:gazelle-tm-rest-client:1.0.1] to [lib/gazelle-tm-rest-client-1.0.1.jar]
[INFO] [INFO] Copying artifact [jar:net.ihe.gazelle.tm.services:gazelle-tm-rest-data:1.0.1] to [lib/gazelle-tm-rest-data-1.0.1.jar]
[INFO] [INFO] Copying artifact [jar:org.jboss.resteasy:resteasy-jaxrs:2.3.5.Final] to [lib/resteasy-jaxrs-2.3.5.Final.jar]
[INFO] [INFO] Copying artifact [jar:org.jboss.resteasy:resteasy-jaxb-provider:2.3.5.Final] to [lib/resteasy-jaxb-provider-2.3.5.Final.jar]
[INFO] [INFO] Copying artifact [jar:com.sun.xml.bind:jaxb-impl:2.2.5.jboss-1] to [lib/jaxb-impl-2.2.5.jboss-1.jar]
[INFO] [INFO] Copying artifact [jar:com.sun.istack:istack-commons-runtime:2.6.1] to [lib/istack-commons-runtime-2.6.1.jar]
[INFO] [INFO] Copying artifact [jar:com.sun.xml.txw2:txw2:20110809] to [lib/txw2-20110809.jar]
[INFO] [INFO] Copying artifact [jar:org.jboss.seam:jboss-seam-resteasy:2.3.1.Final] to [lib/jboss-seam-resteasy-2.3.1.Final.jar]
[INFO] [INFO] Copying artifact [jar:org.scannotation:scannotation:1.0.2] to [lib/scannotation-1.0.2.jar]
[INFO] [INFO] Copying artifact [jar:com.wordnik:swagger-annotations_2.9.1:1.2.0] to [lib/swagger-annotations_2.9.1-1.2.0.jar]
[INFO] [INFO] Copying artifact [jar:net.ihe.gazelle.assertion.ws.client:gazelle-assertion-ws-data:5.0.0] to [lib/gazelle-assertion-ws-data-5.0.0.jar]
[INFO] [INFO] Copying artifact [jar:net.ihe.gazelle.assertion.coverage:gazelle-assertion-coverage-provider-data:5.0.1] to [lib/gazelle-assertion-coverage-provider-data-5.0.1.jar]
[INFO] [INFO] Copying artifact [jar:org.jboss.spec.javax.ws.rs:jboss-jaxrs-api_1.1_spec:1.0.1.Final] to [lib/jboss-jaxrs-api_1.1_spec-1.0.1.Final.jar]
[INFO] [INFO] Copying artifact [jar:org.opensymphony.quartz:quartz:1.6.5] to [lib/quartz-1.6.5.jar]
[INFO] [INFO] Copying artifact [jar:com.google.gwt:gwt-servlet:1.5.2] to [lib/gwt-servlet-1.5.2.jar]
[INFO] [INFO] Copying artifact [jar:org.hibernate:hibernate-ehcache:4.2.20.Final] to [lib/hibernate-ehcache-4.2.20.Final.jar]
[INFO] [INFO] Copying artifact [jar:net.ihe.gazelle.maven:gazelle-pdfjs:3.0.22] to [lib/gazelle-pdfjs-3.0.22.jar]
[INFO] [INFO] Copying artifact [jar:net.ihe.gazelle.hql:gazelle-hql:2.0.9] to [lib/gazelle-hql-2.0.9.jar]
[INFO] [INFO] Copying artifact [jar:org.jboss.el:jboss-el:1.0_02.CR6] to [lib/jboss-el-1.0_02.CR6.jar]
[INFO] [INFO] Copying artifact [jar:org.jboss.seam:jboss-seam-remoting:2.3.1.Final] to [lib/jboss-seam-remoting-2.3.1.Final.jar]
[INFO] [INFO] Copying artifact [jar:org.jboss.seam:jboss-seam-ui:2.3.1.Final] to [lib/jboss-seam-ui-2.3.1.Final.jar]
[INFO] [INFO] Copying artifact [jar:org.jboss.seam:jboss-seam-mail:2.3.1.Final] to [lib/jboss-seam-mail-2.3.1.Final.jar]
[INFO] [INFO] Copying artifact [jar:org.jboss.spec.javax.faces:jboss-jsf-api_2.1_spec:2.1.19.1.Final] to [lib/jboss-jsf-api_2.1_spec-2.1.19.1.Final.jar]
[INFO] [INFO] Copying artifact [jar:org.jboss.seam:jboss-seam-debug:2.3.1.Final] to [lib/jboss-seam-debug-2.3.1.Final.jar]
[INFO] [INFO] Copying artifact [jar:org.jboss.seam:jboss-seam-pdf:2.3.1.Final] to [lib/jboss-seam-pdf-2.3.1.Final.jar]
[INFO] [INFO] Copying artifact [jar:com.lowagie:itext:2.1.7] to [lib/itext-2.1.7.jar]
[INFO] [INFO] Copying artifact [jar:com.lowagie:itext-rtf:2.1.2] to [lib/itext-rtf-2.1.2.jar]
[INFO] [INFO] Copying artifact [jar:org.jboss.seam:jboss-seam-excel:2.3.1.Final] to [lib/jboss-seam-excel-2.3.1.Final.jar]
[INFO] [INFO] Copying artifact [jar:net.sourceforge.jexcelapi:jxl:2.6.10] to [lib/jxl-2.6.10.jar]
[INFO] [INFO] Copying artifact [jar:commons-beanutils:commons-beanutils:1.8.3] to [lib/commons-beanutils-1.8.3.jar]
[INFO] [INFO] Copying artifact [jar:org.richfaces.ui:richfaces-components-ui:4.3.5.Final] to [lib/richfaces-components-ui-4.3.5.Final.jar]
[INFO] [INFO] Copying artifact [jar:org.richfaces.ui:richfaces-components-api:4.3.5.Final] to [lib/richfaces-components-api-4.3.5.Final.jar]
[INFO] [INFO] Copying artifact [jar:org.richfaces.core:richfaces-core-api:4.3.5.Final] to [lib/richfaces-core-api-4.3.5.Final.jar]
[INFO] [INFO] Copying artifact [jar:org.richfaces.core:richfaces-core-impl:4.3.5.Final] to [lib/richfaces-core-impl-4.3.5.Final.jar]
[INFO] [INFO] Copying artifact [jar:net.sourceforge.cssparser:cssparser:0.9.5] to [lib/cssparser-0.9.5.jar]
[INFO] [INFO] Copying artifact [jar:org.w3c.css:sac:1.3] to [lib/sac-1.3.jar]
[INFO] [INFO] Copying artifact [jar:com.google.guava:guava:13.0.1] to [lib/guava-13.0.1.jar]
[INFO] [INFO] Copying artifact [jar:net.ihe.gazelle.cdk:cdk-tags:1.0.3] to [lib/cdk-tags-1.0.3.jar]
[INFO] [INFO] Copying artifact [jar:org.richfaces.cdk:annotations:4.3.1.Final] to [lib/annotations-4.3.1.Final.jar]
[INFO] [INFO] Copying artifact [jar:com.sun.faces:jsf-api:2.1.19] to [lib/jsf-api-2.1.19.jar]
[INFO] [INFO] Copying artifact [jar:com.uwyn:jhighlight:1.0] to [lib/jhighlight-1.0.jar]
[INFO] [INFO] Copy ear sources to /home/jenkins/.hudson/jobs/AssertionManager-Gui-SNAPSHOT/workspace/target/checkout/AssertionManagerGui-ear/target/AssertionManagerGui-ear
[INFO] [INFO] Could not find manifest file: /home/jenkins/.hudson/jobs/AssertionManager-Gui-SNAPSHOT/workspace/target/checkout/AssertionManagerGui-ear/target/AssertionManagerGui-ear/META-INF/MANIFEST.MF - Generating one
[INFO] [INFO] Building jar: /home/jenkins/.hudson/jobs/AssertionManager-Gui-SNAPSHOT/workspace/target/checkout/AssertionManagerGui-ear/target/AssertionManagerGui.ear
[INFO] [INFO] 
[INFO] [INFO] --- maven-source-plugin:2.2.1:jar-no-fork (attach-sources) @ AssertionManagerGui-ear ---
[INFO] [INFO] Building jar: /home/jenkins/.hudson/jobs/AssertionManager-Gui-SNAPSHOT/workspace/target/checkout/AssertionManagerGui-ear/target/AssertionManagerGui-ear-sources.jar
[INFO] [INFO] 
[INFO] [INFO] --- maven-assembly-plugin:2.4:single (source-release-assembly) @ AssertionManagerGui-ear ---
[INFO] [INFO] Skipping the assembly in this project because it's not the Execution Root
[INFO] [INFO] 
[INFO] [INFO] --- maven-javadoc-plugin:2.9:jar (attach-javadocs) @ AssertionManagerGui-ear ---
[INFO] [INFO] 
[INFO] [INFO] --- maven-jar-plugin:2.4:test-jar (default) @ AssertionManagerGui-ear ---
[INFO] [WARNING] JAR will be empty - no content was marked for inclusion!
[INFO] [INFO] Building jar: /home/jenkins/.hudson/jobs/AssertionManager-Gui-SNAPSHOT/workspace/target/checkout/AssertionManagerGui-ear/target/AssertionManagerGui-ear-tests.jar
[INFO] [INFO] 
[INFO] [INFO] --- maven-install-plugin:2.4:install (default-install) @ AssertionManagerGui-ear ---
[INFO] [INFO] Installing /home/jenkins/.hudson/jobs/AssertionManager-Gui-SNAPSHOT/workspace/target/checkout/AssertionManagerGui-ear/target/AssertionManagerGui.ear to /home/jenkins/.m2/repository/net/ihe/gazelle/AssertionManagerGui-ear/4.0.1/AssertionManagerGui-ear-4.0.1.ear
[INFO] [INFO] Installing /home/jenkins/.hudson/jobs/AssertionManager-Gui-SNAPSHOT/workspace/target/checkout/AssertionManagerGui-ear/pom.xml to /home/jenkins/.m2/repository/net/ihe/gazelle/AssertionManagerGui-ear/4.0.1/AssertionManagerGui-ear-4.0.1.pom
[INFO] [INFO] Installing /home/jenkins/.hudson/jobs/AssertionManager-Gui-SNAPSHOT/workspace/target/checkout/AssertionManagerGui-ear/target/AssertionManagerGui-ear-sources.jar to /home/jenkins/.m2/repository/net/ihe/gazelle/AssertionManagerGui-ear/4.0.1/AssertionManagerGui-ear-4.0.1-sources.jar
[INFO] [INFO] Installing /home/jenkins/.hudson/jobs/AssertionManager-Gui-SNAPSHOT/workspace/target/checkout/AssertionManagerGui-ear/target/AssertionManagerGui-ear-tests.jar to /home/jenkins/.m2/repository/net/ihe/gazelle/AssertionManagerGui-ear/4.0.1/AssertionManagerGui-ear-4.0.1-tests.jar
[INFO] [INFO] 
[INFO] [INFO] --- maven-deploy-plugin:2.7:deploy (default-deploy) @ AssertionManagerGui-ear ---
[INFO] [INFO] Uploading: https://gazelle.ihe.net/nexus/content/repositories/releases/net/ihe/gazelle/AssertionManagerGui-ear/4.0.1/AssertionManagerGui-ear-4.0.1.ear
[INFO] [INFO] Uploaded: https://gazelle.ihe.net/nexus/content/repositories/releases/net/ihe/gazelle/AssertionManagerGui-ear/4.0.1/AssertionManagerGui-ear-4.0.1.ear (28156 KB at 5446.9 KB/sec)
[INFO] [INFO] Uploading: https://gazelle.ihe.net/nexus/content/repositories/releases/net/ihe/gazelle/AssertionManagerGui-ear/4.0.1/AssertionManagerGui-ear-4.0.1.pom
[INFO] [INFO] Uploaded: https://gazelle.ihe.net/nexus/content/repositories/releases/net/ihe/gazelle/AssertionManagerGui-ear/4.0.1/AssertionManagerGui-ear-4.0.1.pom (8 KB at 6.8 KB/sec)
[INFO] [INFO] Downloading: https://gazelle.ihe.net/nexus/content/repositories/releases/net/ihe/gazelle/AssertionManagerGui-ear/maven-metadata.xml
[INFO] [INFO] Downloaded: https://gazelle.ihe.net/nexus/content/repositories/releases/net/ihe/gazelle/AssertionManagerGui-ear/maven-metadata.xml (2 KB at 2.5 KB/sec)
[INFO] [INFO] Uploading: https://gazelle.ihe.net/nexus/content/repositories/releases/net/ihe/gazelle/AssertionManagerGui-ear/maven-metadata.xml
[INFO] [INFO] Uploaded: https://gazelle.ihe.net/nexus/content/repositories/releases/net/ihe/gazelle/AssertionManagerGui-ear/maven-metadata.xml (2 KB at 1.1 KB/sec)
[INFO] [INFO] Uploading: https://gazelle.ihe.net/nexus/content/repositories/releases/net/ihe/gazelle/AssertionManagerGui-ear/4.0.1/AssertionManagerGui-ear-4.0.1-sources.jar
[INFO] [INFO] Uploaded: https://gazelle.ihe.net/nexus/content/repositories/releases/net/ihe/gazelle/AssertionManagerGui-ear/4.0.1/AssertionManagerGui-ear-4.0.1-sources.jar (6 KB at 4.5 KB/sec)
[INFO] [INFO] Uploading: https://gazelle.ihe.net/nexus/content/repositories/releases/net/ihe/gazelle/AssertionManagerGui-ear/4.0.1/AssertionManagerGui-ear-4.0.1-tests.jar
[INFO] [INFO] Uploaded: https://gazelle.ihe.net/nexus/content/repositories/releases/net/ihe/gazelle/AssertionManagerGui-ear/4.0.1/AssertionManagerGui-ear-4.0.1-tests.jar (4 KB at 2.1 KB/sec)
[INFO] [INFO] ------------------------------------------------------------------------
[INFO] [INFO] Reactor Summary:
[INFO] [INFO] 
[INFO] [INFO] AssertionManagerGui ................................ SUCCESS [ 12.996 s]
[INFO] [INFO] AssertionManagerGui-model .......................... SUCCESS [ 17.832 s]
[INFO] [INFO] AssertionManagerGui-EJB ............................ SUCCESS [ 20.535 s]
[INFO] [INFO] AssertionManagerGui-WAR ............................ SUCCESS [ 12.819 s]
[INFO] [INFO] AssertionManagerGui - EAR .......................... SUCCESS [ 12.322 s]
[INFO] [INFO] ------------------------------------------------------------------------
[INFO] [INFO] BUILD SUCCESS
[INFO] [INFO] ------------------------------------------------------------------------
[INFO] [INFO] Total time: 01:17 min
[INFO] [INFO] Finished at: 2016-10-04T09:28:48+02:00
[INFO] [INFO] Final Memory: 73M/1681M
[INFO] [INFO] ------------------------------------------------------------------------
[INFO] Cleaning up after release...
Started calculate disk usage of build
Finished Calculation of disk usage of build in 0 seconds
Started calculate disk usage of workspace
Finished Calculation of disk usage of workspace in 0 seconds
[INFO] ------------------------------------------------------------------------
[INFO] Reactor Summary:
[INFO] 
[INFO] AssertionManagerGui ................................ SUCCESS [01:57 min]
[INFO] AssertionManagerGui-model .......................... SKIPPED
[INFO] AssertionManagerGui-EJB ............................ SKIPPED
[INFO] AssertionManagerGui-WAR ............................ SKIPPED
[INFO] AssertionManagerGui - EAR .......................... SKIPPED
[INFO] ------------------------------------------------------------------------
[INFO] BUILD SUCCESS
[INFO] ------------------------------------------------------------------------
[INFO] Total time: 01:59 min
[INFO] Finished at: 2016-10-04T09:28:49+02:00
[INFO] Final Memory: 36M/481M
[INFO] ------------------------------------------------------------------------
[JENKINS] Archiving /home/jenkins/.hudson/jobs/AssertionManager-Gui-SNAPSHOT/workspace/pom.xml to net.ihe.gazelle/AssertionManagerGui/4.0.1-SNAPSHOT/AssertionManagerGui-4.0.1-SNAPSHOT.pom
[JENKINS] Archiving /home/jenkins/.hudson/jobs/AssertionManager-Gui-SNAPSHOT/workspace/AssertionManagerGui-ejb/pom.xml to net.ihe.gazelle/AssertionManagerGui-ejb/4.0.1-SNAPSHOT/AssertionManagerGui-ejb-4.0.1-SNAPSHOT.pom
[JENKINS] Archiving /home/jenkins/.hudson/jobs/AssertionManager-Gui-SNAPSHOT/workspace/AssertionManagerGui-model/pom.xml to net.ihe.gazelle/AssertionManagerGui-model/4.0.1-SNAPSHOT/AssertionManagerGui-model-4.0.1-SNAPSHOT.pom
[JENKINS] Archiving /home/jenkins/.hudson/jobs/AssertionManager-Gui-SNAPSHOT/workspace/AssertionManagerGui-ear/pom.xml to net.ihe.gazelle/AssertionManagerGui-ear/4.0.1-SNAPSHOT/AssertionManagerGui-ear-4.0.1-SNAPSHOT.pom
[JENKINS] Archiving /home/jenkins/.hudson/jobs/AssertionManager-Gui-SNAPSHOT/workspace/AssertionManagerGui-war/pom.xml to net.ihe.gazelle/AssertionManagerGui-war/4.0.1-SNAPSHOT/AssertionManagerGui-war-4.0.1-SNAPSHOT.pom
[M2Release] assigning keep build to current build.
[M2Release] removing keep build from build 268
channel stopped
[workspace] $ /home/jenkins/.hudson/tools/hudson.tasks.Maven_MavenInstallation/Maven3/bin/mvn -f /home/jenkins/.hudson/jobs/AssertionManager-Gui-SNAPSHOT/workspace/pom.xml -e -B org.sonarsource.scanner.maven:sonar-maven-plugin:3.0.2:sonar -Dsonar.host.url=https://gazelle.ihe.net/sonar
[INFO] Error stacktraces are turned on.
[INFO] Scanning for projects...
[INFO] ------------------------------------------------------------------------
[INFO] Reactor Build Order:
[INFO] 
[INFO] AssertionManagerGui
[INFO] AssertionManagerGui-model
[INFO] AssertionManagerGui-EJB
[INFO] AssertionManagerGui-WAR
[INFO] AssertionManagerGui - EAR
[INFO]                                                                         
[INFO] ------------------------------------------------------------------------
[INFO] Building AssertionManagerGui 4.0.2-SNAPSHOT
[INFO] ------------------------------------------------------------------------
[INFO] Downloading: https://gazelle.ihe.net/nexus/content/groups/public/net/ihe/gazelle/AssertionManagerGui-model/4.0.2-SNAPSHOT/maven-metadata.xml
[INFO] Downloading: https://gazelle.ihe.net/nexus/content/groups/public/net/ihe/gazelle/AssertionManagerGui-model/4.0.2-SNAPSHOT/AssertionManagerGui-model-4.0.2-SNAPSHOT.jar
[INFO] Downloading: https://gazelle.ihe.net/nexus/content/groups/public/net/ihe/gazelle/AssertionManagerGui-model/4.0.2-SNAPSHOT/AssertionManagerGui-model-4.0.2-SNAPSHOT-tests.jar
[WARNING] The following dependencies could not be resolved at this point of the build but seem to be part of the reactor:
[WARNING] o net.ihe.gazelle:AssertionManagerGui-model:jar:4.0.2-SNAPSHOT (compile)
[WARNING] o net.ihe.gazelle:AssertionManagerGui-model:jar:tests:4.0.2-SNAPSHOT (test)
[WARNING] Try running the build up to the lifecycle phase "package"
[INFO] Downloading: https://gazelle.ihe.net/nexus/content/groups/public/net/ihe/gazelle/AssertionManagerGui-war/4.0.2-SNAPSHOT/maven-metadata.xml
[INFO] Downloading: https://gazelle.ihe.net/nexus/content/groups/public/net/ihe/gazelle/AssertionManagerGui-ejb/4.0.2-SNAPSHOT/maven-metadata.xml
[INFO] Downloading: https://gazelle.ihe.net/nexus/content/groups/public/net/ihe/gazelle/AssertionManagerGui-war/4.0.2-SNAPSHOT/AssertionManagerGui-war-4.0.2-SNAPSHOT.war
[INFO] Downloading: https://gazelle.ihe.net/nexus/content/groups/public/net/ihe/gazelle/AssertionManagerGui-ejb/4.0.2-SNAPSHOT/AssertionManagerGui-ejb-4.0.2-SNAPSHOT.jar
[WARNING] The following dependencies could not be resolved at this point of the build but seem to be part of the reactor:
[WARNING] o net.ihe.gazelle:AssertionManagerGui-war:war:4.0.2-SNAPSHOT (compile)
[WARNING] o net.ihe.gazelle:AssertionManagerGui-ejb:jar:4.0.2-SNAPSHOT (compile)
[WARNING] o net.ihe.gazelle:AssertionManagerGui-model:jar:4.0.2-SNAPSHOT (compile)
[WARNING] Try running the build up to the lifecycle phase "package"
[INFO] 
[INFO] --- sonar-maven-plugin:3.0.2:sonar (default-cli) @ AssertionManagerGui ---
[INFO] User cache: /home/jenkins/.sonar/cache
[INFO] ------------------------------------------------------------------------
[INFO] Reactor Summary:
[INFO] 
[INFO] AssertionManagerGui ................................ FAILURE [  1.529 s]
[INFO] AssertionManagerGui-model .......................... SKIPPED
[INFO] AssertionManagerGui-EJB ............................ SKIPPED
[INFO] AssertionManagerGui-WAR ............................ SKIPPED
[INFO] AssertionManagerGui - EAR .......................... SKIPPED
[INFO] ------------------------------------------------------------------------
[INFO] BUILD FAILURE
[INFO] ------------------------------------------------------------------------
[INFO] Total time: 2.650 s
[INFO] Finished at: 2016-10-04T09:28:53+02:00
[INFO] Final Memory: 38M/607M
[INFO] ------------------------------------------------------------------------
[ERROR] Failed to execute goal org.sonarsource.scanner.maven:sonar-maven-plugin:3.0.2:sonar (default-cli) on project AssertionManagerGui: Execution default-cli of goal org.sonarsource.scanner.maven:sonar-maven-plugin:3.0.2:sonar failed: An API incompatibility was encountered while executing org.sonarsource.scanner.maven:sonar-maven-plugin:3.0.2:sonar: java.lang.UnsupportedClassVersionError: org/sonar/batch/bootstrapper/EnvironmentInformation : Unsupported major.minor version 52.0
[ERROR] -----------------------------------------------------
[ERROR] realm =    plugin>org.sonarsource.scanner.maven:sonar-maven-plugin:3.0.2
[ERROR] strategy = org.codehaus.plexus.classworlds.strategy.SelfFirstStrategy
[ERROR] urls[0] = file:/home/jenkins/.m2/repository/org/sonarsource/scanner/maven/sonar-maven-plugin/3.0.2/sonar-maven-plugin-3.0.2.jar
[ERROR] urls[1] = file:/home/jenkins/.m2/repository/org/apache/maven/shared/maven-dependency-tree/2.2/maven-dependency-tree-2.2.jar
[ERROR] urls[2] = file:/home/jenkins/.m2/repository/org/codehaus/plexus/plexus-component-annotations/1.5.5/plexus-component-annotations-1.5.5.jar
[ERROR] urls[3] = file:/home/jenkins/.m2/repository/org/eclipse/aether/aether-util/0.9.0.M2/aether-util-0.9.0.M2.jar
[ERROR] urls[4] = file:/home/jenkins/.m2/repository/org/sonatype/plexus/plexus-sec-dispatcher/1.4/plexus-sec-dispatcher-1.4.jar
[ERROR] urls[5] = file:/home/jenkins/.m2/repository/org/sonatype/plexus/plexus-cipher/1.4/plexus-cipher-1.4.jar
[ERROR] urls[6] = file:/home/jenkins/.m2/repository/org/codehaus/plexus/plexus-utils/3.0.22/plexus-utils-3.0.22.jar
[ERROR] urls[7] = file:/home/jenkins/.m2/repository/org/sonarsource/scanner/api/sonar-scanner-api/2.6/sonar-scanner-api-2.6.jar
[ERROR] urls[8] = file:/home/jenkins/.m2/repository/commons-lang/commons-lang/2.6/commons-lang-2.6.jar
[ERROR] urls[9] = file:/home/jenkins/.m2/repository/com/google/guava/guava/18.0/guava-18.0.jar
[ERROR] urls[10] = file:/home/jenkins/.m2/repository/com/google/code/findbugs/jsr305/2.0.3/jsr305-2.0.3.jar
[ERROR] Number of foreign imports: 1
[ERROR] import: Entry[import  from realm ClassRealm[maven.api, parent: null]]
[ERROR] 
[ERROR] -----------------------------------------------------
[ERROR] -> [Help 1]
org.apache.maven.lifecycle.LifecycleExecutionException: Failed to execute goal org.sonarsource.scanner.maven:sonar-maven-plugin:3.0.2:sonar (default-cli) on project AssertionManagerGui: Execution default-cli of goal org.sonarsource.scanner.maven:sonar-maven-plugin:3.0.2:sonar failed: An API incompatibility was encountered while executing org.sonarsource.scanner.maven:sonar-maven-plugin:3.0.2:sonar: java.lang.UnsupportedClassVersionError: org/sonar/batch/bootstrapper/EnvironmentInformation : Unsupported major.minor version 52.0
-----------------------------------------------------
realm =    plugin>org.sonarsource.scanner.maven:sonar-maven-plugin:3.0.2
strategy = org.codehaus.plexus.classworlds.strategy.SelfFirstStrategy
urls[0] = file:/home/jenkins/.m2/repository/org/sonarsource/scanner/maven/sonar-maven-plugin/3.0.2/sonar-maven-plugin-3.0.2.jar
urls[1] = file:/home/jenkins/.m2/repository/org/apache/maven/shared/maven-dependency-tree/2.2/maven-dependency-tree-2.2.jar
urls[2] = file:/home/jenkins/.m2/repository/org/codehaus/plexus/plexus-component-annotations/1.5.5/plexus-component-annotations-1.5.5.jar
urls[3] = file:/home/jenkins/.m2/repository/org/eclipse/aether/aether-util/0.9.0.M2/aether-util-0.9.0.M2.jar
urls[4] = file:/home/jenkins/.m2/repository/org/sonatype/plexus/plexus-sec-dispatcher/1.4/plexus-sec-dispatcher-1.4.jar
urls[5] = file:/home/jenkins/.m2/repository/org/sonatype/plexus/plexus-cipher/1.4/plexus-cipher-1.4.jar
urls[6] = file:/home/jenkins/.m2/repository/org/codehaus/plexus/plexus-utils/3.0.22/plexus-utils-3.0.22.jar
urls[7] = file:/home/jenkins/.m2/repository/org/sonarsource/scanner/api/sonar-scanner-api/2.6/sonar-scanner-api-2.6.jar
urls[8] = file:/home/jenkins/.m2/repository/commons-lang/commons-lang/2.6/commons-lang-2.6.jar
urls[9] = file:/home/jenkins/.m2/repository/com/google/guava/guava/18.0/guava-18.0.jar
urls[10] = file:/home/jenkins/.m2/repository/com/google/code/findbugs/jsr305/2.0.3/jsr305-2.0.3.jar
Number of foreign imports: 1
import: Entry[import  from realm ClassRealm[maven.api, parent: null]]

-----------------------------------------------------

	at org.apache.maven.lifecycle.internal.MojoExecutor.execute(MojoExecutor.java:212)
	at org.apache.maven.lifecycle.internal.MojoExecutor.execute(MojoExecutor.java:153)
	at org.apache.maven.lifecycle.internal.MojoExecutor.execute(MojoExecutor.java:145)
	at org.apache.maven.lifecycle.internal.LifecycleModuleBuilder.buildProject(LifecycleModuleBuilder.java:116)
	at org.apache.maven.lifecycle.internal.LifecycleModuleBuilder.buildProject(LifecycleModuleBuilder.java:80)
	at org.apache.maven.lifecycle.internal.builder.singlethreaded.SingleThreadedBuilder.build(SingleThreadedBuilder.java:51)
	at org.apache.maven.lifecycle.internal.LifecycleStarter.execute(LifecycleStarter.java:128)
	at org.apache.maven.DefaultMaven.doExecute(DefaultMaven.java:307)
	at org.apache.maven.DefaultMaven.doExecute(DefaultMaven.java:193)
	at org.apache.maven.DefaultMaven.execute(DefaultMaven.java:106)
	at org.apache.maven.cli.MavenCli.execute(MavenCli.java:863)
	at org.apache.maven.cli.MavenCli.doMain(MavenCli.java:288)
	at org.apache.maven.cli.MavenCli.main(MavenCli.java:199)
	at sun.reflect.NativeMethodAccessorImpl.invoke0(Native Method)
	at sun.reflect.NativeMethodAccessorImpl.invoke(NativeMethodAccessorImpl.java:57)
	at sun.reflect.DelegatingMethodAccessorImpl.invoke(DelegatingMethodAccessorImpl.java:43)
	at java.lang.reflect.Method.invoke(Method.java:606)
	at org.codehaus.plexus.classworlds.launcher.Launcher.launchEnhanced(Launcher.java:289)
	at org.codehaus.plexus.classworlds.launcher.Launcher.launch(Launcher.java:229)
	at org.codehaus.plexus.classworlds.launcher.Launcher.mainWithExitCode(Launcher.java:415)
	at org.codehaus.plexus.classworlds.launcher.Launcher.main(Launcher.java:356)
Caused by: org.apache.maven.plugin.PluginExecutionException: Execution default-cli of goal org.sonarsource.scanner.maven:sonar-maven-plugin:3.0.2:sonar failed: An API incompatibility was encountered while executing org.sonarsource.scanner.maven:sonar-maven-plugin:3.0.2:sonar: java.lang.UnsupportedClassVersionError: org/sonar/batch/bootstrapper/EnvironmentInformation : Unsupported major.minor version 52.0
-----------------------------------------------------
realm =    plugin>org.sonarsource.scanner.maven:sonar-maven-plugin:3.0.2
strategy = org.codehaus.plexus.classworlds.strategy.SelfFirstStrategy
urls[0] = file:/home/jenkins/.m2/repository/org/sonarsource/scanner/maven/sonar-maven-plugin/3.0.2/sonar-maven-plugin-3.0.2.jar
urls[1] = file:/home/jenkins/.m2/repository/org/apache/maven/shared/maven-dependency-tree/2.2/maven-dependency-tree-2.2.jar
urls[2] = file:/home/jenkins/.m2/repository/org/codehaus/plexus/plexus-component-annotations/1.5.5/plexus-component-annotations-1.5.5.jar
urls[3] = file:/home/jenkins/.m2/repository/org/eclipse/aether/aether-util/0.9.0.M2/aether-util-0.9.0.M2.jar
urls[4] = file:/home/jenkins/.m2/repository/org/sonatype/plexus/plexus-sec-dispatcher/1.4/plexus-sec-dispatcher-1.4.jar
urls[5] = file:/home/jenkins/.m2/repository/org/sonatype/plexus/plexus-cipher/1.4/plexus-cipher-1.4.jar
urls[6] = file:/home/jenkins/.m2/repository/org/codehaus/plexus/plexus-utils/3.0.22/plexus-utils-3.0.22.jar
urls[7] = file:/home/jenkins/.m2/repository/org/sonarsource/scanner/api/sonar-scanner-api/2.6/sonar-scanner-api-2.6.jar
urls[8] = file:/home/jenkins/.m2/repository/commons-lang/commons-lang/2.6/commons-lang-2.6.jar
urls[9] = file:/home/jenkins/.m2/repository/com/google/guava/guava/18.0/guava-18.0.jar
urls[10] = file:/home/jenkins/.m2/repository/com/google/code/findbugs/jsr305/2.0.3/jsr305-2.0.3.jar
Number of foreign imports: 1
import: Entry[import  from realm ClassRealm[maven.api, parent: null]]

-----------------------------------------------------

	at org.apache.maven.plugin.DefaultBuildPluginManager.executeMojo(DefaultBuildPluginManager.java:183)
	at org.apache.maven.lifecycle.internal.MojoExecutor.execute(MojoExecutor.java:207)
	... 20 more
Caused by: org.apache.maven.plugin.PluginContainerException: An API incompatibility was encountered while executing org.sonarsource.scanner.maven:sonar-maven-plugin:3.0.2:sonar: java.lang.UnsupportedClassVersionError: org/sonar/batch/bootstrapper/EnvironmentInformation : Unsupported major.minor version 52.0
-----------------------------------------------------
realm =    plugin>org.sonarsource.scanner.maven:sonar-maven-plugin:3.0.2
strategy = org.codehaus.plexus.classworlds.strategy.SelfFirstStrategy
urls[0] = file:/home/jenkins/.m2/repository/org/sonarsource/scanner/maven/sonar-maven-plugin/3.0.2/sonar-maven-plugin-3.0.2.jar
urls[1] = file:/home/jenkins/.m2/repository/org/apache/maven/shared/maven-dependency-tree/2.2/maven-dependency-tree-2.2.jar
urls[2] = file:/home/jenkins/.m2/repository/org/codehaus/plexus/plexus-component-annotations/1.5.5/plexus-component-annotations-1.5.5.jar
urls[3] = file:/home/jenkins/.m2/repository/org/eclipse/aether/aether-util/0.9.0.M2/aether-util-0.9.0.M2.jar
urls[4] = file:/home/jenkins/.m2/repository/org/sonatype/plexus/plexus-sec-dispatcher/1.4/plexus-sec-dispatcher-1.4.jar
urls[5] = file:/home/jenkins/.m2/repository/org/sonatype/plexus/plexus-cipher/1.4/plexus-cipher-1.4.jar
urls[6] = file:/home/jenkins/.m2/repository/org/codehaus/plexus/plexus-utils/3.0.22/plexus-utils-3.0.22.jar
urls[7] = file:/home/jenkins/.m2/repository/org/sonarsource/scanner/api/sonar-scanner-api/2.6/sonar-scanner-api-2.6.jar
urls[8] = file:/home/jenkins/.m2/repository/commons-lang/commons-lang/2.6/commons-lang-2.6.jar
urls[9] = file:/home/jenkins/.m2/repository/com/google/guava/guava/18.0/guava-18.0.jar
urls[10] = file:/home/jenkins/.m2/repository/com/google/code/findbugs/jsr305/2.0.3/jsr305-2.0.3.jar
Number of foreign imports: 1
import: Entry[import  from realm ClassRealm[maven.api, parent: null]]

-----------------------------------------------------

	at org.apache.maven.plugin.DefaultBuildPluginManager.executeMojo(DefaultBuildPluginManager.java:181)
	... 21 more
Caused by: java.lang.UnsupportedClassVersionError: org/sonar/batch/bootstrapper/EnvironmentInformation : Unsupported major.minor version 52.0
	at java.lang.ClassLoader.defineClass1(Native Method)
	at java.lang.ClassLoader.defineClass(ClassLoader.java:800)
	at java.security.SecureClassLoader.defineClass(SecureClassLoader.java:142)
	at java.net.URLClassLoader.defineClass(URLClassLoader.java:449)
	at java.net.URLClassLoader.access$100(URLClassLoader.java:71)
	at java.net.URLClassLoader$1.run(URLClassLoader.java:361)
	at java.net.URLClassLoader$1.run(URLClassLoader.java:355)
	at java.security.AccessController.doPrivileged(Native Method)
	at java.net.URLClassLoader.findClass(URLClassLoader.java:354)
	at org.sonarsource.scanner.api.internal.IsolatedClassloader.loadClass(IsolatedClassloader.java:82)
	at java.lang.ClassLoader.loadClass(ClassLoader.java:358)
	at org.sonarsource.scanner.api.internal.batch.DefaultBatchFactory.createBatch(DefaultBatchFactory.java:32)
	at org.sonarsource.scanner.api.internal.batch.BatchIsolatedLauncher.start(BatchIsolatedLauncher.java:51)
	at sun.reflect.NativeMethodAccessorImpl.invoke0(Native Method)
	at sun.reflect.NativeMethodAccessorImpl.invoke(NativeMethodAccessorImpl.java:57)
	at sun.reflect.DelegatingMethodAccessorImpl.invoke(DelegatingMethodAccessorImpl.java:43)
	at java.lang.reflect.Method.invoke(Method.java:606)
	at org.sonarsource.scanner.api.internal.IsolatedLauncherProxy.invoke(IsolatedLauncherProxy.java:60)
	at com.sun.proxy.$Proxy23.start(Unknown Source)
	at org.sonarsource.scanner.api.EmbeddedScanner.doStart(EmbeddedScanner.java:220)
	at org.sonarsource.scanner.api.EmbeddedScanner.start(EmbeddedScanner.java:156)
	at org.sonarsource.scanner.maven.bootstrap.ScannerBootstrapper.execute(ScannerBootstrapper.java:60)
	at org.sonarsource.scanner.maven.SonarQubeMojo.execute(SonarQubeMojo.java:112)
	at org.apache.maven.plugin.DefaultBuildPluginManager.executeMojo(DefaultBuildPluginManager.java:134)
	... 21 more
[ERROR] 
[ERROR] Re-run Maven using the -X switch to enable full debug logging.
[ERROR] 
[ERROR] For more information about the errors and possible solutions, please read the following articles:
[ERROR] [Help 1] http://cwiki.apache.org/confluence/display/MAVEN/PluginContainerException
SonarQube analysis completed: FAILURE
Build step 'SonarQube analysis with Maven' changed build result to FAILURE
Build step 'SonarQube analysis with Maven' marked build as failure
[BFA] Scanning build for known causes...
[BFA] No failure causes found
[BFA] Done. 0s
Started calculate disk usage of build
Finished Calculation of disk usage of build in 0 seconds
Started calculate disk usage of workspace
Finished Calculation of disk usage of workspace in 0 seconds
Finished: FAILURE