SuccessConsole Output

Collecting metadata...
Metadata collection done.
Started calculate disk usage of build
Finished Calculation of disk usage of build in 0 seconds
Started calculate disk usage of workspace
Finished Calculation of disk usage of workspace in 0 seconds
[Checks API] No suitable checks publisher found.
[INFO] 
[INFO] ------------------------------------------------------------------------
[INFO] Building FhirValidator-Validation-Application 4.0.4-SNAPSHOT
[INFO] ------------------------------------------------------------------------
[INFO] 
[INFO] --- maven-clean-plugin:3.1.0:clean (default-clean) @ FhirValidator-Validation-Application ---
[INFO] Deleting /home/jenkins/.hudson/jobs/FhirValidator(HEAD)-R4/workspace/Fhir-Validator-Validation/FhirValidator-Validation-Application/target
[INFO] 
[INFO] --- maven-buildmetadata-plugin:1.1.0.IHE.3:provide-buildmetadata (default) @ FhirValidator-Validation-Application ---
[INFO] Executing: /bin/sh -c cd /home/jenkins/.hudson/jobs/FhirValidator(HEAD)-R4/workspace/Fhir-Validator-Validation/FhirValidator-Validation-Application && git whatchanged '--since=2020-08-27 23:23:08 +0000' '--until=2020-09-27 23:23:08 +0000' --date=iso -- '/home/jenkins/.hudson/jobs/FhirValidator(HEAD)-R4/workspace/Fhir-Validator-Validation/FhirValidator-Validation-Application'
[INFO] Working directory: /home/jenkins/.hudson/jobs/FhirValidator(HEAD)-R4/workspace/Fhir-Validator-Validation/FhirValidator-Validation-Application
[INFO] Writing properties '/home/jenkins/.hudson/jobs/FhirValidator(HEAD)-R4/workspace/Fhir-Validator-Validation/FhirValidator-Validation-Application/target/classes/META-INF/build.properties'...
[INFO] Writing XML report '/home/jenkins/.hudson/jobs/FhirValidator(HEAD)-R4/workspace/Fhir-Validator-Validation/FhirValidator-Validation-Application/target/buildmetadata.xml'...
[INFO] 
[INFO] --- jacoco-maven-plugin:0.7.9:prepare-agent (default-prepare-agent) @ FhirValidator-Validation-Application ---
[INFO] argLine set to -javaagent:/home/jenkins/.m2/repository/org/jacoco/org.jacoco.agent/0.7.9/org.jacoco.agent-0.7.9-runtime.jar=destfile=/home/jenkins/.hudson/jobs/FhirValidator(HEAD)-R4/workspace/Fhir-Validator-Validation/FhirValidator-Validation-Application/target/jacoco.exec
[INFO] 
[INFO] --- maven-resources-plugin:3.0.2:resources (default-resources) @ FhirValidator-Validation-Application ---
[INFO] Using 'UTF-8' encoding to copy filtered resources.
[INFO] Copying 1 resource
[INFO] 
[INFO] --- maven-compiler-plugin:3.5.1:compile (default-compile) @ FhirValidator-Validation-Application ---
[INFO] Changes detected - recompiling the module!
[INFO] Compiling 8 source files to /home/jenkins/.hudson/jobs/FhirValidator(HEAD)-R4/workspace/Fhir-Validator-Validation/FhirValidator-Validation-Application/target/classes
[INFO] 
[INFO] --- maven-resources-plugin:3.0.2:testResources (default-testResources) @ FhirValidator-Validation-Application ---
[INFO] Using 'UTF-8' encoding to copy filtered resources.
[INFO] Copying 39 resources
[INFO] 
[INFO] --- maven-compiler-plugin:3.5.1:testCompile (default-testCompile) @ FhirValidator-Validation-Application ---
[INFO] Changes detected - recompiling the module!
[INFO] Compiling 5 source files to /home/jenkins/.hudson/jobs/FhirValidator(HEAD)-R4/workspace/Fhir-Validator-Validation/FhirValidator-Validation-Application/target/test-classes
[INFO] 
[INFO] --- maven-surefire-plugin:2.21.0:test (default-test) @ FhirValidator-Validation-Application ---
[INFO] 
[INFO] -------------------------------------------------------
[INFO]  T E S T S
[INFO] -------------------------------------------------------
[INFO] Running net.ihe.gazelle.fhir.FhirURLValidatorTest
SLF4J: Failed to load class "org.slf4j.impl.StaticLoggerBinder".
SLF4J: Defaulting to no-operation (NOP) logger implementation
SLF4J: See http://www.slf4j.org/codes.html#StaticLoggerBinder for further details.
[INFO] Tests run: 42, Failures: 0, Errors: 0, Skipped: 0, Time elapsed: 0.046 s - in net.ihe.gazelle.fhir.FhirURLValidatorTest
[INFO] Running net.ihe.gazelle.fhir.FhirValidatorTest
<?xml version="1.0" encoding="UTF-8" standalone="yes"?>
<detailedResult>
    <DocumentValidXSD>
        <XSDMessage>
            <Severity>error</Severity>
            <Message>cvc-pattern-valid: Value '2017-11-12' is not facet-valid with respect to pattern '([0-9]([0-9]([0-9][1-9]|[1-9]0)|[1-9]00)|[1-9]000)-(0[1-9]|1[0-2])-(0[1-9]|[1-2][0-9]|3[0-1])T([01][0-9]|2[0-3]):[0-5][0-9]:([0-5][0-9]|60)(\.[0-9]+)?(Z|(\+|-)((0[0-9]|1[0-3]):[0-5][0-9]|14:00))' for type 'instant-primitive'.</Message>
            <columnNumber>32</columnNumber>
            <lineNumber>8</lineNumber>
        </XSDMessage>
        <XSDMessage>
            <Severity>error</Severity>
            <Message>cvc-attribute.3: The value '2017-11-12' of attribute 'value' on element 'start' is not valid with respect to its type, 'instant-primitive'.</Message>
            <columnNumber>32</columnNumber>
            <lineNumber>8</lineNumber>
        </XSDMessage>
        <XSDMessage>
            <Severity>error</Severity>
            <Message>cvc-pattern-valid: Value '2017-12-12' is not facet-valid with respect to pattern '([0-9]([0-9]([0-9][1-9]|[1-9]0)|[1-9]00)|[1-9]000)-(0[1-9]|1[0-2])-(0[1-9]|[1-2][0-9]|3[0-1])T([01][0-9]|2[0-3]):[0-5][0-9]:([0-5][0-9]|60)(\.[0-9]+)?(Z|(\+|-)((0[0-9]|1[0-3]):[0-5][0-9]|14:00))' for type 'instant-primitive'.</Message>
            <columnNumber>30</columnNumber>
            <lineNumber>9</lineNumber>
        </XSDMessage>
        <XSDMessage>
            <Severity>error</Severity>
            <Message>cvc-attribute.3: The value '2017-12-12' of attribute 'value' on element 'end' is not valid with respect to its type, 'instant-primitive'.</Message>
            <columnNumber>30</columnNumber>
            <lineNumber>9</lineNumber>
        </XSDMessage>
        <Result>FAILED</Result>
        <nbOfErrors>4</nbOfErrors>
        <nbOfWarnings>0</nbOfWarnings>
    </DocumentValidXSD>
    <DocumentWellFormed>
        <Result>PASSED</Result>
        <nbOfErrors>0</nbOfErrors>
    </DocumentWellFormed>
    <ValidationResultsOverview>
        <ValidationDate>2020, 09 27</ValidationDate>
        <ValidationTime>01:23:12</ValidationTime>
        <ValidationServiceName>Gazelle FHIR Validator</ValidationServiceName>
        <ValidationEngine>FHIR Resource XML (R4)</ValidationEngine>
        <ValidationTestResult>FAILED</ValidationTestResult>
        <ValidationServiceVersion>4.0.4-SNAPSHOT</ValidationServiceVersion>
    </ValidationResultsOverview>
</detailedResult>

<?xml version="1.0" encoding="UTF-8" standalone="yes"?>
<detailedResult>
    <DocumentWellFormed>
        <XSDMessage>
            <Severity>error</Severity>
            <Message>com.google.gson.stream.MalformedJsonException: Use JsonReader.setLenient(true) to accept malformed JSON at line 3 column 6 path $</Message>
        </XSDMessage>
        <Result>FAILED</Result>
        <nbOfErrors>1</nbOfErrors>
    </DocumentWellFormed>
</detailedResult>

<?xml version="1.0" encoding="UTF-8" standalone="yes"?>
<detailedResult>
    <DocumentValidXSD>
        <Result>PASSED</Result>
        <nbOfErrors>0</nbOfErrors>
        <nbOfWarnings>0</nbOfWarnings>
    </DocumentValidXSD>
    <DocumentWellFormed>
        <Result>PASSED</Result>
        <nbOfErrors>0</nbOfErrors>
    </DocumentWellFormed>
    <ValidationResultsOverview>
        <ValidationDate>2020, 09 27</ValidationDate>
        <ValidationTime>01:23:12</ValidationTime>
        <ValidationServiceName>Gazelle FHIR Validator</ValidationServiceName>
        <ValidationEngine>FHIR Resource XML (R4)</ValidationEngine>
        <ValidationTestResult>PASSED</ValidationTestResult>
        <ValidationServiceVersion>4.0.4-SNAPSHOT</ValidationServiceVersion>
    </ValidationResultsOverview>
</detailedResult>

<?xml version="1.0" encoding="UTF-8" standalone="yes"?>
<detailedResult>
    <DocumentValidXSD>
        <XSDMessage>
            <Severity>error</Severity>
            <Message>cvc-complex-type.2.4.a: Invalid content was found starting with element 'content'. One of '{"http://hl7.org/fhir":securityContext, "http://hl7.org/fhir":data}' is expected.</Message>
            <columnNumber>264</columnNumber>
            <lineNumber>1</lineNumber>
        </XSDMessage>
        <Result>FAILED</Result>
        <nbOfErrors>1</nbOfErrors>
        <nbOfWarnings>0</nbOfWarnings>
    </DocumentValidXSD>
    <DocumentWellFormed>
        <Result>PASSED</Result>
        <nbOfErrors>0</nbOfErrors>
    </DocumentWellFormed>
    <ValidationResultsOverview>
        <ValidationDate>2020, 09 27</ValidationDate>
        <ValidationTime>01:23:12</ValidationTime>
        <ValidationServiceName>Gazelle FHIR Validator</ValidationServiceName>
        <ValidationEngine>FHIR Resource XML (R4)</ValidationEngine>
        <ValidationTestResult>FAILED</ValidationTestResult>
        <ValidationServiceVersion>4.0.4-SNAPSHOT</ValidationServiceVersion>
    </ValidationResultsOverview>
</detailedResult>

<?xml version="1.0" encoding="UTF-8" standalone="yes"?>
<detailedResult>
    <DocumentWellFormed>
        <XSDMessage>
            <Severity>error</Severity>
            <Message>com.google.gson.stream.MalformedJsonException: Use JsonReader.setLenient(true) to accept malformed JSON at line 2 column 20 path $</Message>
        </XSDMessage>
        <Result>FAILED</Result>
        <nbOfErrors>1</nbOfErrors>
    </DocumentWellFormed>
</detailedResult>

<?xml version="1.0" encoding="UTF-8" standalone="yes"?>
<detailedResult>
    <DocumentValidXSD>
        <XSDMessage>
            <Severity>error</Severity>
            <Message>cvc-complex-type.2.4.a: Invalid content was found starting with element 'indexed'. One of '{"http://hl7.org/fhir":date, "http://hl7.org/fhir":author, "http://hl7.org/fhir":authenticator, "http://hl7.org/fhir":custodian, "http://hl7.org/fhir":relatesTo, "http://hl7.org/fhir":description, "http://hl7.org/fhir":securityLabel, "http://hl7.org/fhir":content}' is expected.</Message>
            <columnNumber>52</columnNumber>
            <lineNumber>40</lineNumber>
        </XSDMessage>
        <Result>FAILED</Result>
        <nbOfErrors>1</nbOfErrors>
        <nbOfWarnings>0</nbOfWarnings>
    </DocumentValidXSD>
    <DocumentWellFormed>
        <Result>PASSED</Result>
        <nbOfErrors>0</nbOfErrors>
    </DocumentWellFormed>
    <ValidationResultsOverview>
        <ValidationDate>2020, 09 27</ValidationDate>
        <ValidationTime>01:23:12</ValidationTime>
        <ValidationServiceName>Gazelle FHIR Validator</ValidationServiceName>
        <ValidationEngine>FHIR Resource XML (R4)</ValidationEngine>
        <ValidationTestResult>FAILED</ValidationTestResult>
        <ValidationServiceVersion>4.0.4-SNAPSHOT</ValidationServiceVersion>
    </ValidationResultsOverview>
</detailedResult>

<?xml version="1.0" encoding="UTF-8" standalone="yes"?>
<detailedResult>
    <DocumentValidXSD>
        <XSDMessage>
            <Severity>error</Severity>
            <Message>cvc-enumeration-valid: Value '[code]' is not facet-valid with respect to enumeration '[planned, arrived, triaged, in-progress, onleave, finished, cancelled, entered-in-error, unknown]'. It must be a value from the enumeration.</Message>
            <columnNumber>27</columnNumber>
            <lineNumber>5</lineNumber>
        </XSDMessage>
        <XSDMessage>
            <Severity>error</Severity>
            <Message>cvc-attribute.3: The value '[code]' of attribute 'value' on element 'status' is not valid with respect to its type, 'EncounterStatus-list'.</Message>
            <columnNumber>27</columnNumber>
            <lineNumber>5</lineNumber>
        </XSDMessage>
        <XSDMessage>
            <Severity>error</Severity>
            <Message>cvc-enumeration-valid: Value '[code]' is not facet-valid with respect to enumeration '[planned, arrived, triaged, in-progress, onleave, finished, cancelled, entered-in-error, unknown]'. It must be a value from the enumeration.</Message>
            <columnNumber>29</columnNumber>
            <lineNumber>8</lineNumber>
        </XSDMessage>
        <XSDMessage>
            <Severity>error</Severity>
            <Message>cvc-attribute.3: The value '[code]' of attribute 'value' on element 'status' is not valid with respect to its type, 'EncounterStatus-list'.</Message>
            <columnNumber>29</columnNumber>
            <lineNumber>8</lineNumber>
        </XSDMessage>
        <XSDMessage>
            <Severity>error</Severity>
            <Message>cvc-complex-type.2.4.a: Invalid content was found starting with element 'incomingReferral'. One of '{"http://hl7.org/fhir":episodeOfCare, "http://hl7.org/fhir":basedOn, "http://hl7.org/fhir":participant, "http://hl7.org/fhir":appointment, "http://hl7.org/fhir":period, "http://hl7.org/fhir":length, "http://hl7.org/fhir":reasonCode, "http://hl7.org/fhir":reasonReference, "http://hl7.org/fhir":diagnosis, "http://hl7.org/fhir":account, "http://hl7.org/fhir":hospitalization, "http://hl7.org/fhir":location, "http://hl7.org/fhir":serviceProvider, "http://hl7.org/fhir":partOf}' is expected.</Message>
            <columnNumber>21</columnNumber>
            <lineNumber>21</lineNumber>
        </XSDMessage>
        <XSDMessage>
            <Severity>error</Severity>
            <Message>cvc-complex-type.2.4.a: Invalid content was found starting with element 'role'. One of '{"http://hl7.org/fhir":use, "http://hl7.org/fhir":rank}' is expected.</Message>
            <columnNumber>11</columnNumber>
            <lineNumber>35</lineNumber>
        </XSDMessage>
        <XSDMessage>
            <Severity>error</Severity>
            <Message>cvc-pattern-valid: Value '[positiveInt]' is not facet-valid with respect to pattern '[1-9][0-9]*' for type 'positiveInt-primitive'.</Message>
            <columnNumber>34</columnNumber>
            <lineNumber>36</lineNumber>
        </XSDMessage>
        <XSDMessage>
            <Severity>error</Severity>
            <Message>cvc-attribute.3: The value '[positiveInt]' of attribute 'value' on element 'rank' is not valid with respect to its type, 'positiveInt-primitive'.</Message>
            <columnNumber>34</columnNumber>
            <lineNumber>36</lineNumber>
        </XSDMessage>
        <XSDMessage>
            <Severity>error</Severity>
            <Message>cvc-enumeration-valid: Value '[code]' is not facet-valid with respect to enumeration '[planned, active, reserved, completed]'. It must be a value from the enumeration.</Message>
            <columnNumber>29</columnNumber>
            <lineNumber>54</lineNumber>
        </XSDMessage>
        <XSDMessage>
            <Severity>error</Severity>
            <Message>cvc-attribute.3: The value '[code]' of attribute 'value' on element 'status' is not valid with respect to its type, 'EncounterLocationStatus-list'.</Message>
            <columnNumber>29</columnNumber>
            <lineNumber>54</lineNumber>
        </XSDMessage>
        <XSDMessage>
            <Severity>error</Severity>
            <Message>cvc-complex-type.2.3: Element 'Encounter' cannot have character [children], because the type's content type is element-only.</Message>
            <columnNumber>13</columnNumber>
            <lineNumber>59</lineNumber>
        </XSDMessage>
        <Result>FAILED</Result>
        <nbOfErrors>11</nbOfErrors>
        <nbOfWarnings>0</nbOfWarnings>
    </DocumentValidXSD>
    <DocumentWellFormed>
        <Result>PASSED</Result>
        <nbOfErrors>0</nbOfErrors>
    </DocumentWellFormed>
    <ValidationResultsOverview>
        <ValidationDate>2020, 09 27</ValidationDate>
        <ValidationTime>01:23:12</ValidationTime>
        <ValidationServiceName>Gazelle FHIR Validator</ValidationServiceName>
        <ValidationEngine>FHIR Resource XML (R4)</ValidationEngine>
        <ValidationTestResult>FAILED</ValidationTestResult>
        <ValidationServiceVersion>4.0.4-SNAPSHOT</ValidationServiceVersion>
    </ValidationResultsOverview>
</detailedResult>

<?xml version="1.0" encoding="UTF-8" standalone="yes"?>
<detailedResult>
    <DocumentValidXSD>
        <XSDMessage>
            <Severity>error</Severity>
            <Message>cvc-complex-type.2.4.a: Invalid content was found starting with element 'context'. One of '{"http://hl7.org/fhir":focus, "http://hl7.org/fhir":encounter, "http://hl7.org/fhir":effectiveDateTime, "http://hl7.org/fhir":effectivePeriod, "http://hl7.org/fhir":effectiveTiming, "http://hl7.org/fhir":effectiveInstant, "http://hl7.org/fhir":issued, "http://hl7.org/fhir":performer, "http://hl7.org/fhir":valueQuantity, "http://hl7.org/fhir":valueCodeableConcept, "http://hl7.org/fhir":valueString, "http://hl7.org/fhir":valueBoolean, "http://hl7.org/fhir":valueInteger, "http://hl7.org/fhir":valueRange, "http://hl7.org/fhir":valueRatio, "http://hl7.org/fhir":valueSampledData, "http://hl7.org/fhir":valueTime, "http://hl7.org/fhir":valueDateTime, "http://hl7.org/fhir":valuePeriod, "http://hl7.org/fhir":dataAbsentReason, "http://hl7.org/fhir":interpretation, "http://hl7.org/fhir":note, "http://hl7.org/fhir":bodySite, "http://hl7.org/fhir":method, "http://hl7.org/fhir":specimen, "http://hl7.org/fhir":device, "http://hl7.org/fhir":referenceRange, "http://hl7.org/fhir":hasMember, "http://hl7.org/fhir":derivedFrom, "http://hl7.org/fhir":component}' is expected.</Message>
            <columnNumber>12</columnNumber>
            <lineNumber>56</lineNumber>
        </XSDMessage>
        <Result>FAILED</Result>
        <nbOfErrors>1</nbOfErrors>
        <nbOfWarnings>0</nbOfWarnings>
    </DocumentValidXSD>
    <DocumentWellFormed>
        <Result>PASSED</Result>
        <nbOfErrors>0</nbOfErrors>
    </DocumentWellFormed>
    <ValidationResultsOverview>
        <ValidationDate>2020, 09 27</ValidationDate>
        <ValidationTime>01:23:12</ValidationTime>
        <ValidationServiceName>Gazelle FHIR Validator</ValidationServiceName>
        <ValidationEngine>FHIR Resource XML (R4)</ValidationEngine>
        <ValidationTestResult>FAILED</ValidationTestResult>
        <ValidationServiceVersion>4.0.4-SNAPSHOT</ValidationServiceVersion>
    </ValidationResultsOverview>
</detailedResult>

<?xml version="1.0" encoding="UTF-8" standalone="yes"?>
<detailedResult>
    <DocumentValidXSD>
        <XSDMessage>
            <Severity>error</Severity>
            <Message>cvc-complex-type.2.4.a: Invalid content was found starting with element 'display'. One of '{"http://hl7.org/fhir":period, "http://hl7.org/fhir":assigner}' is expected.</Message>
            <columnNumber>50</columnNumber>
            <lineNumber>36</lineNumber>
        </XSDMessage>
        <Result>FAILED</Result>
        <nbOfErrors>1</nbOfErrors>
        <nbOfWarnings>0</nbOfWarnings>
    </DocumentValidXSD>
    <DocumentWellFormed>
        <Result>PASSED</Result>
        <nbOfErrors>0</nbOfErrors>
    </DocumentWellFormed>
    <ValidationResultsOverview>
        <ValidationDate>2020, 09 27</ValidationDate>
        <ValidationTime>01:23:12</ValidationTime>
        <ValidationServiceName>Gazelle FHIR Validator</ValidationServiceName>
        <ValidationEngine>FHIR Resource XML (R4)</ValidationEngine>
        <ValidationTestResult>FAILED</ValidationTestResult>
        <ValidationServiceVersion>4.0.4-SNAPSHOT</ValidationServiceVersion>
    </ValidationResultsOverview>
</detailedResult>

<?xml version="1.0" encoding="UTF-8" standalone="yes"?>
<detailedResult>
    <DocumentValidXSD>
        <Result>PASSED</Result>
        <nbOfErrors>0</nbOfErrors>
        <nbOfWarnings>0</nbOfWarnings>
    </DocumentValidXSD>
    <DocumentWellFormed>
        <Result>PASSED</Result>
        <nbOfErrors>0</nbOfErrors>
    </DocumentWellFormed>
    <ValidationResultsOverview>
        <ValidationDate>2020, 09 27</ValidationDate>
        <ValidationTime>01:23:12</ValidationTime>
        <ValidationServiceName>Gazelle FHIR Validator</ValidationServiceName>
        <ValidationEngine>FHIR Resource XML (R4)</ValidationEngine>
        <ValidationTestResult>PASSED</ValidationTestResult>
        <ValidationServiceVersion>4.0.4-SNAPSHOT</ValidationServiceVersion>
    </ValidationResultsOverview>
</detailedResult>

<?xml version="1.0" encoding="UTF-8" standalone="yes"?>
<detailedResult>
    <DocumentValidXSD>
        <XSDMessage>
            <Severity>error</Severity>
            <Message>cvc-complex-type.2.4.a: Invalid content was found starting with element 'content'. One of '{"http://hl7.org/fhir":securityContext, "http://hl7.org/fhir":data}' is expected.</Message>
            <columnNumber>36</columnNumber>
            <lineNumber>3</lineNumber>
        </XSDMessage>
        <Result>FAILED</Result>
        <nbOfErrors>1</nbOfErrors>
        <nbOfWarnings>0</nbOfWarnings>
    </DocumentValidXSD>
    <DocumentWellFormed>
        <Result>PASSED</Result>
        <nbOfErrors>0</nbOfErrors>
    </DocumentWellFormed>
    <ValidationResultsOverview>
        <ValidationDate>2020, 09 27</ValidationDate>
        <ValidationTime>01:23:12</ValidationTime>
        <ValidationServiceName>Gazelle FHIR Validator</ValidationServiceName>
        <ValidationEngine>FHIR Resource XML (R4)</ValidationEngine>
        <ValidationTestResult>FAILED</ValidationTestResult>
        <ValidationServiceVersion>4.0.4-SNAPSHOT</ValidationServiceVersion>
    </ValidationResultsOverview>
</detailedResult>

<?xml version="1.0" encoding="UTF-8" standalone="yes"?>
<detailedResult>
    <DocumentValidXSD>
        <Result>PASSED</Result>
        <nbOfErrors>0</nbOfErrors>
        <nbOfWarnings>0</nbOfWarnings>
    </DocumentValidXSD>
    <DocumentWellFormed>
        <Result>PASSED</Result>
        <nbOfErrors>0</nbOfErrors>
    </DocumentWellFormed>
    <ValidationResultsOverview>
        <ValidationDate>2020, 09 27</ValidationDate>
        <ValidationTime>01:23:12</ValidationTime>
        <ValidationServiceName>Gazelle FHIR Validator</ValidationServiceName>
        <ValidationEngine>FHIR Resource XML (R4)</ValidationEngine>
        <ValidationTestResult>PASSED</ValidationTestResult>
        <ValidationServiceVersion>4.0.4-SNAPSHOT</ValidationServiceVersion>
    </ValidationResultsOverview>
</detailedResult>

[INFO] Tests run: 12, Failures: 0, Errors: 0, Skipped: 0, Time elapsed: 1.254 s - in net.ihe.gazelle.fhir.FhirValidatorTest
[INFO] Running net.ihe.gazelle.fhir.operationoutcome.OperationOutcomeValidatorTest
<?xml version="1.0" encoding="UTF-8" standalone="yes"?>
<detailedResult>
    <DocumentValidXSD>
        <XSDMessage>
            <Severity>error</Severity>
            <Message>cvc-complex-type.2.4.a: Invalid content was found starting with element 'diagnostics'. One of '{"http://hl7.org/fhir":code}' is expected.</Message>
            <columnNumber>54</columnNumber>
            <lineNumber>4</lineNumber>
        </XSDMessage>
        <Result>FAILED</Result>
        <nbOfErrors>1</nbOfErrors>
        <nbOfWarnings>0</nbOfWarnings>
    </DocumentValidXSD>
    <DocumentWellFormed>
        <Result>PASSED</Result>
        <nbOfErrors>0</nbOfErrors>
    </DocumentWellFormed>
    <MDAValidation>
        <Note>
            <Location>/</Location>
            <Description>The root element shall be an OperationOutcome</Description>
            <Identifiant>constraint_operationoutcome_resourceName</Identifiant>
            <assertion idScheme="OO" assertionId="OO-002"/>
        </Note>
        <Note>
            <Location>/OperationOutcome/severity</Location>
            <Description>The operationOutcome shall report an error</Description>
            <Identifiant>constraint_operationoutcome_severity_error</Identifiant>
            <assertion idScheme="OO" assertionId="OO-003"/>
        </Note>
        <Note>
            <Location>/OperationOutcome</Location>
            <Description>The detailed reason of the failure may be reported in a diagnostics element</Description>
            <Identifiant>constraint_operationoutcome_diagnostics_present</Identifiant>
            <assertion idScheme="OO" assertionId="OO-001"/>
        </Note>
        <Result>PASSED</Result>
        <ValidationCounters>
            <NrOfChecks>3</NrOfChecks>
            <NrOfValidationErrors>0</NrOfValidationErrors>
            <NrOfValidationWarnings>0</NrOfValidationWarnings>
            <NrOfValidationInfos>0</NrOfValidationInfos>
        </ValidationCounters>
    </MDAValidation>
    <ValidationResultsOverview>
        <ValidationDate>2020, 09 27</ValidationDate>
        <ValidationTime>01:23:14</ValidationTime>
        <ValidationServiceName>Gazelle FHIR Validator</ValidationServiceName>
        <ValidationEngine>Operation Outcome XML</ValidationEngine>
        <ValidationTestResult>FAILED</ValidationTestResult>
        <ValidationServiceVersion>4.0.4-SNAPSHOT</ValidationServiceVersion>
    </ValidationResultsOverview>
</detailedResult>

[INFO] Tests run: 8, Failures: 0, Errors: 0, Skipped: 0, Time elapsed: 1.665 s - in net.ihe.gazelle.fhir.operationoutcome.OperationOutcomeValidatorTest
[INFO] 
[INFO] Results:
[INFO] 
[INFO] Tests run: 62, Failures: 0, Errors: 0, Skipped: 0
[INFO] 
[JENKINS] Recording test results
[INFO] 
[INFO] --- jacoco-maven-plugin:0.7.9:report (default-report) @ FhirValidator-Validation-Application ---
[INFO] Loading execution data file /home/jenkins/.hudson/jobs/FhirValidator(HEAD)-R4/workspace/Fhir-Validator-Validation/FhirValidator-Validation-Application/target/jacoco.exec
[INFO] Analyzed bundle 'FhirValidator-Validation-Application' with 9 classes
[INFO] 
[INFO] --- maven-jar-plugin:3.0.2:jar (default-jar) @ FhirValidator-Validation-Application ---
[INFO] Building jar: /home/jenkins/.hudson/jobs/FhirValidator(HEAD)-R4/workspace/Fhir-Validator-Validation/FhirValidator-Validation-Application/target/FhirValidator-Validation-Application.jar
[INFO] 
[INFO] --- maven-jar-plugin:3.0.2:test-jar (default) @ FhirValidator-Validation-Application ---
[INFO] Building jar: /home/jenkins/.hudson/jobs/FhirValidator(HEAD)-R4/workspace/Fhir-Validator-Validation/FhirValidator-Validation-Application/target/FhirValidator-Validation-Application-tests.jar
[INFO] 
[INFO] --- maven-install-plugin:2.4:install (default-install) @ FhirValidator-Validation-Application ---
[INFO] Installing /home/jenkins/.hudson/jobs/FhirValidator(HEAD)-R4/workspace/Fhir-Validator-Validation/FhirValidator-Validation-Application/target/FhirValidator-Validation-Application.jar to /home/jenkins/.m2/repository/net/ihe/gazelle/validator/FhirValidator-Validation-Application/4.0.4-SNAPSHOT/FhirValidator-Validation-Application-4.0.4-SNAPSHOT.jar
[INFO] Installing /home/jenkins/.hudson/jobs/FhirValidator(HEAD)-R4/workspace/Fhir-Validator-Validation/FhirValidator-Validation-Application/pom.xml to /home/jenkins/.m2/repository/net/ihe/gazelle/validator/FhirValidator-Validation-Application/4.0.4-SNAPSHOT/FhirValidator-Validation-Application-4.0.4-SNAPSHOT.pom
[INFO] Installing /home/jenkins/.hudson/jobs/FhirValidator(HEAD)-R4/workspace/Fhir-Validator-Validation/FhirValidator-Validation-Application/target/FhirValidator-Validation-Application-tests.jar to /home/jenkins/.m2/repository/net/ihe/gazelle/validator/FhirValidator-Validation-Application/4.0.4-SNAPSHOT/FhirValidator-Validation-Application-4.0.4-SNAPSHOT-tests.jar
Collecting metadata...
Metadata collection done.
Started calculate disk usage of build
Finished Calculation of disk usage of build in 0 seconds
Started calculate disk usage of workspace
Finished Calculation of disk usage of workspace in 0 seconds
[Checks API] No suitable checks publisher found.
[INFO] ------------------------------------------------------------------------
[INFO] Reactor Summary:
[INFO] 
[INFO] FhirValidator ...................................... SUCCESS [  3.477 s]
[INFO] Fhir-Validator-Common .............................. SUCCESS [  0.596 s]
[INFO] Fhir-Validator-Common-Business ..................... SUCCESS [  2.597 s]
[INFO] Fhir-Validator-Common-Application .................. SUCCESS [  1.513 s]
[INFO] Fhir-Validator-Common-Adapter ...................... SUCCESS [01:09 min]
[INFO] Fhir-Validator-Common-Peripherals .................. SUCCESS [ 18.371 s]
[INFO] Fhir-Validator-Definition .......................... SUCCESS [  0.951 s]
[INFO] Fhir-Validator-Definition-Application .............. SUCCESS [  1.532 s]
[INFO] Fhir-Validator-Definition-Adapter .................. SUCCESS [  2.453 s]
[INFO] FhirValidator - WAR ................................ SUCCESS [ 39.259 s]
[INFO] Fhir-Validator-Validation .......................... SUCCESS [  0.783 s]
[INFO] FhirValidator-Validation-Application ............... SUCCESS [  7.619 s]
[INFO] Fhir-Validator-Validation-Peripherals .............. SUCCESS [  2.198 s]
[INFO] FhirValidator - EAR ................................ SUCCESS [  4.526 s]
[INFO] ------------------------------------------------------------------------
[INFO] BUILD SUCCESS
[INFO] ------------------------------------------------------------------------
[INFO] Total time: 02:46 min
[INFO] Finished at: 2020-09-27T01:23:26+02:00
[INFO] Final Memory: 64M/1506M
[INFO] ------------------------------------------------------------------------
Waiting for Jenkins to finish collecting data