FailedConsole Output

Skipping 33 KB.. Full Log
jectorImpl.java:1016)
    at com.google.inject.internal.InjectorImpl.callInContext (InjectorImpl.java:1103)
    at com.google.inject.internal.InjectorImpl$2.get (InjectorImpl.java:1012)
    at com.google.inject.internal.InjectorImpl.getInstance (InjectorImpl.java:1051)
    at org.eclipse.sisu.space.AbstractDeferredClass.get (AbstractDeferredClass.java:48)
    at com.google.inject.internal.ProviderInternalFactory.provision (ProviderInternalFactory.java:81)
    at com.google.inject.internal.InternalFactoryToInitializableAdapter.provision (InternalFactoryToInitializableAdapter.java:53)
    at com.google.inject.internal.ProviderInternalFactory$1.call (ProviderInternalFactory.java:65)
    at com.google.inject.internal.ProvisionListenerStackCallback$Provision.provision (ProvisionListenerStackCallback.java:115)
    at org.eclipse.sisu.bean.BeanScheduler$CycleActivator.onProvision (BeanScheduler.java:230)
    at com.google.inject.internal.ProvisionListenerStackCallback$Provision.provision (ProvisionListenerStackCallback.java:126)
    at com.google.inject.internal.ProvisionListenerStackCallback.provision (ProvisionListenerStackCallback.java:68)
    at com.google.inject.internal.ProviderInternalFactory.circularGet (ProviderInternalFactory.java:63)
    at com.google.inject.internal.InternalFactoryToInitializableAdapter.get (InternalFactoryToInitializableAdapter.java:45)
    at com.google.inject.internal.ProviderToInternalFactoryAdapter$1.call (ProviderToInternalFactoryAdapter.java:46)
    at com.google.inject.internal.InjectorImpl.callInContext (InjectorImpl.java:1103)
    at com.google.inject.internal.ProviderToInternalFactoryAdapter.get (ProviderToInternalFactoryAdapter.java:40)
    at com.google.inject.internal.SingletonScope$1.get (SingletonScope.java:145)
    at com.google.inject.internal.InternalFactoryToProviderAdapter.get (InternalFactoryToProviderAdapter.java:41)
    at com.google.inject.internal.InjectorImpl$2$1.call (InjectorImpl.java:1016)
    at com.google.inject.internal.InjectorImpl.callInContext (InjectorImpl.java:1092)
    at com.google.inject.internal.InjectorImpl$2.get (InjectorImpl.java:1012)
    at org.eclipse.sisu.inject.LazyBeanEntry.getValue (LazyBeanEntry.java:81)
    at org.eclipse.sisu.plexus.LazyPlexusBean.getValue (LazyPlexusBean.java:51)
    at org.eclipse.sisu.wire.EntryListAdapter$ValueIterator.next (EntryListAdapter.java:111)
    at org.apache.maven.plugin.assembly.archive.DefaultAssemblyArchiver.createArchive (DefaultAssemblyArchiver.java:181)
    at org.apache.maven.plugin.assembly.mojos.AbstractAssemblyMojo.execute (AbstractAssemblyMojo.java:436)
    at org.apache.maven.plugin.DefaultBuildPluginManager.executeMojo (DefaultBuildPluginManager.java:134)
    at org.apache.maven.lifecycle.internal.MojoExecutor.execute (MojoExecutor.java:208)
    at org.apache.maven.lifecycle.internal.MojoExecutor.execute (MojoExecutor.java:154)
    at org.apache.maven.lifecycle.internal.MojoExecutor.execute (MojoExecutor.java:146)
    at org.apache.maven.lifecycle.internal.LifecycleModuleBuilder.buildProject (LifecycleModuleBuilder.java:117)
    at org.apache.maven.lifecycle.internal.LifecycleModuleBuilder.buildProject (LifecycleModuleBuilder.java:81)
    at org.apache.maven.lifecycle.internal.builder.singlethreaded.SingleThreadedBuilder.build (SingleThreadedBuilder.java:51)
    at org.apache.maven.lifecycle.internal.LifecycleStarter.execute (LifecycleStarter.java:128)
    at org.apache.maven.DefaultMaven.doExecute (DefaultMaven.java:309)
    at org.apache.maven.DefaultMaven.doExecute (DefaultMaven.java:194)
    at org.apache.maven.DefaultMaven.execute (DefaultMaven.java:107)
    at org.jvnet.hudson.maven3.launcher.Maven35Launcher.main (Maven35Launcher.java:130)
    at sun.reflect.NativeMethodAccessorImpl.invoke0 (Native Method)
    at sun.reflect.NativeMethodAccessorImpl.invoke (NativeMethodAccessorImpl.java:62)
    at sun.reflect.DelegatingMethodAccessorImpl.invoke (DelegatingMethodAccessorImpl.java:43)
    at java.lang.reflect.Method.invoke (Method.java:498)
    at org.codehaus.plexus.classworlds.launcher.Launcher.launchEnhanced (Launcher.java:289)
    at org.codehaus.plexus.classworlds.launcher.Launcher.launch (Launcher.java:229)
    at jenkins.maven3.agent.Maven35Main.launch (Maven35Main.java:178)
    at sun.reflect.NativeMethodAccessorImpl.invoke0 (Native Method)
    at sun.reflect.NativeMethodAccessorImpl.invoke (NativeMethodAccessorImpl.java:62)
    at sun.reflect.DelegatingMethodAccessorImpl.invoke (DelegatingMethodAccessorImpl.java:43)
    at java.lang.reflect.Method.invoke (Method.java:498)
    at hudson.maven.Maven3Builder.call (Maven3Builder.java:139)
    at hudson.maven.Maven3Builder.call (Maven3Builder.java:70)
    at hudson.remoting.UserRequest.perform (UserRequest.java:212)
    at hudson.remoting.UserRequest.perform (UserRequest.java:54)
    at hudson.remoting.Request$2.run (Request.java:369)
    at hudson.remoting.InterceptingExecutorService$1.call (InterceptingExecutorService.java:72)
    at java.util.concurrent.FutureTask.run (FutureTask.java:266)
    at java.util.concurrent.ThreadPoolExecutor.runWorker (ThreadPoolExecutor.java:1149)
    at java.util.concurrent.ThreadPoolExecutor$Worker.run (ThreadPoolExecutor.java:624)
    at java.lang.Thread.run (Thread.java:748)
[DEBUG] No dependency sets specified.
[INFO] Building zip: /home/jenkins/.hudson/jobs/Gazelle HL7 Validator IGAMT/workspace/target/GazelleHL7v2Validator-metadata.zip
[DEBUG] adding entry build.properties
Collecting metadata...
Metadata collection done.
Started calculate disk usage of build
Finished Calculation of disk usage of build in 0 seconds
Started calculate disk usage of workspace
Finished Calculation of disk usage of workspace in 0 seconds
[INFO] 
[INFO] ------------------------------------------------------------------------
[INFO] Building gazelle-hl7-validator-report-jar 3.6.0-SNAPSHOT
[INFO] ------------------------------------------------------------------------
[INFO] 
[INFO] --- maven-clean-plugin:3.0.0:clean (default-clean) @ gazelle-hl7-validator-report-jar ---
[INFO] Deleting /home/jenkins/.hudson/jobs/Gazelle HL7 Validator IGAMT/workspace/gazelle-hl7-validator-report-jar/target
[INFO] Deleting file /home/jenkins/.hudson/jobs/Gazelle HL7 Validator IGAMT/workspace/gazelle-hl7-validator-report-jar/target/maven-archiver/pom.properties
[INFO] Deleting directory /home/jenkins/.hudson/jobs/Gazelle HL7 Validator IGAMT/workspace/gazelle-hl7-validator-report-jar/target/maven-archiver
[INFO] Deleting file /home/jenkins/.hudson/jobs/Gazelle HL7 Validator IGAMT/workspace/gazelle-hl7-validator-report-jar/target/classes/net/ihe/gazelle/hl7/validation/context/ProfileDefinition.class
[INFO] Deleting file /home/jenkins/.hudson/jobs/Gazelle HL7 Validator IGAMT/workspace/gazelle-hl7-validator-report-jar/target/classes/net/ihe/gazelle/hl7/validation/context/ValidationOptions.class
[INFO] Deleting file /home/jenkins/.hudson/jobs/Gazelle HL7 Validator IGAMT/workspace/gazelle-hl7-validator-report-jar/target/classes/net/ihe/gazelle/hl7/validation/context/ValidationType.class
[INFO] Deleting file /home/jenkins/.hudson/jobs/Gazelle HL7 Validator IGAMT/workspace/gazelle-hl7-validator-report-jar/target/classes/net/ihe/gazelle/hl7/validation/context/ValidationContext.class
[INFO] Deleting directory /home/jenkins/.hudson/jobs/Gazelle HL7 Validator IGAMT/workspace/gazelle-hl7-validator-report-jar/target/classes/net/ihe/gazelle/hl7/validation/context
[INFO] Deleting directory /home/jenkins/.hudson/jobs/Gazelle HL7 Validator IGAMT/workspace/gazelle-hl7-validator-report-jar/target/classes/net/ihe/gazelle/hl7/validation
[INFO] Deleting file /home/jenkins/.hudson/jobs/Gazelle HL7 Validator IGAMT/workspace/gazelle-hl7-validator-report-jar/target/classes/net/ihe/gazelle/hl7/assertion/AssertionType.class
[INFO] Deleting file /home/jenkins/.hudson/jobs/Gazelle HL7 Validator IGAMT/workspace/gazelle-hl7-validator-report-jar/target/classes/net/ihe/gazelle/hl7/assertion/GazelleHL7Assertion.class
[INFO] Deleting directory /home/jenkins/.hudson/jobs/Gazelle HL7 Validator IGAMT/workspace/gazelle-hl7-validator-report-jar/target/classes/net/ihe/gazelle/hl7/assertion
[INFO] Deleting file /home/jenkins/.hudson/jobs/Gazelle HL7 Validator IGAMT/workspace/gazelle-hl7-validator-report-jar/target/classes/net/ihe/gazelle/hl7/exception/GazelleHL7Exception.class
[INFO] Deleting file /home/jenkins/.hudson/jobs/Gazelle HL7 Validator IGAMT/workspace/gazelle-hl7-validator-report-jar/target/classes/net/ihe/gazelle/hl7/exception/GazelleErrorCode.class
[INFO] Deleting directory /home/jenkins/.hudson/jobs/Gazelle HL7 Validator IGAMT/workspace/gazelle-hl7-validator-report-jar/target/classes/net/ihe/gazelle/hl7/exception
[INFO] Deleting file /home/jenkins/.hudson/jobs/Gazelle HL7 Validator IGAMT/workspace/gazelle-hl7-validator-report-jar/target/classes/net/ihe/gazelle/hl7/utils/PathBuilder.class
[INFO] Deleting directory /home/jenkins/.hudson/jobs/Gazelle HL7 Validator IGAMT/workspace/gazelle-hl7-validator-report-jar/target/classes/net/ihe/gazelle/hl7/utils
[INFO] Deleting file /home/jenkins/.hudson/jobs/Gazelle HL7 Validator IGAMT/workspace/gazelle-hl7-validator-report-jar/target/classes/net/ihe/gazelle/hl7/validator/report/Warning.class
[INFO] Deleting file /home/jenkins/.hudson/jobs/Gazelle HL7 Validator IGAMT/workspace/gazelle-hl7-validator-report-jar/target/classes/net/ihe/gazelle/hl7/validator/report/UsedResource.class
[INFO] Deleting file /home/jenkins/.hudson/jobs/Gazelle HL7 Validator IGAMT/workspace/gazelle-hl7-validator-report-jar/target/classes/net/ihe/gazelle/hl7/validator/report/ValidationStatus.class
[INFO] Deleting file /home/jenkins/.hudson/jobs/Gazelle HL7 Validator IGAMT/workspace/gazelle-hl7-validator-report-jar/target/classes/net/ihe/gazelle/hl7/validator/report/ValidationResultsOverview.class
[INFO] Deleting file /home/jenkins/.hudson/jobs/Gazelle HL7 Validator IGAMT/workspace/gazelle-hl7-validator-report-jar/target/classes/net/ihe/gazelle/hl7/validator/report/Error.class
[INFO] Deleting file /home/jenkins/.hudson/jobs/Gazelle HL7 Validator IGAMT/workspace/gazelle-hl7-validator-report-jar/target/classes/net/ihe/gazelle/hl7/validator/report/ValidationResults$1.class
[INFO] Deleting file /home/jenkins/.hudson/jobs/Gazelle HL7 Validator IGAMT/workspace/gazelle-hl7-validator-report-jar/target/classes/net/ihe/gazelle/hl7/validator/report/ValidationResults.class
[INFO] Deleting file /home/jenkins/.hudson/jobs/Gazelle HL7 Validator IGAMT/workspace/gazelle-hl7-validator-report-jar/target/classes/net/ihe/gazelle/hl7/validator/report/GazelleProfileException.class
[INFO] Deleting file /home/jenkins/.hudson/jobs/Gazelle HL7 Validator IGAMT/workspace/gazelle-hl7-validator-report-jar/target/classes/net/ihe/gazelle/hl7/validator/report/HL7v2ValidationReport.class
[INFO] Deleting file /home/jenkins/.hudson/jobs/Gazelle HL7 Validator IGAMT/workspace/gazelle-hl7-validator-report-jar/target/classes/net/ihe/gazelle/hl7/validator/report/UsedResources.class
[INFO] Deleting file /home/jenkins/.hudson/jobs/Gazelle HL7 Validator IGAMT/workspace/gazelle-hl7-validator-report-jar/target/classes/net/ihe/gazelle/hl7/validator/report/ValidationCounters.class
[INFO] Deleting directory /home/jenkins/.hudson/jobs/Gazelle HL7 Validator IGAMT/workspace/gazelle-hl7-validator-report-jar/target/classes/net/ihe/gazelle/hl7/validator/report
[INFO] Deleting directory /home/jenkins/.hudson/jobs/Gazelle HL7 Validator IGAMT/workspace/gazelle-hl7-validator-report-jar/target/classes/net/ihe/gazelle/hl7/validator
[INFO] Deleting directory /home/jenkins/.hudson/jobs/Gazelle HL7 Validator IGAMT/workspace/gazelle-hl7-validator-report-jar/target/classes/net/ihe/gazelle/hl7
[INFO] Deleting directory /home/jenkins/.hudson/jobs/Gazelle HL7 Validator IGAMT/workspace/gazelle-hl7-validator-report-jar/target/classes/net/ihe/gazelle
[INFO] Deleting directory /home/jenkins/.hudson/jobs/Gazelle HL7 Validator IGAMT/workspace/gazelle-hl7-validator-report-jar/target/classes/net/ihe
[INFO] Deleting directory /home/jenkins/.hudson/jobs/Gazelle HL7 Validator IGAMT/workspace/gazelle-hl7-validator-report-jar/target/classes/net
[INFO] Deleting file /home/jenkins/.hudson/jobs/Gazelle HL7 Validator IGAMT/workspace/gazelle-hl7-validator-report-jar/target/classes/org.codehaus.plexus.compiler.javac.JavacCompiler6197326924472101697arguments
[INFO] Deleting file /home/jenkins/.hudson/jobs/Gazelle HL7 Validator IGAMT/workspace/gazelle-hl7-validator-report-jar/target/classes/META-INF/build.properties
[INFO] Deleting directory /home/jenkins/.hudson/jobs/Gazelle HL7 Validator IGAMT/workspace/gazelle-hl7-validator-report-jar/target/classes/META-INF
[INFO] Deleting file /home/jenkins/.hudson/jobs/Gazelle HL7 Validator IGAMT/workspace/gazelle-hl7-validator-report-jar/target/classes/javac.sh
[INFO] Deleting directory /home/jenkins/.hudson/jobs/Gazelle HL7 Validator IGAMT/workspace/gazelle-hl7-validator-report-jar/target/classes
[INFO] Deleting file /home/jenkins/.hudson/jobs/Gazelle HL7 Validator IGAMT/workspace/gazelle-hl7-validator-report-jar/target/buildmetadata.xml
[INFO] Deleting file /home/jenkins/.hudson/jobs/Gazelle HL7 Validator IGAMT/workspace/gazelle-hl7-validator-report-jar/target/maven-status/maven-compiler-plugin/compile/default-compile/createdFiles.lst
[INFO] Deleting file /home/jenkins/.hudson/jobs/Gazelle HL7 Validator IGAMT/workspace/gazelle-hl7-validator-report-jar/target/maven-status/maven-compiler-plugin/compile/default-compile/inputFiles.lst
[INFO] Deleting directory /home/jenkins/.hudson/jobs/Gazelle HL7 Validator IGAMT/workspace/gazelle-hl7-validator-report-jar/target/maven-status/maven-compiler-plugin/compile/default-compile
[INFO] Deleting directory /home/jenkins/.hudson/jobs/Gazelle HL7 Validator IGAMT/workspace/gazelle-hl7-validator-report-jar/target/maven-status/maven-compiler-plugin/compile
[INFO] Deleting directory /home/jenkins/.hudson/jobs/Gazelle HL7 Validator IGAMT/workspace/gazelle-hl7-validator-report-jar/target/maven-status/maven-compiler-plugin
[INFO] Deleting directory /home/jenkins/.hudson/jobs/Gazelle HL7 Validator IGAMT/workspace/gazelle-hl7-validator-report-jar/target/maven-status
[INFO] Deleting file /home/jenkins/.hudson/jobs/Gazelle HL7 Validator IGAMT/workspace/gazelle-hl7-validator-report-jar/target/gazelle-hl7-validator-report-jar.jar
[INFO] Deleting directory /home/jenkins/.hudson/jobs/Gazelle HL7 Validator IGAMT/workspace/gazelle-hl7-validator-report-jar/target/generated-sources/annotations
[INFO] Deleting directory /home/jenkins/.hudson/jobs/Gazelle HL7 Validator IGAMT/workspace/gazelle-hl7-validator-report-jar/target/generated-sources
[INFO] Deleting file /home/jenkins/.hudson/jobs/Gazelle HL7 Validator IGAMT/workspace/gazelle-hl7-validator-report-jar/target/gazelle-hl7-validator-report-jar-sources.jar
[INFO] Deleting file /home/jenkins/.hudson/jobs/Gazelle HL7 Validator IGAMT/workspace/gazelle-hl7-validator-report-jar/target/gazelle-hl7-validator-report-jar-tests.jar
[INFO] Deleting directory /home/jenkins/.hudson/jobs/Gazelle HL7 Validator IGAMT/workspace/gazelle-hl7-validator-report-jar/target
[DEBUG] Skipping non-existing directory /home/jenkins/.hudson/jobs/Gazelle HL7 Validator IGAMT/workspace/gazelle-hl7-validator-report-jar/target/classes
[DEBUG] Skipping non-existing directory /home/jenkins/.hudson/jobs/Gazelle HL7 Validator IGAMT/workspace/gazelle-hl7-validator-report-jar/target/test-classes
[DEBUG] Skipping non-existing directory /home/jenkins/.hudson/jobs/Gazelle HL7 Validator IGAMT/workspace/gazelle-hl7-validator-report-jar/target/classes
[INFO] 
[INFO] --- maven-enforcer-plugin:1.2:enforce (enforce-java-version) @ gazelle-hl7-validator-report-jar ---
[DEBUG] Executing rule: org.apache.maven.plugins.enforcer.RequireJavaVersion
[DEBUG] Rule org.apache.maven.plugins.enforcer.RequireJavaVersion is cacheable.
[DEBUG] Key org.apache.maven.plugins.enforcer.RequireJavaVersion 48570 was found in the cache
[DEBUG] The cached results are still valid. Skipping the rule: org.apache.maven.plugins.enforcer.RequireJavaVersion
[INFO] 
[INFO] --- maven-enforcer-plugin:1.2:enforce (enforce-maven-version) @ gazelle-hl7-validator-report-jar ---
[DEBUG] Executing rule: org.apache.maven.plugins.enforcer.RequireMavenVersion
[DEBUG] Rule org.apache.maven.plugins.enforcer.RequireMavenVersion is cacheable.
[DEBUG] Key org.apache.maven.plugins.enforcer.RequireMavenVersion 48517562 was found in the cache
[DEBUG] The cached results are still valid. Skipping the rule: org.apache.maven.plugins.enforcer.RequireMavenVersion
[INFO] 
[INFO] --- buildnumber-maven-plugin:1.2:create-timestamp (get-build-timestamp) @ gazelle-hl7-validator-report-jar ---
[DEBUG] Using previously created timestamp.
[INFO] 
[INFO] --- buildnumber-maven-plugin:1.2:create (get-scm-revision) @ gazelle-hl7-validator-report-jar ---
[DEBUG] Revision available from previous execution
[INFO] 
[INFO] --- maven-buildmetadata-plugin:1.1.0.IHE.3:provide-buildmetadata (default) @ gazelle-hl7-validator-report-jar ---
[DEBUG] Using Maven level FINEST
[DEBUG] Reading config file 'logging-FINEST.properties'...
11:36:31,802 DEBUG [pool-1-thread-3 for channel id=1656511] MavenScmRevisionNumberFetcher:118 -   Fetching latest revision number.
    SCM connection info: url=scm:svn:svn+ssh://scm.gforge.inria.fr/svn/gazelle/Maven/GazelleHL7v2Validator/branches/GazelleHL7v2Validator-IGAMT/gazelle-hl7-validator-report-jar
    SCM access info: rootDirectory=/home/jenkins/.hudson/jobs/Gazelle HL7 Validator IGAMT/workspace/gazelle-hl7-validator-report-jar, dateFormat=yyyy-MM-dd HH:mm:ss, queryRangeInDays=30, failOnLocalModifications=false, ignoreDotFilesInBaseDir=true
[INFO] Executing: /bin/sh -c cd "/home/jenkins/.hudson/jobs/Gazelle HL7 Validator IGAMT/workspace/gazelle-hl7-validator-report-jar" && svn --non-interactive log -v -r '{2020-05-16 09:36:31 +0000}:{2020-06-16 09:36:31 +0000}' svn+ssh://scm.gforge.inria.fr/svn/gazelle/Maven/GazelleHL7v2Validator/branches/GazelleHL7v2Validator-IGAMT/gazelle-hl7-validator-report-jar
[INFO] Working directory: /home/jenkins/.hudson/jobs/Gazelle HL7 Validator IGAMT/workspace/gazelle-hl7-validator-report-jar
11:36:33,451 DEBUG [pool-1-thread-3 for channel id=1656511] MavenScmRevisionNumberFetcher:304 - No change log set found.
11:36:33,452 DEBUG [pool-1-thread-3 for channel id=1656511] MavenScmRevisionNumberFetcher:134 -   Found revision 'null'.
[INFO] Writing properties '/home/jenkins/.hudson/jobs/Gazelle HL7 Validator IGAMT/workspace/gazelle-hl7-validator-report-jar/target/classes/META-INF/build.properties'...
[INFO] Writing XML report '/home/jenkins/.hudson/jobs/Gazelle HL7 Validator IGAMT/workspace/gazelle-hl7-validator-report-jar/target/buildmetadata.xml'...
[INFO] 
[INFO] --- jacoco-maven-plugin:0.7.9:prepare-agent (default) @ gazelle-hl7-validator-report-jar ---
[INFO] argLine set to "-javaagent:/home/jenkins/.m2/repository/org/jacoco/org.jacoco.agent/0.7.9/org.jacoco.agent-0.7.9-runtime.jar=destfile=/home/jenkins/.hudson/jobs/Gazelle HL7 Validator IGAMT/workspace/gazelle-hl7-validator-report-jar/target/jacoco.exec,append=true"
[INFO] 
[INFO] --- maven-resources-plugin:3.0.2:resources (default-resources) @ gazelle-hl7-validator-report-jar ---
[DEBUG] properties used {project.baseUri=file:/home/jenkins/.hudson/jobs/Gazelle%20HL7%20Validator%20IGAMT/workspace/gazelle-hl7-validator-report-jar/, POM_GROUPID=net.ihe.gazelle, gazelle.preferences.version=1.1.0, env.BUILD_URL=https://gazelle.ihe.net/jenkins/job/Gazelle%20HL7%20Validator%20IGAMT/30/, application.url=http://gazelle.ihe.net/GazelleHL7Validator/, version.gpg.plugin=1.4, version.antrun.plugin=1.7, build.java.runtime.name=Java(TM) SE Runtime Environment, IS_M2RELEASEBUILD=false, build.parent.parent.reference=net.ihe.gazelle.maven:gazelle-tools:3.1.1, version.ear.plugin=2.8, SONARQUBE_SCANNER_PARAMS={ "sonar.host.url" : "https:\/\/gazelle.ihe.net\/sonar"}, user.dir=/home/jenkins/.hudson/jobs/Gazelle HL7 Validator IGAMT/workspace, build.copyright.year=null-2020, sonar.host.url=https://gazelle.ihe.net/sonar, build.java.compiler=HotSpot 64-Bit Tiered Compilers, java.vm.version=25.191-b12, application.name=GazelleHL7Validator, env.POM_DISPLAYNAME=GazelleHL7v2Validator, env.HUDSON_SERVER_COOKIE=76f5f4ef8af6c01d, version.install.plugin=2.4, M2_HOME=/home/jenkins/.hudson/tools/hudson.tasks.Maven_MavenInstallation/Maven3, version.emma=2.0.5312, version.shade.plugin=2.0, version.site.plugin=3.2, env.IS_M2RELEASEBUILD=false, max.pool.size=3, env.JENKINS_HOME=/home/jenkins/.hudson, exclude.bootstrap=true, sun.os.patch.level=unknown, env.HUDSON_HOME=/home/jenkins/.hudson, NODE_LABELS=master, version.injection.plugin=1.0.2, java.vm.specification.name=Java Virtual Machine Specification, SHELL=/bin/bash, EXECUTOR_NUMBER=2, jdk.min.version=1.7, WORKSPACE=/home/jenkins/.hudson/jobs/Gazelle HL7 Validator IGAMT/workspace, messages.mode=crowdin, profile=prod, version.rar.plugin=2.2, os.name=Linux, maven.version=3.5.2, hapi.version=2.2, build.os.name=Linux, java.vendor.url.bug=http://bugreport.sun.com/bugreport/, chhl7v3.validator.version=1.0.4, jboss.releases.repo.url=https://repository.jboss.org/nexus/service/local/staging/deploy/maven2/, arguments=-Pjboss-release, os.arch=amd64, user.name=jenkins, application.url.basename=GazelleHL7Validator, pdf.name=gazelle-hl7-validator-report-jar.pdf, sun.java.command=jenkins.maven3.agent.Maven35Main /home/jenkins/.hudson/tools/hudson.tasks.Maven_MavenInstallation/Maven3 /home/jenkins/.hudson/war/WEB-INF/lib/remoting-3.29.jar /home/jenkins/.hudson/plugins/maven-plugin/WEB-INF/lib/maven35-interceptor-1.13.jar /home/jenkins/.hudson/plugins/maven-plugin/WEB-INF/lib/maven3-interceptor-commons-1.13.jar 42337, env.SONAR_HOST_URL=https://gazelle.ihe.net/sonar, env.USER=jenkins, sonar.web.sourceDirectory=GazelleHL7v2Validation-ui/src/main/webapp, version.resources.plugin=2.6, PWD=/home/jenkins, env.XDG_SESSION_ID=c5, env.MAVEN_OPTS=-Djava.net.preferIPv4Stack=true -Dfile.encoding=UTF8 -Xmx4096m -XX:MaxPermSize=1024m, env.LOGNAME=jenkins, build.os.arch=amd64, project.reporting.outputEncoding=UTF-8, NODE_NAME=master, env.JENKINS_SERVER_COOKIE=76f5f4ef8af6c01d, build.version=3.6.0-SNAPSHOT, sourceReleaseAssemblyDescriptor=source-release, version.dependency.plugin=2.6, SONAR_MAVEN_GOAL=sonar:sonar, user.country=GB, build.contributors=IHE Development - KEREVAL and Inria, version.cobertura.plugin=2.5.2, env.SONARQUBE_SCANNER_PARAMS={ "sonar.host.url" : "https:\/\/gazelle.ihe.net\/sonar"}, BUILD_TAG=jenkins-Gazelle HL7 Validator IGAMT-30, RUN_CHANGES_DISPLAY_URL=https://gazelle.ihe.net/jenkins/job/Gazelle%20HL7%20Validator%20IGAMT/30/display/redirect?page=changes, java.endorsed.dirs=/usr/lib/jvm/java-8-oracle/jre/lib/endorsed, java.vm.specification.version=1.8, targetJdk=1.7, env.ROOT_BUILD_CAUSE_MANUALTRIGGER=true, env.SHLVL=1, version.javancss.plugin=2.0, LANGUAGE=en_GB.UTF-8, java.vendor=Oracle Corporation, MAVEN_OPTS=-Djava.net.preferIPv4Stack=true -Dfile.encoding=UTF8 -Xmx4096m -XX:MaxPermSize=1024m, sun.font.fontmanager=sun.awt.X11FontManager, version.jbossas7=7.1.1.Final, version.deploy.plugin=2.7, env.LANGUAGE=en_GB.UTF-8, env.POM_PACKAGING=pom, BUILD_URL=https://gazelle.ihe.net/jenkins/job/Gazelle%20HL7%20Validator%20IGAMT/30/, file.separator=/, HOME=/home/jenkins, build.version.full=3.6.0-20200615-SNAPSHOT, env.GIT_PREVIOUS_COMMIT=2df95e4706a3a13e9625d0c73afc7fe5c8da5afb, version.jee=6, sonar.exclusions=file:**/generated-sources/**, sun.java.launcher=SUN_STANDARD, env.MAIL=/var/mail/jenkins, build.java.runtime.version=1.8.0_191-b12, env.BUILD_NUMBER=30, min.pool.size=1, maven.min.version=3.0.3, java.library.path=/usr/java/packages/lib/amd64:/usr/lib64:/lib64:/lib:/usr/lib, version.release.plugin=2.3.2, env.LC_ALL=en_GB.UTF-8, GIT_URL=git@gitlab.inria.fr:gazelle/applications/test-execution/validator/gazellehl7v2validator.git, env.RUN_DISPLAY_URL=https://gazelle.ihe.net/jenkins/job/Gazelle%20HL7%20Validator%20IGAMT/30/display/redirect, project.build.sourceEncoding=UTF-8, sun.arch.data.model=64, version.jdepend.plugin=2.0-beta-2, J2REDIR=/usr/lib/jvm/java-8-oracle/jre, additionalparam=-Xdoclint:none, env.PATH=/home/jenkins/.hudson/tools/hudson.tasks.Maven_MavenInstallation/Maven3/bin:/usr/lib/jvm/java-8-oracle//bin:/usr/local/bin:/usr/bin:/bin:/usr/local/games:/usr/games:/usr/lib/jvm/java-8-oracle/bin:/usr/lib/jvm/java-8-oracle/db/bin:/usr/lib/jvm/java-8-oracle/jre/bin, path.separator=:, SONAR_CONFIG_NAME=Sonar, sun.io.unicode.encoding=UnicodeLittle, user.language=en, XDG_RUNTIME_DIR=/run/user/1002, env.GIT_COMMIT=2df95e4706a3a13e9625d0c73afc7fe5c8da5afb, build.timestamp.millis=1592213785234, version.surefire.plugin=2.12.3, JOB_NAME=Gazelle HL7 Validator IGAMT, JOB_DISPLAY_URL=https://gazelle.ihe.net/jenkins/job/Gazelle%20HL7%20Validator%20IGAMT/display/redirect, seam.debug=false, env.POM_GROUPID=net.ihe.gazelle, env.JOB_NAME=Gazelle HL7 Validator IGAMT, env.SONAR_CONFIG_NAME=Sonar, JENKINS_HOME=/home/jenkins/.hudson, LC_ALL=en_GB.UTF-8, vaadin.production.mode=true, build.java.vendor=Oracle Corporation, maven.compiler.source=1.7, java.class.version=52.0, env.GIT_BRANCH=origin/GazelleHL7v2Validator-IGAMT, gazelle.hql.version=2.1.2, buildNumber=UNKNOWN, timestamp=1592213786916, version.bundle.plugin=2.3.7, version.jacoco=0.5.8.201207111220, POM_ARTIFACTID=GazelleHL7v2Validator, file.encoding.pkg=sun.io, sun.cpu.endian=little, LANG=en_US.UTF-8, PATH+MAVEN=/home/jenkins/.hudson/tools/hudson.tasks.Maven_MavenInstallation/Maven3/bin, maven.compiler.target=1.7, build.application.name=gazelle-hl7-validator-report-jar, property=, JENKINS_URL=https://gazelle.ihe.net/jenkins/, env.SHELL=/bin/bash, jdbc.password=gazelle, java.home=/usr/lib/jvm/java-8-oracle/jre, hibernate.show_sql=false, gitb.version=1.0.0, GIT_COMMIT=2df95e4706a3a13e9625d0c73afc7fe5c8da5afb, ROOT_BUILD_CAUSE_MANUALTRIGGER=true, jdbc.driver.class=org.postgresql.Driver, env.NODE_LABELS=master, BUILD_CAUSE=MANUALTRIGGER, version.taglist.plugin=2.4, version.license.plugin=1.3, version.assembly.plugin=2.4, version.arquillian_core=1.0.1.Final, env.JENKINS_URL=https://gazelle.ihe.net/jenkins/, version.pmd.plugin=2.7.1, maven.home=/home/jenkins/.hudson/tools/hudson.tasks.Maven_MavenInstallation/Maven3, build.maven.execution.goals=clean, package, org.sonarsource.scanner.maven:sonar-maven-plugin:sonar, GIT_BRANCH=origin/GazelleHL7v2Validator-IGAMT, jdbc.connection.url=jdbc:postgresql:gazelle-hl7-validator, HUDSON_SERVER_COOKIE=76f5f4ef8af6c01d, build.maven.execution.isRoot=false, LOGNAME=jenkins, version.richfaces=4.3.5.Final, useReleaseProfile=false, version.plugin.plugin=3.1, version.checkstyle.plugin=2.9.1, sun.management.compiler=HotSpot 64-Bit Tiered Compilers, org.richfaces.bom.version=4.3.5.Final, POM_DISPLAYNAME=GazelleHL7v2Validator, BUILD_ID=30, version.richfaces.official=4.3.5.Final, version.ejb.plugin=2.3, env.BUILD_ID=30, version.testng=5.14.10, hibernate.hbm2ddl.auto=update, gmail.password=n3t.g@z3113, env.XDG_RUNTIME_DIR=/run/user/1002, maven.build.timestamp.format=yyyyMMdd-HHmm, java.vm.specification.vendor=Oracle Corporation, build.os.version=4.9.0-8-amd64, java.vm.name=Java HotSpot(TM) 64-Bit Server VM, ROOT_BUILD_CAUSE=MANUALTRIGGER, java.io.tmpdir=/tmp, java.vendor.url=http://java.oracle.com/, build.host.name=ns309963.ovh.net, mbval.documentation.version=1.1.10, gazelle.plugins.version=1.60, POM_VERSION=3.6.0-SNAPSHOT, build.maven.version=3.5.2, BUILD_NUMBER=30, sun.boot.library.path=/usr/lib/jvm/java-8-oracle/jre/lib/amd64, version.clean.plugin=2.5, build.java.vm=Java HotSpot(TM) 64-Bit Server VM, env.MAVEN_HOME=/home/jenkins/.hudson/tools/hudson.tasks.Maven_MavenInstallation/Maven3, build.user=jenkins, GIT_PREVIOUS_COMMIT=2df95e4706a3a13e9625d0c73afc7fe5c8da5afb, env.EXECUTOR_NUMBER=2, version.junit=4.8.2, version.drools=5.3.3.Final, java.runtime.name=Java(TM) SE Runtime Environment, exploded.war.file=false, maven.conf=/home/jenkins/.hudson/tools/hudson.tasks.Maven_MavenInstallation/Maven3/conf, USER=jenkins, gmail.account=net.gazelle@gmail.com, PATH+JDK=/usr/lib/jvm/java-8-oracle//bin, application.admin.email=anne-gaelle@ihe-europe.net, sun.cpu.isalist=, seam.docbook.version=1.1.0.GA, project.short.version=2.3, user.home=/home/jenkins, version.eclipse.plugin=2.9, env.JAVA_HOME=/usr/lib/jvm/java-8-oracle/, guice.disable.misplaced.annotation.check=true, java.specification.name=Java Platform API Specification, build.time=${build.date}, java.specification.vendor=Oracle Corporation, java.version=1.8.0_191, JOB_BASE_NAME=Gazelle HL7 Validator IGAMT, version.jsf2=2.1.7, crowdin.plugin.version=1.5, downloadSources=true, env._=/usr/lib/jvm/zulu-8-amd64/bin/java, env.DERBY_HOME=/usr/lib/jvm/java-8-oracle/db, version.resteasy=2.0-beta-2, hibernate.dialect=org.hibernate.dialect.PostgreSQLDialect, MAVEN_HOME=/home/jenkins/.hudson/tools/hudson.tasks.Maven_MavenInstallation/Maven3, BUILD_CAUSE_MANUALTRIGGER=true, version.sonar.plugin=2.0, env.BUILD_DISPLAY_NAME=#30, argLine="-javaagent:/home/jenkins/.m2/repository/org/jacoco/org.jacoco.agent/0.7.9/org.jacoco.agent-0.7.9-runtime.jar=destfile=/home/jenkins/.hudson/jobs/Gazelle HL7 Validator IGAMT/workspace/gazelle-hl7-validator-report-jar/target/jacoco.exec,append=true", build.datetime=Mon, 15 Jun 2020 11:36:26 +0200, version.buildhelper.plugin=1.7, version.apt.plugin=1.0-alpha-5, SONAR_HOST_URL=https://gazelle.ihe.net/sonar, XDG_SESSION_ID=c5, cas.service=http://gazelle.ihe.net/GazelleHL7Validator/, HUDSON_HOME=/home/jenkins/.hudson, env.M2_HOME=/home/jenkins/.hudson/tools/hudson.tasks.Maven_MavenInstallation/Maven3, gazelle.hl7.messagestructures.version=3.1.0, maven.build.timestamp=2020-06-15T09:36:33Z, env.PWD=/home/jenkins, line.separator=
, java.specification.version=1.8, java.vm.info=mixed mode, java.net.preferIPv4Stack=true, jbossorg.docbook.version=1.1.0, env.JOB_URL=https://gazelle.ihe.net/jenkins/job/Gazelle%20HL7%20Validator%20IGAMT/, MAIL=/var/mail/jenkins, xcpd.plq.validation.version=1.0.3, sun.boot.class.path=/usr/lib/jvm/java-8-oracle/jre/lib/resources.jar:/usr/lib/jvm/java-8-oracle/jre/lib/rt.jar:/usr/lib/jvm/java-8-oracle/jre/lib/sunrsasign.jar:/usr/lib/jvm/java-8-oracle/jre/lib/jsse.jar:/usr/lib/jvm/java-8-oracle/jre/lib/jce.jar:/usr/lib/jvm/java-8-oracle/jre/lib/charsets.jar:/usr/lib/jvm/java-8-oracle/jre/lib/jfr.jar:/usr/lib/jvm/java-8-oracle/jre/classes, version.jxr.plugin=2.3, build.maven.execution.project=net.ihe.gazelle:gazelle-hl7-validator-report-jar:jar:3.6.0-SNAPSHOT, DERBY_HOME=/usr/lib/jvm/java-8-oracle/db, JOB_URL=https://gazelle.ihe.net/jenkins/job/Gazelle%20HL7%20Validator%20IGAMT/, version.seam=2.3.1.Final, RUN_DISPLAY_URL=https://gazelle.ihe.net/jenkins/job/Gazelle%20HL7%20Validator%20IGAMT/30/display/redirect, jboss.snapshots.repo.url=https://repository.jboss.org/nexus/content/repositories/snapshots/, env.HOME=/home/jenkins, PATH=/usr/local/bin:/usr/bin:/bin:/usr/local/games:/usr/games:/usr/lib/jvm/java-8-oracle/bin:/usr/lib/jvm/java-8-oracle/db/bin:/usr/lib/jvm/java-8-oracle/jre/bin, env.JOB_BASE_NAME=Gazelle HL7 Validator IGAMT, maven.compiler.argument.source=1.7, env.BUILD_CAUSE=MANUALTRIGGER, cas.url=https://gazelle.ihe.net/, org.slf4j.simpleLogger.defaultLogLevel=debug, securerandom.source=file:/dev/./urandom, version.enforcer.plugin=1.2, version.failsafe.plugin=2.12.3, version.buildnumber.plugin=1.2, version.richfaces.cdk=4.2.2.Final, version.idea.plugin=2.2, env.SONAR_MAVEN_GOAL=sonar:sonar, java.awt.printerjob=sun.print.PSPrinterJob, sun.jnu.encoding=UTF-8, maven.compiler.argument.target=1.7, build.date.pattern=dd.MM.yyyy, env.POM_ARTIFACTID=GazelleHL7v2Validator, java.runtime.version=1.8.0_191-b12, build.maven.execution.profiles.active=prod, mail-properties, sonar, env.WORKSPACE=/home/jenkins/.hudson/jobs/Gazelle HL7 Validator IGAMT/workspace, POM_PACKAGING=pom, J2SDKDIR=/usr/lib/jvm/java-8-oracle, build.date.full=15/06/20 11:36:33 CEST, maven3.interceptor.common=/home/jenkins/.hudson/plugins/maven-plugin/WEB-INF/lib/maven3-interceptor-commons-1.13.jar, version.javacc.plugin=2.6, maven.build.version=Apache Maven 3.5.2 (138edd61fd100ec658bfa2d307c43b76940a5d7d; 2017-10-18T09:58:13+02:00), user.timezone=Europe/Paris, env.J2SDKDIR=/usr/lib/jvm/java-8-oracle, application.admin.name=Anne-Gaëlle Bergé, build.date=15.06.2020, version.javadoc.plugin=2.9, version.jar.plugin=2.4, env.RUN_CHANGES_DISPLAY_URL=https://gazelle.ihe.net/jenkins/job/Gazelle%20HL7%20Validator%20IGAMT/30/display/redirect?page=changes, java.ext.dirs=/usr/lib/jvm/java-8-oracle/jre/lib/ext:/usr/java/packages/lib/ext, _=/usr/lib/jvm/zulu-8-amd64/bin/java, env.JOB_DISPLAY_URL=https://gazelle.ihe.net/jenkins/job/Gazelle%20HL7%20Validator%20IGAMT/display/redirect, version.findbugs.plugin=2.5.2, build.maven.execution.profile.active.mail-properties=settings.xml, ihehl7v3.validation.version=1.5.5, env.HUDSON_URL=https://gazelle.ihe.net/jenkins/, java.class.path=/home/jenkins/.hudson/plugins/maven-plugin/WEB-INF/lib/maven35-agent-1.13.jar:/home/jenkins/.hudson/tools/hudson.tasks.Maven_MavenInstallation/Maven3/boot/plexus-classworlds-2.5.2.jar:/home/jenkins/.hudson/tools/hudson.tasks.Maven_MavenInstallation/Maven3/conf/logging, env.HUDSON_COOKIE=6cc8459b-014a-4762-b1dd-0cf4a79263a9, os.version=4.9.0-8-amd64, JAVA_HOME=/usr/lib/jvm/java-8-oracle/, env.ROOT_BUILD_CAUSE=MANUALTRIGGER, build.maven.execution.profile.active.sonar=settings.xml, env.NODE_NAME=master, JENKINS_SERVER_COOKIE=76f5f4ef8af6c01d, ksahl7v3.validation.version=1.0.1, SHLVL=1, version.wicket=1.4.14, env.BUILD_CAUSE_MANUALTRIGGER=true, build.parent.reference=net.ihe.gazelle:GazelleHL7v2Validator:3.6.0-20200615-SNAPSHOT, maven3.interceptor=/home/jenkins/.hudson/plugins/maven-plugin/WEB-INF/lib/maven35-interceptor-1.13.jar, CLASSPATH=, env.LANG=en_US.UTF-8, java.awt.graphicsenv=sun.awt.X11GraphicsEnvironment, env.POM_VERSION=3.6.0-SNAPSHOT, java.vm.vendor=Oracle Corporation, scmBranch=UNKNOWN_BRANCH, version.war.plugin=2.3, build.year=2020, version.pir.plugin=2.6, version.source.plugin=2.2.1, version.compiler.plugin=3.0, env.BUILD_TAG=jenkins-Gazelle HL7 Validator IGAMT-30, HUDSON_URL=https://gazelle.ihe.net/jenkins/, env.GIT_URL=git@gitlab.inria.fr:gazelle/applications/test-execution/validator/gazellehl7v2validator.git, BUILD_DISPLAY_NAME=#30, file.encoding=UTF8, env.J2REDIR=/usr/lib/jvm/java-8-oracle/jre, jdbc.user=gazelle, awt.toolkit=sun.awt.X11.XToolkit, version.clover2.plugin=3.1.8}
[INFO] Using 'UTF-8' encoding to copy filtered resources.
[DEBUG] resource with targetPath null
directory /home/jenkins/.hudson/jobs/Gazelle HL7 Validator IGAMT/workspace/gazelle-hl7-validator-report-jar/src/main/resources
excludes []
includes []
[INFO] skip non existing resourceDirectory /home/jenkins/.hudson/jobs/Gazelle HL7 Validator IGAMT/workspace/gazelle-hl7-validator-report-jar/src/main/resources
[DEBUG] no use filter components
[INFO] 
[INFO] --- maven-compiler-plugin:3.1:compile (default-compile) @ gazelle-hl7-validator-report-jar ---
[DEBUG] Using compiler 'javac'.
[DEBUG] Source directories: [/home/jenkins/.hudson/jobs/Gazelle HL7 Validator IGAMT/workspace/gazelle-hl7-validator-report-jar/src/main/java]
[DEBUG] Classpath: [/home/jenkins/.hudson/jobs/Gazelle HL7 Validator IGAMT/workspace/gazelle-hl7-validator-report-jar/target/classes
 /home/jenkins/.m2/repository/ca/uhn/hapi/hapi-base/2.2/hapi-base-2.2.jar
 /home/jenkins/.m2/repository/org/slf4j/slf4j-api/1.7.21/slf4j-api-1.7.21.jar
 /home/jenkins/.m2/repository/org/jboss/seam/jboss-seam/2.3.1.Final/jboss-seam-2.3.1.Final.jar
 /home/jenkins/.m2/repository/org/beanshell/bsh/1.3.0/bsh-1.3.0.jar
 /home/jenkins/.m2/repository/org/jboss/el/jboss-el/1.0_02.CR6/jboss-el-1.0_02.CR6.jar
 /home/jenkins/.m2/repository/javax/el/el-api/2.2/el-api-2.2.jar]
[DEBUG] Output directory: /home/jenkins/.hudson/jobs/Gazelle HL7 Validator IGAMT/workspace/gazelle-hl7-validator-report-jar/target/classes
[DEBUG] CompilerReuseStrategy: reuseCreated
[DEBUG] useIncrementalCompilation enabled
[DEBUG] Stale source detected: /home/jenkins/.hudson/jobs/Gazelle HL7 Validator IGAMT/workspace/gazelle-hl7-validator-report-jar/src/main/java/net/ihe/gazelle/hl7/validator/report/Error.java
[DEBUG] Stale source detected: /home/jenkins/.hudson/jobs/Gazelle HL7 Validator IGAMT/workspace/gazelle-hl7-validator-report-jar/src/main/java/net/ihe/gazelle/hl7/validator/report/Warning.java
[DEBUG] Stale source detected: /home/jenkins/.hudson/jobs/Gazelle HL7 Validator IGAMT/workspace/gazelle-hl7-validator-report-jar/src/main/java/net/ihe/gazelle/hl7/exception/GazelleErrorCode.java
[DEBUG] Stale source detected: /home/jenkins/.hudson/jobs/Gazelle HL7 Validator IGAMT/workspace/gazelle-hl7-validator-report-jar/src/main/java/net/ihe/gazelle/hl7/validator/report/ValidationResultsOverview.java
[DEBUG] Stale source detected: /home/jenkins/.hudson/jobs/Gazelle HL7 Validator IGAMT/workspace/gazelle-hl7-validator-report-jar/src/main/java/net/ihe/gazelle/hl7/exception/GazelleHL7Exception.java
[DEBUG] Stale source detected: /home/jenkins/.hudson/jobs/Gazelle HL7 Validator IGAMT/workspace/gazelle-hl7-validator-report-jar/src/main/java/net/ihe/gazelle/hl7/validator/report/ValidationCounters.java
[DEBUG] Stale source detected: /home/jenkins/.hudson/jobs/Gazelle HL7 Validator IGAMT/workspace/gazelle-hl7-validator-report-jar/src/main/java/net/ihe/gazelle/hl7/validator/report/GazelleProfileException.java
[DEBUG] Stale source detected: /home/jenkins/.hudson/jobs/Gazelle HL7 Validator IGAMT/workspace/gazelle-hl7-validator-report-jar/src/main/java/net/ihe/gazelle/hl7/validator/report/HL7v2ValidationReport.java
[DEBUG] Stale source detected: /home/jenkins/.hudson/jobs/Gazelle HL7 Validator IGAMT/workspace/gazelle-hl7-validator-report-jar/src/main/java/net/ihe/gazelle/hl7/validation/context/ValidationOptions.java
[DEBUG] Stale source detected: /home/jenkins/.hudson/jobs/Gazelle HL7 Validator IGAMT/workspace/gazelle-hl7-validator-report-jar/src/main/java/net/ihe/gazelle/hl7/validator/report/ValidationResults.java
[DEBUG] Stale source detected: /home/jenkins/.hudson/jobs/Gazelle HL7 Validator IGAMT/workspace/gazelle-hl7-validator-report-jar/src/main/java/net/ihe/gazelle/hl7/assertion/AssertionType.java
[DEBUG] Stale source detected: /home/jenkins/.hudson/jobs/Gazelle HL7 Validator IGAMT/workspace/gazelle-hl7-validator-report-jar/src/main/java/net/ihe/gazelle/hl7/validator/report/UsedResources.java
[DEBUG] Stale source detected: /home/jenkins/.hudson/jobs/Gazelle HL7 Validator IGAMT/workspace/gazelle-hl7-validator-report-jar/src/main/java/net/ihe/gazelle/hl7/assertion/GazelleHL7Assertion.java
[DEBUG] Stale source detected: /home/jenkins/.hudson/jobs/Gazelle HL7 Validator IGAMT/workspace/gazelle-hl7-validator-report-jar/src/main/java/net/ihe/gazelle/hl7/utils/PathBuilder.java
[DEBUG] Stale source detected: /home/jenkins/.hudson/jobs/Gazelle HL7 Validator IGAMT/workspace/gazelle-hl7-validator-report-jar/src/main/java/net/ihe/gazelle/hl7/validation/context/ValidationType.java
[DEBUG] Stale source detected: /home/jenkins/.hudson/jobs/Gazelle HL7 Validator IGAMT/workspace/gazelle-hl7-validator-report-jar/src/main/java/net/ihe/gazelle/hl7/validator/report/UsedResource.java
[DEBUG] Stale source detected: /home/jenkins/.hudson/jobs/Gazelle HL7 Validator IGAMT/workspace/gazelle-hl7-validator-report-jar/src/main/java/net/ihe/gazelle/hl7/validation/context/ValidationContext.java
[DEBUG] Stale source detected: /home/jenkins/.hudson/jobs/Gazelle HL7 Validator IGAMT/workspace/gazelle-hl7-validator-report-jar/src/main/java/net/ihe/gazelle/hl7/validator/report/ValidationStatus.java
[DEBUG] Stale source detected: /home/jenkins/.hudson/jobs/Gazelle HL7 Validator IGAMT/workspace/gazelle-hl7-validator-report-jar/src/main/java/net/ihe/gazelle/hl7/validation/context/ProfileDefinition.java
[INFO] Changes detected - recompiling the module!
[DEBUG] Classpath:
[DEBUG]  /home/jenkins/.hudson/jobs/Gazelle HL7 Validator IGAMT/workspace/gazelle-hl7-validator-report-jar/target/classes
[DEBUG]  /home/jenkins/.m2/repository/ca/uhn/hapi/hapi-base/2.2/hapi-base-2.2.jar
[DEBUG]  /home/jenkins/.m2/repository/org/slf4j/slf4j-api/1.7.21/slf4j-api-1.7.21.jar
[DEBUG]  /home/jenkins/.m2/repository/org/jboss/seam/jboss-seam/2.3.1.Final/jboss-seam-2.3.1.Final.jar
[DEBUG]  /home/jenkins/.m2/repository/org/beanshell/bsh/1.3.0/bsh-1.3.0.jar
[DEBUG]  /home/jenkins/.m2/repository/org/jboss/el/jboss-el/1.0_02.CR6/jboss-el-1.0_02.CR6.jar
[DEBUG]  /home/jenkins/.m2/repository/javax/el/el-api/2.2/el-api-2.2.jar
[DEBUG] Source roots:
[DEBUG]  /home/jenkins/.hudson/jobs/Gazelle HL7 Validator IGAMT/workspace/gazelle-hl7-validator-report-jar/src/main/java
[DEBUG] Command line options:
[DEBUG] -d /home/jenkins/.hudson/jobs/Gazelle HL7 Validator IGAMT/workspace/gazelle-hl7-validator-report-jar/target/classes -classpath /home/jenkins/.hudson/jobs/Gazelle HL7 Validator IGAMT/workspace/gazelle-hl7-validator-report-jar/target/classes:/home/jenkins/.m2/repository/ca/uhn/hapi/hapi-base/2.2/hapi-base-2.2.jar:/home/jenkins/.m2/repository/org/slf4j/slf4j-api/1.7.21/slf4j-api-1.7.21.jar:/home/jenkins/.m2/repository/org/jboss/seam/jboss-seam/2.3.1.Final/jboss-seam-2.3.1.Final.jar:/home/jenkins/.m2/repository/org/beanshell/bsh/1.3.0/bsh-1.3.0.jar:/home/jenkins/.m2/repository/org/jboss/el/jboss-el/1.0_02.CR6/jboss-el-1.0_02.CR6.jar:/home/jenkins/.m2/repository/javax/el/el-api/2.2/el-api-2.2.jar: -sourcepath /home/jenkins/.hudson/jobs/Gazelle HL7 Validator IGAMT/workspace/gazelle-hl7-validator-report-jar/src/main/java: /home/jenkins/.hudson/jobs/Gazelle HL7 Validator IGAMT/workspace/gazelle-hl7-validator-report-jar/src/main/java/net/ihe/gazelle/hl7/exception/GazelleErrorCode.java /home/jenkins/.hudson/jobs/Gazelle HL7 Validator IGAMT/workspace/gazelle-hl7-validator-report-jar/src/main/java/net/ihe/gazelle/hl7/validator/report/Warning.java /home/jenkins/.hudson/jobs/Gazelle HL7 Validator IGAMT/workspace/gazelle-hl7-validator-report-jar/src/main/java/net/ihe/gazelle/hl7/validator/report/Error.java /home/jenkins/.hudson/jobs/Gazelle HL7 Validator IGAMT/workspace/gazelle-hl7-validator-report-jar/src/main/java/net/ihe/gazelle/hl7/validator/report/ValidationResults.java /home/jenkins/.hudson/jobs/Gazelle HL7 Validator IGAMT/workspace/gazelle-hl7-validator-report-jar/src/main/java/net/ihe/gazelle/hl7/validation/context/ValidationOptions.java /home/jenkins/.hudson/jobs/Gazelle HL7 Validator IGAMT/workspace/gazelle-hl7-validator-report-jar/src/main/java/net/ihe/gazelle/hl7/validator/report/ValidationCounters.java /home/jenkins/.hudson/jobs/Gazelle HL7 Validator IGAMT/workspace/gazelle-hl7-validator-report-jar/src/main/java/net/ihe/gazelle/hl7/validator/report/GazelleProfileException.java /home/jenkins/.hudson/jobs/Gazelle HL7 Validator IGAMT/workspace/gazelle-hl7-validator-report-jar/src/main/java/net/ihe/gazelle/hl7/validator/report/HL7v2ValidationReport.java /home/jenkins/.hudson/jobs/Gazelle HL7 Validator IGAMT/workspace/gazelle-hl7-validator-report-jar/src/main/java/net/ihe/gazelle/hl7/validator/report/ValidationResultsOverview.java /home/jenkins/.hudson/jobs/Gazelle HL7 Validator IGAMT/workspace/gazelle-hl7-validator-report-jar/src/main/java/net/ihe/gazelle/hl7/exception/GazelleHL7Exception.java /home/jenkins/.hudson/jobs/Gazelle HL7 Validator IGAMT/workspace/gazelle-hl7-validator-report-jar/src/main/java/net/ihe/gazelle/hl7/validator/report/UsedResources.java /home/jenkins/.hudson/jobs/Gazelle HL7 Validator IGAMT/workspace/gazelle-hl7-validator-report-jar/src/main/java/net/ihe/gazelle/hl7/assertion/AssertionType.java /home/jenkins/.hudson/jobs/Gazelle HL7 Validator IGAMT/workspace/gazelle-hl7-validator-report-jar/src/main/java/net/ihe/gazelle/hl7/validation/context/ValidationType.java /home/jenkins/.hudson/jobs/Gazelle HL7 Validator IGAMT/workspace/gazelle-hl7-validator-report-jar/src/main/java/net/ihe/gazelle/hl7/utils/PathBuilder.java /home/jenkins/.hudson/jobs/Gazelle HL7 Validator IGAMT/workspace/gazelle-hl7-validator-report-jar/src/main/java/net/ihe/gazelle/hl7/assertion/GazelleHL7Assertion.java /home/jenkins/.hudson/jobs/Gazelle HL7 Validator IGAMT/workspace/gazelle-hl7-validator-report-jar/src/main/java/net/ihe/gazelle/hl7/validator/report/UsedResource.java /home/jenkins/.hudson/jobs/Gazelle HL7 Validator IGAMT/workspace/gazelle-hl7-validator-report-jar/src/main/java/net/ihe/gazelle/hl7/validator/report/ValidationStatus.java /home/jenkins/.hudson/jobs/Gazelle HL7 Validator IGAMT/workspace/gazelle-hl7-validator-report-jar/src/main/java/net/ihe/gazelle/hl7/validation/context/ProfileDefinition.java /home/jenkins/.hudson/jobs/Gazelle HL7 Validator IGAMT/workspace/gazelle-hl7-validator-report-jar/src/main/java/net/ihe/gazelle/hl7/validation/context/ValidationContext.java -s /home/jenkins/.hudson/jobs/Gazelle HL7 Validator IGAMT/workspace/gazelle-hl7-validator-report-jar/target/generated-sources/annotations -g -deprecation -target 8 -source 8 -encoding UTF-8 -source 1.7 -target 1.7
[DEBUG] incrementalBuildHelper#beforeRebuildExecution
[INFO] Compiling 19 source files to /home/jenkins/.hudson/jobs/Gazelle HL7 Validator IGAMT/workspace/gazelle-hl7-validator-report-jar/target/classes
[DEBUG] incrementalBuildHelper#afterRebuildExecution
[INFO] 
[INFO] --- maven-resources-plugin:3.0.2:testResources (default-testResources) @ gazelle-hl7-validator-report-jar ---
[DEBUG] properties used {project.baseUri=file:/home/jenkins/.hudson/jobs/Gazelle%20HL7%20Validator%20IGAMT/workspace/gazelle-hl7-validator-report-jar/, POM_GROUPID=net.ihe.gazelle, gazelle.preferences.version=1.1.0, env.BUILD_URL=https://gazelle.ihe.net/jenkins/job/Gazelle%20HL7%20Validator%20IGAMT/30/, application.url=http://gazelle.ihe.net/GazelleHL7Validator/, version.gpg.plugin=1.4, version.antrun.plugin=1.7, build.java.runtime.name=Java(TM) SE Runtime Environment, IS_M2RELEASEBUILD=false, build.parent.parent.reference=net.ihe.gazelle.maven:gazelle-tools:3.1.1, version.ear.plugin=2.8, SONARQUBE_SCANNER_PARAMS={ "sonar.host.url" : "https:\/\/gazelle.ihe.net\/sonar"}, user.dir=/home/jenkins/.hudson/jobs/Gazelle HL7 Validator IGAMT/workspace, build.copyright.year=null-2020, sonar.host.url=https://gazelle.ihe.net/sonar, build.java.compiler=HotSpot 64-Bit Tiered Compilers, java.vm.version=25.191-b12, application.name=GazelleHL7Validator, env.POM_DISPLAYNAME=GazelleHL7v2Validator, env.HUDSON_SERVER_COOKIE=76f5f4ef8af6c01d, version.install.plugin=2.4, M2_HOME=/home/jenkins/.hudson/tools/hudson.tasks.Maven_MavenInstallation/Maven3, version.emma=2.0.5312, version.shade.plugin=2.0, version.site.plugin=3.2, env.IS_M2RELEASEBUILD=false, max.pool.size=3, env.JENKINS_HOME=/home/jenkins/.hudson, exclude.bootstrap=true, sun.os.patch.level=unknown, env.HUDSON_HOME=/home/jenkins/.hudson, NODE_LABELS=master, version.injection.plugin=1.0.2, java.vm.specification.name=Java Virtual Machine Specification, SHELL=/bin/bash, EXECUTOR_NUMBER=2, jdk.min.version=1.7, WORKSPACE=/home/jenkins/.hudson/jobs/Gazelle HL7 Validator IGAMT/workspace, messages.mode=crowdin, profile=prod, version.rar.plugin=2.2, os.name=Linux, maven.version=3.5.2, hapi.version=2.2, build.os.name=Linux, java.vendor.url.bug=http://bugreport.sun.com/bugreport/, chhl7v3.validator.version=1.0.4, jboss.releases.repo.url=https://repository.jboss.org/nexus/service/local/staging/deploy/maven2/, arguments=-Pjboss-release, os.arch=amd64, user.name=jenkins, application.url.basename=GazelleHL7Validator, pdf.name=gazelle-hl7-validator-report-jar.pdf, sun.java.command=jenkins.maven3.agent.Maven35Main /home/jenkins/.hudson/tools/hudson.tasks.Maven_MavenInstallation/Maven3 /home/jenkins/.hudson/war/WEB-INF/lib/remoting-3.29.jar /home/jenkins/.hudson/plugins/maven-plugin/WEB-INF/lib/maven35-interceptor-1.13.jar /home/jenkins/.hudson/plugins/maven-plugin/WEB-INF/lib/maven3-interceptor-commons-1.13.jar 42337, env.SONAR_HOST_URL=https://gazelle.ihe.net/sonar, env.USER=jenkins, sonar.web.sourceDirectory=GazelleHL7v2Validation-ui/src/main/webapp, version.resources.plugin=2.6, PWD=/home/jenkins, env.XDG_SESSION_ID=c5, env.MAVEN_OPTS=-Djava.net.preferIPv4Stack=true -Dfile.encoding=UTF8 -Xmx4096m -XX:MaxPermSize=1024m, env.LOGNAME=jenkins, build.os.arch=amd64, project.reporting.outputEncoding=UTF-8, NODE_NAME=master, env.JENKINS_SERVER_COOKIE=76f5f4ef8af6c01d, build.version=3.6.0-SNAPSHOT, sourceReleaseAssemblyDescriptor=source-release, version.dependency.plugin=2.6, SONAR_MAVEN_GOAL=sonar:sonar, user.country=GB, build.contributors=IHE Development - KEREVAL and Inria, version.cobertura.plugin=2.5.2, env.SONARQUBE_SCANNER_PARAMS={ "sonar.host.url" : "https:\/\/gazelle.ihe.net\/sonar"}, BUILD_TAG=jenkins-Gazelle HL7 Validator IGAMT-30, RUN_CHANGES_DISPLAY_URL=https://gazelle.ihe.net/jenkins/job/Gazelle%20HL7%20Validator%20IGAMT/30/display/redirect?page=changes, java.endorsed.dirs=/usr/lib/jvm/java-8-oracle/jre/lib/endorsed, java.vm.specification.version=1.8, targetJdk=1.7, env.ROOT_BUILD_CAUSE_MANUALTRIGGER=true, env.SHLVL=1, version.javancss.plugin=2.0, LANGUAGE=en_GB.UTF-8, java.vendor=Oracle Corporation, MAVEN_OPTS=-Djava.net.preferIPv4Stack=true -Dfile.encoding=UTF8 -Xmx4096m -XX:MaxPermSize=1024m, sun.font.fontmanager=sun.awt.X11FontManager, version.jbossas7=7.1.1.Final, version.deploy.plugin=2.7, env.LANGUAGE=en_GB.UTF-8, env.POM_PACKAGING=pom, BUILD_URL=https://gazelle.ihe.net/jenkins/job/Gazelle%20HL7%20Validator%20IGAMT/30/, file.separator=/, HOME=/home/jenkins, build.version.full=3.6.0-20200615-SNAPSHOT, env.GIT_PREVIOUS_COMMIT=2df95e4706a3a13e9625d0c73afc7fe5c8da5afb, version.jee=6, sonar.exclusions=file:**/generated-sources/**, sun.java.launcher=SUN_STANDARD, env.MAIL=/var/mail/jenkins, build.java.runtime.version=1.8.0_191-b12, env.BUILD_NUMBER=30, min.pool.size=1, maven.min.version=3.0.3, java.library.path=/usr/java/packages/lib/amd64:/usr/lib64:/lib64:/lib:/usr/lib, version.release.plugin=2.3.2, env.LC_ALL=en_GB.UTF-8, GIT_URL=git@gitlab.inria.fr:gazelle/applications/test-execution/validator/gazellehl7v2validator.git, env.RUN_DISPLAY_URL=https://gazelle.ihe.net/jenkins/job/Gazelle%20HL7%20Validator%20IGAMT/30/display/redirect, project.build.sourceEncoding=UTF-8, sun.arch.data.model=64, version.jdepend.plugin=2.0-beta-2, J2REDIR=/usr/lib/jvm/java-8-oracle/jre, additionalparam=-Xdoclint:none, env.PATH=/home/jenkins/.hudson/tools/hudson.tasks.Maven_MavenInstallation/Maven3/bin:/usr/lib/jvm/java-8-oracle//bin:/usr/local/bin:/usr/bin:/bin:/usr/local/games:/usr/games:/usr/lib/jvm/java-8-oracle/bin:/usr/lib/jvm/java-8-oracle/db/bin:/usr/lib/jvm/java-8-oracle/jre/bin, path.separator=:, SONAR_CONFIG_NAME=Sonar, sun.io.unicode.encoding=UnicodeLittle, user.language=en, XDG_RUNTIME_DIR=/run/user/1002, env.GIT_COMMIT=2df95e4706a3a13e9625d0c73afc7fe5c8da5afb, build.timestamp.millis=1592213785234, version.surefire.plugin=2.12.3, JOB_NAME=Gazelle HL7 Validator IGAMT, JOB_DISPLAY_URL=https://gazelle.ihe.net/jenkins/job/Gazelle%20HL7%20Validator%20IGAMT/display/redirect, seam.debug=false, env.POM_GROUPID=net.ihe.gazelle, env.JOB_NAME=Gazelle HL7 Validator IGAMT, env.SONAR_CONFIG_NAME=Sonar, JENKINS_HOME=/home/jenkins/.hudson, LC_ALL=en_GB.UTF-8, vaadin.production.mode=true, build.java.vendor=Oracle Corporation, maven.compiler.source=1.7, java.class.version=52.0, env.GIT_BRANCH=origin/GazelleHL7v2Validator-IGAMT, gazelle.hql.version=2.1.2, buildNumber=UNKNOWN, timestamp=1592213786916, version.bundle.plugin=2.3.7, version.jacoco=0.5.8.201207111220, POM_ARTIFACTID=GazelleHL7v2Validator, file.encoding.pkg=sun.io, sun.cpu.endian=little, LANG=en_US.UTF-8, PATH+MAVEN=/home/jenkins/.hudson/tools/hudson.tasks.Maven_MavenInstallation/Maven3/bin, maven.compiler.target=1.7, build.application.name=gazelle-hl7-validator-report-jar, property=, JENKINS_URL=https://gazelle.ihe.net/jenkins/, env.SHELL=/bin/bash, jdbc.password=gazelle, java.home=/usr/lib/jvm/java-8-oracle/jre, hibernate.show_sql=false, gitb.version=1.0.0, GIT_COMMIT=2df95e4706a3a13e9625d0c73afc7fe5c8da5afb, ROOT_BUILD_CAUSE_MANUALTRIGGER=true, jdbc.driver.class=org.postgresql.Driver, env.NODE_LABELS=master, BUILD_CAUSE=MANUALTRIGGER, version.taglist.plugin=2.4, version.license.plugin=1.3, version.assembly.plugin=2.4, version.arquillian_core=1.0.1.Final, env.JENKINS_URL=https://gazelle.ihe.net/jenkins/, version.pmd.plugin=2.7.1, maven.home=/home/jenkins/.hudson/tools/hudson.tasks.Maven_MavenInstallation/Maven3, build.maven.execution.goals=clean, package, org.sonarsource.scanner.maven:sonar-maven-plugin:sonar, GIT_BRANCH=origin/GazelleHL7v2Validator-IGAMT, jdbc.connection.url=jdbc:postgresql:gazelle-hl7-validator, HUDSON_SERVER_COOKIE=76f5f4ef8af6c01d, build.maven.execution.isRoot=false, LOGNAME=jenkins, version.richfaces=4.3.5.Final, useReleaseProfile=false, version.plugin.plugin=3.1, version.checkstyle.plugin=2.9.1, sun.management.compiler=HotSpot 64-Bit Tiered Compilers, org.richfaces.bom.version=4.3.5.Final, POM_DISPLAYNAME=GazelleHL7v2Validator, BUILD_ID=30, version.richfaces.official=4.3.5.Final, version.ejb.plugin=2.3, env.BUILD_ID=30, version.testng=5.14.10, hibernate.hbm2ddl.auto=update, gmail.password=n3t.g@z3113, env.XDG_RUNTIME_DIR=/run/user/1002, maven.build.timestamp.format=yyyyMMdd-HHmm, java.vm.specification.vendor=Oracle Corporation, build.os.version=4.9.0-8-amd64, java.vm.name=Java HotSpot(TM) 64-Bit Server VM, ROOT_BUILD_CAUSE=MANUALTRIGGER, java.io.tmpdir=/tmp, java.vendor.url=http://java.oracle.com/, build.host.name=ns309963.ovh.net, mbval.documentation.version=1.1.10, gazelle.plugins.version=1.60, POM_VERSION=3.6.0-SNAPSHOT, build.maven.version=3.5.2, BUILD_NUMBER=30, sun.boot.library.path=/usr/lib/jvm/java-8-oracle/jre/lib/amd64, version.clean.plugin=2.5, build.java.vm=Java HotSpot(TM) 64-Bit Server VM, env.MAVEN_HOME=/home/jenkins/.hudson/tools/hudson.tasks.Maven_MavenInstallation/Maven3, build.user=jenkins, GIT_PREVIOUS_COMMIT=2df95e4706a3a13e9625d0c73afc7fe5c8da5afb, env.EXECUTOR_NUMBER=2, version.junit=4.8.2, version.drools=5.3.3.Final, java.runtime.name=Java(TM) SE Runtime Environment, exploded.war.file=false, maven.conf=/home/jenkins/.hudson/tools/hudson.tasks.Maven_MavenInstallation/Maven3/conf, USER=jenkins, gmail.account=net.gazelle@gmail.com, PATH+JDK=/usr/lib/jvm/java-8-oracle//bin, application.admin.email=anne-gaelle@ihe-europe.net, sun.cpu.isalist=, seam.docbook.version=1.1.0.GA, project.short.version=2.3, user.home=/home/jenkins, version.eclipse.plugin=2.9, env.JAVA_HOME=/usr/lib/jvm/java-8-oracle/, guice.disable.misplaced.annotation.check=true, java.specification.name=Java Platform API Specification, build.time=${build.date}, java.specification.vendor=Oracle Corporation, java.version=1.8.0_191, JOB_BASE_NAME=Gazelle HL7 Validator IGAMT, version.jsf2=2.1.7, crowdin.plugin.version=1.5, downloadSources=true, env._=/usr/lib/jvm/zulu-8-amd64/bin/java, env.DERBY_HOME=/usr/lib/jvm/java-8-oracle/db, version.resteasy=2.0-beta-2, hibernate.dialect=org.hibernate.dialect.PostgreSQLDialect, MAVEN_HOME=/home/jenkins/.hudson/tools/hudson.tasks.Maven_MavenInstallation/Maven3, BUILD_CAUSE_MANUALTRIGGER=true, version.sonar.plugin=2.0, env.BUILD_DISPLAY_NAME=#30, argLine="-javaagent:/home/jenkins/.m2/repository/org/jacoco/org.jacoco.agent/0.7.9/org.jacoco.agent-0.7.9-runtime.jar=destfile=/home/jenkins/.hudson/jobs/Gazelle HL7 Validator IGAMT/workspace/gazelle-hl7-validator-report-jar/target/jacoco.exec,append=true", build.datetime=Mon, 15 Jun 2020 11:36:26 +0200, version.buildhelper.plugin=1.7, version.apt.plugin=1.0-alpha-5, SONAR_HOST_URL=https://gazelle.ihe.net/sonar, XDG_SESSION_ID=c5, cas.service=http://gazelle.ihe.net/GazelleHL7Validator/, HUDSON_HOME=/home/jenkins/.hudson, env.M2_HOME=/home/jenkins/.hudson/tools/hudson.tasks.Maven_MavenInstallation/Maven3, gazelle.hl7.messagestructures.version=3.1.0, maven.build.timestamp=2020-06-15T09:36:34Z, env.PWD=/home/jenkins, line.separator=
, java.specification.version=1.8, java.vm.info=mixed mode, java.net.preferIPv4Stack=true, jbossorg.docbook.version=1.1.0, env.JOB_URL=https://gazelle.ihe.net/jenkins/job/Gazelle%20HL7%20Validator%20IGAMT/, MAIL=/var/mail/jenkins, xcpd.plq.validation.version=1.0.3, sun.boot.class.path=/usr/lib/jvm/java-8-oracle/jre/lib/resources.jar:/usr/lib/jvm/java-8-oracle/jre/lib/rt.jar:/usr/lib/jvm/java-8-oracle/jre/lib/sunrsasign.jar:/usr/lib/jvm/java-8-oracle/jre/lib/jsse.jar:/usr/lib/jvm/java-8-oracle/jre/lib/jce.jar:/usr/lib/jvm/java-8-oracle/jre/lib/charsets.jar:/usr/lib/jvm/java-8-oracle/jre/lib/jfr.jar:/usr/lib/jvm/java-8-oracle/jre/classes, version.jxr.plugin=2.3, build.maven.execution.project=net.ihe.gazelle:gazelle-hl7-validator-report-jar:jar:3.6.0-SNAPSHOT, DERBY_HOME=/usr/lib/jvm/java-8-oracle/db, JOB_URL=https://gazelle.ihe.net/jenkins/job/Gazelle%20HL7%20Validator%20IGAMT/, version.seam=2.3.1.Final, RUN_DISPLAY_URL=https://gazelle.ihe.net/jenkins/job/Gazelle%20HL7%20Validator%20IGAMT/30/display/redirect, jboss.snapshots.repo.url=https://repository.jboss.org/nexus/content/repositories/snapshots/, env.HOME=/home/jenkins, PATH=/usr/local/bin:/usr/bin:/bin:/usr/local/games:/usr/games:/usr/lib/jvm/java-8-oracle/bin:/usr/lib/jvm/java-8-oracle/db/bin:/usr/lib/jvm/java-8-oracle/jre/bin, env.JOB_BASE_NAME=Gazelle HL7 Validator IGAMT, maven.compiler.argument.source=1.7, env.BUILD_CAUSE=MANUALTRIGGER, cas.url=https://gazelle.ihe.net/, org.slf4j.simpleLogger.defaultLogLevel=debug, securerandom.source=file:/dev/./urandom, version.enforcer.plugin=1.2, version.failsafe.plugin=2.12.3, version.buildnumber.plugin=1.2, version.richfaces.cdk=4.2.2.Final, version.idea.plugin=2.2, env.SONAR_MAVEN_GOAL=sonar:sonar, java.awt.printerjob=sun.print.PSPrinterJob, sun.jnu.encoding=UTF-8, maven.compiler.argument.target=1.7, build.date.pattern=dd.MM.yyyy, env.POM_ARTIFACTID=GazelleHL7v2Validator, java.runtime.version=1.8.0_191-b12, build.maven.execution.profiles.active=prod, mail-properties, sonar, env.WORKSPACE=/home/jenkins/.hudson/jobs/Gazelle HL7 Validator IGAMT/workspace, POM_PACKAGING=pom, J2SDKDIR=/usr/lib/jvm/java-8-oracle, build.date.full=15/06/20 11:36:33 CEST, maven3.interceptor.common=/home/jenkins/.hudson/plugins/maven-plugin/WEB-INF/lib/maven3-interceptor-commons-1.13.jar, version.javacc.plugin=2.6, maven.build.version=Apache Maven 3.5.2 (138edd61fd100ec658bfa2d307c43b76940a5d7d; 2017-10-18T09:58:13+02:00), user.timezone=Europe/Paris, env.J2SDKDIR=/usr/lib/jvm/java-8-oracle, application.admin.name=Anne-Gaëlle Bergé, build.date=15.06.2020, version.javadoc.plugin=2.9, version.jar.plugin=2.4, env.RUN_CHANGES_DISPLAY_URL=https://gazelle.ihe.net/jenkins/job/Gazelle%20HL7%20Validator%20IGAMT/30/display/redirect?page=changes, java.ext.dirs=/usr/lib/jvm/java-8-oracle/jre/lib/ext:/usr/java/packages/lib/ext, _=/usr/lib/jvm/zulu-8-amd64/bin/java, env.JOB_DISPLAY_URL=https://gazelle.ihe.net/jenkins/job/Gazelle%20HL7%20Validator%20IGAMT/display/redirect, version.findbugs.plugin=2.5.2, build.maven.execution.profile.active.mail-properties=settings.xml, ihehl7v3.validation.version=1.5.5, env.HUDSON_URL=https://gazelle.ihe.net/jenkins/, java.class.path=/home/jenkins/.hudson/plugins/maven-plugin/WEB-INF/lib/maven35-agent-1.13.jar:/home/jenkins/.hudson/tools/hudson.tasks.Maven_MavenInstallation/Maven3/boot/plexus-classworlds-2.5.2.jar:/home/jenkins/.hudson/tools/hudson.tasks.Maven_MavenInstallation/Maven3/conf/logging, env.HUDSON_COOKIE=6cc8459b-014a-4762-b1dd-0cf4a79263a9, os.version=4.9.0-8-amd64, JAVA_HOME=/usr/lib/jvm/java-8-oracle/, env.ROOT_BUILD_CAUSE=MANUALTRIGGER, build.maven.execution.profile.active.sonar=settings.xml, env.NODE_NAME=master, JENKINS_SERVER_COOKIE=76f5f4ef8af6c01d, ksahl7v3.validation.version=1.0.1, SHLVL=1, version.wicket=1.4.14, env.BUILD_CAUSE_MANUALTRIGGER=true, build.parent.reference=net.ihe.gazelle:GazelleHL7v2Validator:3.6.0-20200615-SNAPSHOT, maven3.interceptor=/home/jenkins/.hudson/plugins/maven-plugin/WEB-INF/lib/maven35-interceptor-1.13.jar, CLASSPATH=, env.LANG=en_US.UTF-8, java.awt.graphicsenv=sun.awt.X11GraphicsEnvironment, env.POM_VERSION=3.6.0-SNAPSHOT, java.vm.vendor=Oracle Corporation, scmBranch=UNKNOWN_BRANCH, version.war.plugin=2.3, build.year=2020, version.pir.plugin=2.6, version.source.plugin=2.2.1, version.compiler.plugin=3.0, env.BUILD_TAG=jenkins-Gazelle HL7 Validator IGAMT-30, HUDSON_URL=https://gazelle.ihe.net/jenkins/, env.GIT_URL=git@gitlab.inria.fr:gazelle/applications/test-execution/validator/gazellehl7v2validator.git, BUILD_DISPLAY_NAME=#30, file.encoding=UTF8, env.J2REDIR=/usr/lib/jvm/java-8-oracle/jre, jdbc.user=gazelle, awt.toolkit=sun.awt.X11.XToolkit, version.clover2.plugin=3.1.8}
[INFO] Using 'UTF-8' encoding to copy filtered resources.
[DEBUG] resource with targetPath null
directory /home/jenkins/.hudson/jobs/Gazelle HL7 Validator IGAMT/workspace/gazelle-hl7-validator-report-jar/src/test/resources
excludes []
includes []
[INFO] skip non existing resourceDirectory /home/jenkins/.hudson/jobs/Gazelle HL7 Validator IGAMT/workspace/gazelle-hl7-validator-report-jar/src/test/resources
[DEBUG] no use filter components
[INFO] 
[INFO] --- maven-compiler-plugin:3.1:testCompile (default-testCompile) @ gazelle-hl7-validator-report-jar ---
[DEBUG] Using compiler 'javac'.
[INFO] No sources to compile
[INFO] 
[INFO] --- maven-surefire-plugin:2.20:test (default-test) @ gazelle-hl7-validator-report-jar ---
[INFO] No tests to run.
[JENKINS] Recording test results
[INFO] 
[INFO] --- jacoco-maven-plugin:0.7.9:report (post-unit-test) @ gazelle-hl7-validator-report-jar ---
[INFO] Skipping JaCoCo execution due to missing execution data file.
[INFO] 
[INFO] --- maven-jar-plugin:2.6:jar (default-jar) @ gazelle-hl7-validator-report-jar ---
[DEBUG] isUp2date: false (Destination /home/jenkins/.hudson/jobs/Gazelle HL7 Validator IGAMT/workspace/gazelle-hl7-validator-report-jar/target/gazelle-hl7-validator-report-jar.jar not found.)
[INFO] Building jar: /home/jenkins/.hudson/jobs/Gazelle HL7 Validator IGAMT/workspace/gazelle-hl7-validator-report-jar/target/gazelle-hl7-validator-report-jar.jar
[DEBUG] adding directory META-INF/
[DEBUG] adding entry META-INF/MANIFEST.MF
[DEBUG] adding directory net/
[DEBUG] adding directory net/ihe/
[DEBUG] adding directory net/ihe/gazelle/
[DEBUG] adding directory net/ihe/gazelle/hl7/
[DEBUG] adding directory net/ihe/gazelle/hl7/validator/
[DEBUG] adding directory net/ihe/gazelle/hl7/validator/report/
[DEBUG] adding directory net/ihe/gazelle/hl7/utils/
[DEBUG] adding directory net/ihe/gazelle/hl7/exception/
[DEBUG] adding directory net/ihe/gazelle/hl7/assertion/
[DEBUG] adding directory net/ihe/gazelle/hl7/validation/
[DEBUG] adding directory net/ihe/gazelle/hl7/validation/context/
[DEBUG] adding entry javac.sh
[DEBUG] adding entry META-INF/build.properties
[DEBUG] adding entry org.codehaus.plexus.compiler.javac.JavacCompiler2232226821735468768arguments
[DEBUG] adding entry net/ihe/gazelle/hl7/validator/report/ValidationCounters.class
[DEBUG] adding entry net/ihe/gazelle/hl7/validator/report/UsedResources.class
[DEBUG] adding entry net/ihe/gazelle/hl7/validator/report/HL7v2ValidationReport.class
[DEBUG] adding entry net/ihe/gazelle/hl7/validator/report/GazelleProfileException.class
[DEBUG] adding entry net/ihe/gazelle/hl7/validator/report/ValidationResults.class
[DEBUG] adding entry net/ihe/gazelle/hl7/validator/report/ValidationResults$1.class
[DEBUG] adding entry net/ihe/gazelle/hl7/validator/report/Error.class
[DEBUG] adding entry net/ihe/gazelle/hl7/validator/report/ValidationResultsOverview.class
[DEBUG] adding entry net/ihe/gazelle/hl7/validator/report/ValidationStatus.class
[DEBUG] adding entry net/ihe/gazelle/hl7/validator/report/UsedResource.class
[DEBUG] adding entry net/ihe/gazelle/hl7/validator/report/Warning.class
[DEBUG] adding entry net/ihe/gazelle/hl7/utils/PathBuilder.class
[DEBUG] adding entry net/ihe/gazelle/hl7/exception/GazelleErrorCode.class
[DEBUG] adding entry net/ihe/gazelle/hl7/exception/GazelleHL7Exception.class
[DEBUG] adding entry net/ihe/gazelle/hl7/assertion/GazelleHL7Assertion.class
[DEBUG] adding entry net/ihe/gazelle/hl7/assertion/AssertionType.class
[DEBUG] adding entry net/ihe/gazelle/hl7/validation/context/ValidationContext.class
[DEBUG] adding entry net/ihe/gazelle/hl7/validation/context/ValidationType.class
[DEBUG] adding entry net/ihe/gazelle/hl7/validation/context/ValidationOptions.class
[DEBUG] adding entry net/ihe/gazelle/hl7/validation/context/ProfileDefinition.class
[DEBUG] adding directory META-INF/maven/
[DEBUG] adding directory META-INF/maven/net.ihe.gazelle/
[DEBUG] adding directory META-INF/maven/net.ihe.gazelle/gazelle-hl7-validator-report-jar/
[DEBUG] adding entry META-INF/maven/net.ihe.gazelle/gazelle-hl7-validator-report-jar/pom.xml
[DEBUG] adding entry META-INF/maven/net.ihe.gazelle/gazelle-hl7-validator-report-jar/pom.properties
[DEBUG] adding entry META-INF/INDEX.LIST
[INFO] 
[INFO] --- maven-source-plugin:3.0.1:jar-no-fork (attach-sources) @ gazelle-hl7-validator-report-jar ---
[DEBUG] isUp2date: false (Destination /home/jenkins/.hudson/jobs/Gazelle HL7 Validator IGAMT/workspace/gazelle-hl7-validator-report-jar/target/gazelle-hl7-validator-report-jar-sources.jar not found.)
[INFO] Building jar: /home/jenkins/.hudson/jobs/Gazelle HL7 Validator IGAMT/workspace/gazelle-hl7-validator-report-jar/target/gazelle-hl7-validator-report-jar-sources.jar
[DEBUG] adding directory META-INF/
[DEBUG] adding entry META-INF/MANIFEST.MF
[DEBUG] adding directory net/
[DEBUG] adding directory net/ihe/
[DEBUG] adding directory net/ihe/gazelle/
[DEBUG] adding directory net/ihe/gazelle/hl7/
[DEBUG] adding directory net/ihe/gazelle/hl7/validator/
[DEBUG] adding directory net/ihe/gazelle/hl7/validator/report/
[DEBUG] adding directory net/ihe/gazelle/hl7/utils/
[DEBUG] adding directory net/ihe/gazelle/hl7/exception/
[DEBUG] adding directory net/ihe/gazelle/hl7/assertion/
[DEBUG] adding directory net/ihe/gazelle/hl7/validation/
[DEBUG] adding directory net/ihe/gazelle/hl7/validation/context/
[DEBUG] adding entry net/ihe/gazelle/hl7/validator/report/ValidationCounters.java
[DEBUG] adding entry net/ihe/gazelle/hl7/validator/report/ValidationResultsOverview.java
[DEBUG] adding entry net/ihe/gazelle/hl7/validator/report/ValidationStatus.java
[DEBUG] adding entry net/ihe/gazelle/hl7/validator/report/GazelleProfileException.java
[DEBUG] adding entry net/ihe/gazelle/hl7/validator/report/UsedResources.java
[DEBUG] adding entry net/ihe/gazelle/hl7/validator/report/HL7v2ValidationReport.java
[DEBUG] adding entry net/ihe/gazelle/hl7/validator/report/Error.java
[DEBUG] adding entry net/ihe/gazelle/hl7/validator/report/ValidationResults.java
[DEBUG] adding entry net/ihe/gazelle/hl7/validator/report/Warning.java
[DEBUG] adding entry net/ihe/gazelle/hl7/validator/report/UsedResource.java
[DEBUG] adding entry net/ihe/gazelle/hl7/utils/PathBuilder.java
[DEBUG] adding entry net/ihe/gazelle/hl7/exception/GazelleErrorCode.java
[DEBUG] adding entry net/ihe/gazelle/hl7/exception/GazelleHL7Exception.java
[DEBUG] adding entry net/ihe/gazelle/hl7/assertion/AssertionType.java
[DEBUG] adding entry net/ihe/gazelle/hl7/assertion/GazelleHL7Assertion.java
[DEBUG] adding entry net/ihe/gazelle/hl7/validation/context/ValidationContext.java
[DEBUG] adding entry net/ihe/gazelle/hl7/validation/context/ProfileDefinition.java
[DEBUG] adding entry net/ihe/gazelle/hl7/validation/context/ValidationType.java
[DEBUG] adding entry net/ihe/gazelle/hl7/validation/context/ValidationOptions.java
[DEBUG] adding directory META-INF/maven/
[DEBUG] adding directory META-INF/maven/net.ihe.gazelle/
[DEBUG] adding directory META-INF/maven/net.ihe.gazelle/gazelle-hl7-validator-report-jar/
[DEBUG] adding entry META-INF/maven/net.ihe.gazelle/gazelle-hl7-validator-report-jar/pom.xml
[DEBUG] adding entry META-INF/maven/net.ihe.gazelle/gazelle-hl7-validator-report-jar/pom.properties
[DEBUG] adding entry META-INF/INDEX.LIST
[INFO] 
[INFO] --- maven-jar-plugin:2.6:test-jar (default) @ gazelle-hl7-validator-report-jar ---
[WARNING] JAR will be empty - no content was marked for inclusion!
[DEBUG] isUp2date: false (Destination /home/jenkins/.hudson/jobs/Gazelle HL7 Validator IGAMT/workspace/gazelle-hl7-validator-report-jar/target/gazelle-hl7-validator-report-jar-tests.jar not found.)
[INFO] Building jar: /home/jenkins/.hudson/jobs/Gazelle HL7 Validator IGAMT/workspace/gazelle-hl7-validator-report-jar/target/gazelle-hl7-validator-report-jar-tests.jar
[DEBUG] adding directory META-INF/
[DEBUG] adding entry META-INF/MANIFEST.MF
[DEBUG] adding directory META-INF/maven/
[DEBUG] adding directory META-INF/maven/net.ihe.gazelle/
[DEBUG] adding directory META-INF/maven/net.ihe.gazelle/gazelle-hl7-validator-report-jar/
[DEBUG] adding entry META-INF/maven/net.ihe.gazelle/gazelle-hl7-validator-report-jar/pom.xml
[DEBUG] adding entry META-INF/maven/net.ihe.gazelle/gazelle-hl7-validator-report-jar/pom.properties
[DEBUG] adding entry META-INF/INDEX.LIST
Collecting metadata...
Metadata collection done.
Started calculate disk usage of build
Finished Calculation of disk usage of build in 0 seconds
Started calculate disk usage of workspace
Finished Calculation of disk usage of workspace in 0 seconds
[INFO] 
[INFO] ------------------------------------------------------------------------
[INFO] Building gazelle-hl7v2-validator-api-jar 3.6.0-SNAPSHOT
[INFO] ------------------------------------------------------------------------
[INFO] 
[INFO] --- maven-clean-plugin:3.0.0:clean (default-clean) @ gazelle-hl7v2-validator-api-jar ---
[INFO] Deleting /home/jenkins/.hudson/jobs/Gazelle HL7 Validator IGAMT/workspace/gazelle-hl7v2-validator-api-jar/target
[INFO] Deleting file /home/jenkins/.hudson/jobs/Gazelle HL7 Validator IGAMT/workspace/gazelle-hl7v2-validator-api-jar/target/gazelle-hl7v2-validator-api-jar.jar
[INFO] Deleting file /home/jenkins/.hudson/jobs/Gazelle HL7 Validator IGAMT/workspace/gazelle-hl7v2-validator-api-jar/target/maven-archiver/pom.properties
[INFO] Deleting directory /home/jenkins/.hudson/jobs/Gazelle HL7 Validator IGAMT/workspace/gazelle-hl7v2-validator-api-jar/target/maven-archiver
[INFO] Deleting file /home/jenkins/.hudson/jobs/Gazelle HL7 Validator IGAMT/workspace/gazelle-hl7v2-validator-api-jar/target/gazelle-hl7v2-validator-api-jar-sources.jar
[INFO] Deleting file /home/jenkins/.hudson/jobs/Gazelle HL7 Validator IGAMT/workspace/gazelle-hl7v2-validator-api-jar/target/classes/net/ihe/gazelle/hl7/messageprofiles/api/ProfileApi.class
[INFO] Deleting file /home/jenkins/.hudson/jobs/Gazelle HL7 Validator IGAMT/workspace/gazelle-hl7v2-validator-api-jar/target/classes/net/ihe/gazelle/hl7/messageprofiles/api/ResourceApi.class
[INFO] Deleting directory /home/jenkins/.hudson/jobs/Gazelle HL7 Validator IGAMT/workspace/gazelle-hl7v2-validator-api-jar/target/classes/net/ihe/gazelle/hl7/messageprofiles/api
[INFO] Deleting directory /home/jenkins/.hudson/jobs/Gazelle HL7 Validator IGAMT/workspace/gazelle-hl7v2-validator-api-jar/target/classes/net/ihe/gazelle/hl7/messageprofiles
[INFO] Deleting file /home/jenkins/.hudson/jobs/Gazelle HL7 Validator IGAMT/workspace/gazelle-hl7v2-validator-api-jar/target/classes/net/ihe/gazelle/hl7/validator/api/GenericHL7Validator.class
[INFO] Deleting directory /home/jenkins/.hudson/jobs/Gazelle HL7 Validator IGAMT/workspace/gazelle-hl7v2-validator-api-jar/target/classes/net/ihe/gazelle/hl7/validator/api
[INFO] Deleting directory /home/jenkins/.hudson/jobs/Gazelle HL7 Validator IGAMT/workspace/gazelle-hl7v2-validator-api-jar/target/classes/net/ihe/gazelle/hl7/validator
[INFO] Deleting directory /home/jenkins/.hudson/jobs/Gazelle HL7 Validator IGAMT/workspace/gazelle-hl7v2-validator-api-jar/target/classes/net/ihe/gazelle/hl7
[INFO] Deleting directory /home/jenkins/.hudson/jobs/Gazelle HL7 Validator IGAMT/workspace/gazelle-hl7v2-validator-api-jar/target/classes/net/ihe/gazelle
[INFO] Deleting directory /home/jenkins/.hudson/jobs/Gazelle HL7 Validator IGAMT/workspace/gazelle-hl7v2-validator-api-jar/target/classes/net/ihe
[INFO] Deleting directory /home/jenkins/.hudson/jobs/Gazelle HL7 Validator IGAMT/workspace/gazelle-hl7v2-validator-api-jar/target/classes/net
[INFO] Deleting file /home/jenkins/.hudson/jobs/Gazelle HL7 Validator IGAMT/workspace/gazelle-hl7v2-validator-api-jar/target/classes/META-INF/build.properties
[INFO] Deleting directory /home/jenkins/.hudson/jobs/Gazelle HL7 Validator IGAMT/workspace/gazelle-hl7v2-validator-api-jar/target/classes/META-INF
[INFO] Deleting file /home/jenkins/.hudson/jobs/Gazelle HL7 Validator IGAMT/workspace/gazelle-hl7v2-validator-api-jar/target/classes/javac.sh
[INFO] Deleting file /home/jenkins/.hudson/jobs/Gazelle HL7 Validator IGAMT/workspace/gazelle-hl7v2-validator-api-jar/target/classes/org.codehaus.plexus.compiler.javac.JavacCompiler933657020669868912arguments
[INFO] Deleting directory /home/jenkins/.hudson/jobs/Gazelle HL7 Validator IGAMT/workspace/gazelle-hl7v2-validator-api-jar/target/classes
[INFO] Deleting file /home/jenkins/.hudson/jobs/Gazelle HL7 Validator IGAMT/workspace/gazelle-hl7v2-validator-api-jar/target/buildmetadata.xml
[INFO] Deleting file /home/jenkins/.hudson/jobs/Gazelle HL7 Validator IGAMT/workspace/gazelle-hl7v2-validator-api-jar/target/gazelle-hl7v2-validator-api-jar-tests.jar
[INFO] Deleting file /home/jenkins/.hudson/jobs/Gazelle HL7 Validator IGAMT/workspace/gazelle-hl7v2-validator-api-jar/target/maven-status/maven-compiler-plugin/compile/default-compile/createdFiles.lst
[INFO] Deleting file /home/jenkins/.hudson/jobs/Gazelle HL7 Validator IGAMT/workspace/gazelle-hl7v2-validator-api-jar/target/maven-status/maven-compiler-plugin/compile/default-compile/inputFiles.lst
[INFO] Deleting directory /home/jenkins/.hudson/jobs/Gazelle HL7 Validator IGAMT/workspace/gazelle-hl7v2-validator-api-jar/target/maven-status/maven-compiler-plugin/compile/default-compile
[INFO] Deleting directory /home/jenkins/.hudson/jobs/Gazelle HL7 Validator IGAMT/workspace/gazelle-hl7v2-validator-api-jar/target/maven-status/maven-compiler-plugin/compile
[INFO] Deleting directory /home/jenkins/.hudson/jobs/Gazelle HL7 Validator IGAMT/workspace/gazelle-hl7v2-validator-api-jar/target/maven-status/maven-compiler-plugin
[INFO] Deleting directory /home/jenkins/.hudson/jobs/Gazelle HL7 Validator IGAMT/workspace/gazelle-hl7v2-validator-api-jar/target/maven-status
[INFO] Deleting directory /home/jenkins/.hudson/jobs/Gazelle HL7 Validator IGAMT/workspace/gazelle-hl7v2-validator-api-jar/target/generated-sources/annotations
[INFO] Deleting directory /home/jenkins/.hudson/jobs/Gazelle HL7 Validator IGAMT/workspace/gazelle-hl7v2-validator-api-jar/target/generated-sources
[INFO] Deleting directory /home/jenkins/.hudson/jobs/Gazelle HL7 Validator IGAMT/workspace/gazelle-hl7v2-validator-api-jar/target
[DEBUG] Skipping non-existing directory /home/jenkins/.hudson/jobs/Gazelle HL7 Validator IGAMT/workspace/gazelle-hl7v2-validator-api-jar/target/classes
[DEBUG] Skipping non-existing directory /home/jenkins/.hudson/jobs/Gazelle HL7 Validator IGAMT/workspace/gazelle-hl7v2-validator-api-jar/target/test-classes
[DEBUG] Skipping non-existing directory /home/jenkins/.hudson/jobs/Gazelle HL7 Validator IGAMT/workspace/gazelle-hl7v2-validator-api-jar/target/classes
[INFO] 
[INFO] --- maven-enforcer-plugin:1.2:enforce (enforce-java-version) @ gazelle-hl7v2-validator-api-jar ---
[DEBUG] Executing rule: org.apache.maven.plugins.enforcer.RequireJavaVersion
[DEBUG] Rule org.apache.maven.plugins.enforcer.RequireJavaVersion is cacheable.
[DEBUG] Key org.apache.maven.plugins.enforcer.RequireJavaVersion 48570 was found in the cache
[DEBUG] The cached results are still valid. Skipping the rule: org.apache.maven.plugins.enforcer.RequireJavaVersion
[INFO] 
[INFO] --- maven-enforcer-plugin:1.2:enforce (enforce-maven-version) @ gazelle-hl7v2-validator-api-jar ---
[DEBUG] Executing rule: org.apache.maven.plugins.enforcer.RequireMavenVersion
[DEBUG] Rule org.apache.maven.plugins.enforcer.RequireMavenVersion is cacheable.
[DEBUG] Key org.apache.maven.plugins.enforcer.RequireMavenVersion 48517562 was found in the cache
[DEBUG] The cached results are still valid. Skipping the rule: org.apache.maven.plugins.enforcer.RequireMavenVersion
[INFO] 
[INFO] --- buildnumber-maven-plugin:1.2:create-timestamp (get-build-timestamp) @ gazelle-hl7v2-validator-api-jar ---
[DEBUG] Using previously created timestamp.
[INFO] 
[INFO] --- buildnumber-maven-plugin:1.2:create (get-scm-revision) @ gazelle-hl7v2-validator-api-jar ---
[DEBUG] Revision available from previous execution
[INFO] 
[INFO] --- maven-buildmetadata-plugin:1.1.0.IHE.3:provide-buildmetadata (default) @ gazelle-hl7v2-validator-api-jar ---
[DEBUG] Using Maven level FINEST
[DEBUG] Reading config file 'logging-FINEST.properties'...
11:36:36,110 DEBUG [pool-1-thread-3 for channel id=1656511] MavenScmRevisionNumberFetcher:118 -   Fetching latest revision number.
    SCM connection info: url=scm:svn:svn+ssh://scm.gforge.inria.fr/svn/gazelle/Maven/GazelleHL7v2Validator/branches/GazelleHL7v2Validator-IGAMT/gazelle-hl7v2-validator-api-jar
    SCM access info: rootDirectory=/home/jenkins/.hudson/jobs/Gazelle HL7 Validator IGAMT/workspace/gazelle-hl7v2-validator-api-jar, dateFormat=yyyy-MM-dd HH:mm:ss, queryRangeInDays=30, failOnLocalModifications=false, ignoreDotFilesInBaseDir=true
[INFO] Executing: /bin/sh -c cd "/home/jenkins/.hudson/jobs/Gazelle HL7 Validator IGAMT/workspace/gazelle-hl7v2-validator-api-jar" && svn --non-interactive log -v -r '{2020-05-16 09:36:36 +0000}:{2020-06-16 09:36:36 +0000}' svn+ssh://scm.gforge.inria.fr/svn/gazelle/Maven/GazelleHL7v2Validator/branches/GazelleHL7v2Validator-IGAMT/gazelle-hl7v2-validator-api-jar
[INFO] Working directory: /home/jenkins/.hudson/jobs/Gazelle HL7 Validator IGAMT/workspace/gazelle-hl7v2-validator-api-jar
11:36:37,846 DEBUG [pool-1-thread-3 for channel id=1656511] MavenScmRevisionNumberFetcher:304 - No change log set found.
11:36:37,847 DEBUG [pool-1-thread-3 for channel id=1656511] MavenScmRevisionNumberFetcher:134 -   Found revision 'null'.
[INFO] Writing properties '/home/jenkins/.hudson/jobs/Gazelle HL7 Validator IGAMT/workspace/gazelle-hl7v2-validator-api-jar/target/classes/META-INF/build.properties'...
[INFO] Writing XML report '/home/jenkins/.hudson/jobs/Gazelle HL7 Validator IGAMT/workspace/gazelle-hl7v2-validator-api-jar/target/buildmetadata.xml'...
[INFO] 
[INFO] --- jacoco-maven-plugin:0.7.9:prepare-agent (default) @ gazelle-hl7v2-validator-api-jar ---
[INFO] argLine set to "-javaagent:/home/jenkins/.m2/repository/org/jacoco/org.jacoco.agent/0.7.9/org.jacoco.agent-0.7.9-runtime.jar=destfile=/home/jenkins/.hudson/jobs/Gazelle HL7 Validator IGAMT/workspace/gazelle-hl7v2-validator-api-jar/target/jacoco.exec,append=true"
[INFO] 
[INFO] --- maven-resources-plugin:3.0.2:resources (default-resources) @ gazelle-hl7v2-validator-api-jar ---
[DEBUG] properties used {project.baseUri=file:/home/jenkins/.hudson/jobs/Gazelle%20HL7%20Validator%20IGAMT/workspace/gazelle-hl7v2-validator-api-jar/, POM_GROUPID=net.ihe.gazelle, gazelle.preferences.version=1.1.0, env.BUILD_URL=https://gazelle.ihe.net/jenkins/job/Gazelle%20HL7%20Validator%20IGAMT/30/, application.url=http://gazelle.ihe.net/GazelleHL7Validator/, version.gpg.plugin=1.4, version.antrun.plugin=1.7, build.java.runtime.name=Java(TM) SE Runtime Environment, IS_M2RELEASEBUILD=false, build.parent.parent.reference=net.ihe.gazelle.maven:gazelle-tools:3.1.1, version.ear.plugin=2.8, SONARQUBE_SCANNER_PARAMS={ "sonar.host.url" : "https:\/\/gazelle.ihe.net\/sonar"}, user.dir=/home/jenkins/.hudson/jobs/Gazelle HL7 Validator IGAMT/workspace, build.copyright.year=null-2020, sonar.host.url=https://gazelle.ihe.net/sonar, build.java.compiler=HotSpot 64-Bit Tiered Compilers, java.vm.version=25.191-b12, application.name=GazelleHL7Validator, env.POM_DISPLAYNAME=GazelleHL7v2Validator, env.HUDSON_SERVER_COOKIE=76f5f4ef8af6c01d, version.install.plugin=2.4, M2_HOME=/home/jenkins/.hudson/tools/hudson.tasks.Maven_MavenInstallation/Maven3, version.emma=2.0.5312, version.shade.plugin=2.0, version.site.plugin=3.2, env.IS_M2RELEASEBUILD=false, max.pool.size=3, env.JENKINS_HOME=/home/jenkins/.hudson, exclude.bootstrap=true, sun.os.patch.level=unknown, env.HUDSON_HOME=/home/jenkins/.hudson, NODE_LABELS=master, version.injection.plugin=1.0.2, java.vm.specification.name=Java Virtual Machine Specification, SHELL=/bin/bash, EXECUTOR_NUMBER=2, jdk.min.version=1.7, WORKSPACE=/home/jenkins/.hudson/jobs/Gazelle HL7 Validator IGAMT/workspace, messages.mode=crowdin, profile=prod, version.rar.plugin=2.2, os.name=Linux, maven.version=3.5.2, hapi.version=2.2, build.os.name=Linux, java.vendor.url.bug=http://bugreport.sun.com/bugreport/, chhl7v3.validator.version=1.0.4, jboss.releases.repo.url=https://repository.jboss.org/nexus/service/local/staging/deploy/maven2/, arguments=-Pjboss-release, os.arch=amd64, user.name=jenkins, application.url.basename=GazelleHL7Validator, pdf.name=gazelle-hl7v2-validator-api-jar.pdf, sun.java.command=jenkins.maven3.agent.Maven35Main /home/jenkins/.hudson/tools/hudson.tasks.Maven_MavenInstallation/Maven3 /home/jenkins/.hudson/war/WEB-INF/lib/remoting-3.29.jar /home/jenkins/.hudson/plugins/maven-plugin/WEB-INF/lib/maven35-interceptor-1.13.jar /home/jenkins/.hudson/plugins/maven-plugin/WEB-INF/lib/maven3-interceptor-commons-1.13.jar 42337, env.SONAR_HOST_URL=https://gazelle.ihe.net/sonar, env.USER=jenkins, sonar.web.sourceDirectory=GazelleHL7v2Validation-ui/src/main/webapp, version.resources.plugin=2.6, PWD=/home/jenkins, env.XDG_SESSION_ID=c5, env.MAVEN_OPTS=-Djava.net.preferIPv4Stack=true -Dfile.encoding=UTF8 -Xmx4096m -XX:MaxPermSize=1024m, env.LOGNAME=jenkins, build.os.arch=amd64, project.reporting.outputEncoding=UTF-8, NODE_NAME=master, env.JENKINS_SERVER_COOKIE=76f5f4ef8af6c01d, build.version=3.6.0-SNAPSHOT, sourceReleaseAssemblyDescriptor=source-release, version.dependency.plugin=2.6, SONAR_MAVEN_GOAL=sonar:sonar, user.country=GB, build.contributors=IHE Development - KEREVAL and Inria, version.cobertura.plugin=2.5.2, env.SONARQUBE_SCANNER_PARAMS={ "sonar.host.url" : "https:\/\/gazelle.ihe.net\/sonar"}, BUILD_TAG=jenkins-Gazelle HL7 Validator IGAMT-30, RUN_CHANGES_DISPLAY_URL=https://gazelle.ihe.net/jenkins/job/Gazelle%20HL7%20Validator%20IGAMT/30/display/redirect?page=changes, java.endorsed.dirs=/usr/lib/jvm/java-8-oracle/jre/lib/endorsed, java.vm.specification.version=1.8, targetJdk=1.7, env.ROOT_BUILD_CAUSE_MANUALTRIGGER=true, env.SHLVL=1, version.javancss.plugin=2.0, LANGUAGE=en_GB.UTF-8, java.vendor=Oracle Corporation, MAVEN_OPTS=-Djava.net.preferIPv4Stack=true -Dfile.encoding=UTF8 -Xmx4096m -XX:MaxPermSize=1024m, sun.font.fontmanager=sun.awt.X11FontManager, version.jbossas7=7.1.1.Final, version.deploy.plugin=2.7, env.LANGUAGE=en_GB.UTF-8, env.POM_PACKAGING=pom, BUILD_URL=https://gazelle.ihe.net/jenkins/job/Gazelle%20HL7%20Validator%20IGAMT/30/, file.separator=/, HOME=/home/jenkins, build.version.full=3.6.0-20200615-SNAPSHOT, env.GIT_PREVIOUS_COMMIT=2df95e4706a3a13e9625d0c73afc7fe5c8da5afb, version.jee=6, sonar.exclusions=file:**/generated-sources/**, sun.java.launcher=SUN_STANDARD, env.MAIL=/var/mail/jenkins, build.java.runtime.version=1.8.0_191-b12, env.BUILD_NUMBER=30, min.pool.size=1, maven.min.version=3.0.3, java.library.path=/usr/java/packages/lib/amd64:/usr/lib64:/lib64:/lib:/usr/lib, version.release.plugin=2.3.2, env.LC_ALL=en_GB.UTF-8, GIT_URL=git@gitlab.inria.fr:gazelle/applications/test-execution/validator/gazellehl7v2validator.git, env.RUN_DISPLAY_URL=https://gazelle.ihe.net/jenkins/job/Gazelle%20HL7%20Validator%20IGAMT/30/display/redirect, project.build.sourceEncoding=UTF-8, sun.arch.data.model=64, version.jdepend.plugin=2.0-beta-2, J2REDIR=/usr/lib/jvm/java-8-oracle/jre, additionalparam=-Xdoclint:none, env.PATH=/home/jenkins/.hudson/tools/hudson.tasks.Maven_MavenInstallation/Maven3/bin:/usr/lib/jvm/java-8-oracle//bin:/usr/local/bin:/usr/bin:/bin:/usr/local/games:/usr/games:/usr/lib/jvm/java-8-oracle/bin:/usr/lib/jvm/java-8-oracle/db/bin:/usr/lib/jvm/java-8-oracle/jre/bin, path.separator=:, SONAR_CONFIG_NAME=Sonar, sun.io.unicode.encoding=UnicodeLittle, user.language=en, XDG_RUNTIME_DIR=/run/user/1002, env.GIT_COMMIT=2df95e4706a3a13e9625d0c73afc7fe5c8da5afb, build.timestamp.millis=1592213785234, version.surefire.plugin=2.12.3, JOB_NAME=Gazelle HL7 Validator IGAMT, JOB_DISPLAY_URL=https://gazelle.ihe.net/jenkins/job/Gazelle%20HL7%20Validator%20IGAMT/display/redirect, seam.debug=false, env.POM_GROUPID=net.ihe.gazelle, env.JOB_NAME=Gazelle HL7 Validator IGAMT, env.SONAR_CONFIG_NAME=Sonar, JENKINS_HOME=/home/jenkins/.hudson, LC_ALL=en_GB.UTF-8, vaadin.production.mode=true, build.java.vendor=Oracle Corporation, maven.compiler.source=1.7, java.class.version=52.0, env.GIT_BRANCH=origin/GazelleHL7v2Validator-IGAMT, gazelle.hql.version=2.1.2, buildNumber=UNKNOWN, timestamp=1592213786916, version.bundle.plugin=2.3.7, version.jacoco=0.5.8.201207111220, POM_ARTIFACTID=GazelleHL7v2Validator, file.encoding.pkg=sun.io, sun.cpu.endian=little, LANG=en_US.UTF-8, PATH+MAVEN=/home/jenkins/.hudson/tools/hudson.tasks.Maven_MavenInstallation/Maven3/bin, maven.compiler.target=1.7, build.application.name=gazelle-hl7v2-validator-api-jar, property=, JENKINS_URL=https://gazelle.ihe.net/jenkins/, env.SHELL=/bin/bash, jdbc.password=gazelle, java.home=/usr/lib/jvm/java-8-oracle/jre, hibernate.show_sql=false, gitb.version=1.0.0, GIT_COMMIT=2df95e4706a3a13e9625d0c73afc7fe5c8da5afb, ROOT_BUILD_CAUSE_MANUALTRIGGER=true, jdbc.driver.class=org.postgresql.Driver, env.NODE_LABELS=master, BUILD_CAUSE=MANUALTRIGGER, version.taglist.plugin=2.4, version.license.plugin=1.3, version.assembly.plugin=2.4, version.arquillian_core=1.0.1.Final, env.JENKINS_URL=https://gazelle.ihe.net/jenkins/, version.pmd.plugin=2.7.1, maven.home=/home/jenkins/.hudson/tools/hudson.tasks.Maven_MavenInstallation/Maven3, build.maven.execution.goals=clean, package, org.sonarsource.scanner.maven:sonar-maven-plugin:sonar, GIT_BRANCH=origin/GazelleHL7v2Validator-IGAMT, jdbc.connection.url=jdbc:postgresql:gazelle-hl7-validator, HUDSON_SERVER_COOKIE=76f5f4ef8af6c01d, build.maven.execution.isRoot=false, LOGNAME=jenkins, version.richfaces=4.3.5.Final, useReleaseProfile=false, version.plugin.plugin=3.1, version.checkstyle.plugin=2.9.1, sun.management.compiler=HotSpot 64-Bit Tiered Compilers, org.richfaces.bom.version=4.3.5.Final, POM_DISPLAYNAME=GazelleHL7v2Validator, BUILD_ID=30, version.richfaces.official=4.3.5.Final, version.ejb.plugin=2.3, env.BUILD_ID=30, version.testng=5.14.10, hibernate.hbm2ddl.auto=update, gmail.password=n3t.g@z3113, env.XDG_RUNTIME_DIR=/run/user/1002, maven.build.timestamp.format=yyyyMMdd-HHmm, java.vm.specification.vendor=Oracle Corporation, build.os.version=4.9.0-8-amd64, java.vm.name=Java HotSpot(TM) 64-Bit Server VM, ROOT_BUILD_CAUSE=MANUALTRIGGER, java.io.tmpdir=/tmp, java.vendor.url=http://java.oracle.com/, build.host.name=ns309963.ovh.net, mbval.documentation.version=1.1.10, gazelle.plugins.version=1.60, POM_VERSION=3.6.0-SNAPSHOT, build.maven.version=3.5.2, BUILD_NUMBER=30, sun.boot.library.path=/usr/lib/jvm/java-8-oracle/jre/lib/amd64, version.clean.plugin=2.5, build.java.vm=Java HotSpot(TM) 64-Bit Server VM, env.MAVEN_HOME=/home/jenkins/.hudson/tools/hudson.tasks.Maven_MavenInstallation/Maven3, build.user=jenkins, GIT_PREVIOUS_COMMIT=2df95e4706a3a13e9625d0c73afc7fe5c8da5afb, env.EXECUTOR_NUMBER=2, version.junit=4.8.2, version.drools=5.3.3.Final, java.runtime.name=Java(TM) SE Runtime Environment, exploded.war.file=false, maven.conf=/home/jenkins/.hudson/tools/hudson.tasks.Maven_MavenInstallation/Maven3/conf, USER=jenkins, gmail.account=net.gazelle@gmail.com, PATH+JDK=/usr/lib/jvm/java-8-oracle//bin, application.admin.email=anne-gaelle@ihe-europe.net, sun.cpu.isalist=, seam.docbook.version=1.1.0.GA, project.short.version=2.3, user.home=/home/jenkins, version.eclipse.plugin=2.9, env.JAVA_HOME=/usr/lib/jvm/java-8-oracle/, guice.disable.misplaced.annotation.check=true, java.specification.name=Java Platform API Specification, build.time=${build.date}, java.specification.vendor=Oracle Corporation, java.version=1.8.0_191, JOB_BASE_NAME=Gazelle HL7 Validator IGAMT, version.jsf2=2.1.7, crowdin.plugin.version=1.5, downloadSources=true, env._=/usr/lib/jvm/zulu-8-amd64/bin/java, env.DERBY_HOME=/usr/lib/jvm/java-8-oracle/db, version.resteasy=2.0-beta-2, hibernate.dialect=org.hibernate.dialect.PostgreSQLDialect, MAVEN_HOME=/home/jenkins/.hudson/tools/hudson.tasks.Maven_MavenInstallation/Maven3, BUILD_CAUSE_MANUALTRIGGER=true, version.sonar.plugin=2.0, env.BUILD_DISPLAY_NAME=#30, argLine="-javaagent:/home/jenkins/.m2/repository/org/jacoco/org.jacoco.agent/0.7.9/org.jacoco.agent-0.7.9-runtime.jar=destfile=/home/jenkins/.hudson/jobs/Gazelle HL7 Validator IGAMT/workspace/gazelle-hl7v2-validator-api-jar/target/jacoco.exec,append=true", build.datetime=Mon, 15 Jun 2020 11:36:26 +0200, version.buildhelper.plugin=1.7, version.apt.plugin=1.0-alpha-5, SONAR_HOST_URL=https://gazelle.ihe.net/sonar, XDG_SESSION_ID=c5, cas.service=http://gazelle.ihe.net/GazelleHL7Validator/, HUDSON_HOME=/home/jenkins/.hudson, env.M2_HOME=/home/jenkins/.hudson/tools/hudson.tasks.Maven_MavenInstallation/Maven3, gazelle.hl7.messagestructures.version=3.1.0, maven.build.timestamp=2020-06-15T09:36:37Z, env.PWD=/home/jenkins, line.separator=
, java.specification.version=1.8, java.vm.info=mixed mode, java.net.preferIPv4Stack=true, jbossorg.docbook.version=1.1.0, env.JOB_URL=https://gazelle.ihe.net/jenkins/job/Gazelle%20HL7%20Validator%20IGAMT/, MAIL=/var/mail/jenkins, xcpd.plq.validation.version=1.0.3, sun.boot.class.path=/usr/lib/jvm/java-8-oracle/jre/lib/resources.jar:/usr/lib/jvm/java-8-oracle/jre/lib/rt.jar:/usr/lib/jvm/java-8-oracle/jre/lib/sunrsasign.jar:/usr/lib/jvm/java-8-oracle/jre/lib/jsse.jar:/usr/lib/jvm/java-8-oracle/jre/lib/jce.jar:/usr/lib/jvm/java-8-oracle/jre/lib/charsets.jar:/usr/lib/jvm/java-8-oracle/jre/lib/jfr.jar:/usr/lib/jvm/java-8-oracle/jre/classes, version.jxr.plugin=2.3, build.maven.execution.project=net.ihe.gazelle:gazelle-hl7v2-validator-api-jar:jar:3.6.0-SNAPSHOT, DERBY_HOME=/usr/lib/jvm/java-8-oracle/db, JOB_URL=https://gazelle.ihe.net/jenkins/job/Gazelle%20HL7%20Validator%20IGAMT/, version.seam=2.3.1.Final, RUN_DISPLAY_URL=https://gazelle.ihe.net/jenkins/job/Gazelle%20HL7%20Validator%20IGAMT/30/display/redirect, jboss.snapshots.repo.url=https://repository.jboss.org/nexus/content/repositories/snapshots/, env.HOME=/home/jenkins, PATH=/usr/local/bin:/usr/bin:/bin:/usr/local/games:/usr/games:/usr/lib/jvm/java-8-oracle/bin:/usr/lib/jvm/java-8-oracle/db/bin:/usr/lib/jvm/java-8-oracle/jre/bin, env.JOB_BASE_NAME=Gazelle HL7 Validator IGAMT, maven.compiler.argument.source=1.7, env.BUILD_CAUSE=MANUALTRIGGER, cas.url=https://gazelle.ihe.net/, org.slf4j.simpleLogger.defaultLogLevel=debug, securerandom.source=file:/dev/./urandom, version.enforcer.plugin=1.2, version.failsafe.plugin=2.12.3, version.buildnumber.plugin=1.2, version.richfaces.cdk=4.2.2.Final, version.idea.plugin=2.2, env.SONAR_MAVEN_GOAL=sonar:sonar, java.awt.printerjob=sun.print.PSPrinterJob, sun.jnu.encoding=UTF-8, maven.compiler.argument.target=1.7, build.date.pattern=dd.MM.yyyy, env.POM_ARTIFACTID=GazelleHL7v2Validator, java.runtime.version=1.8.0_191-b12, build.maven.execution.profiles.active=prod, mail-properties, sonar, env.WORKSPACE=/home/jenkins/.hudson/jobs/Gazelle HL7 Validator IGAMT/workspace, POM_PACKAGING=pom, J2SDKDIR=/usr/lib/jvm/java-8-oracle, build.date.full=15/06/20 11:36:37 CEST, maven3.interceptor.common=/home/jenkins/.hudson/plugins/maven-plugin/WEB-INF/lib/maven3-interceptor-commons-1.13.jar, version.javacc.plugin=2.6, maven.build.version=Apache Maven 3.5.2 (138edd61fd100ec658bfa2d307c43b76940a5d7d; 2017-10-18T09:58:13+02:00), user.timezone=Europe/Paris, env.J2SDKDIR=/usr/lib/jvm/java-8-oracle, application.admin.name=Anne-Gaëlle Bergé, build.date=15.06.2020, version.javadoc.plugin=2.9, version.jar.plugin=2.4, env.RUN_CHANGES_DISPLAY_URL=https://gazelle.ihe.net/jenkins/job/Gazelle%20HL7%20Validator%20IGAMT/30/display/redirect?page=changes, java.ext.dirs=/usr/lib/jvm/java-8-oracle/jre/lib/ext:/usr/java/packages/lib/ext, _=/usr/lib/jvm/zulu-8-amd64/bin/java, env.JOB_DISPLAY_URL=https://gazelle.ihe.net/jenkins/job/Gazelle%20HL7%20Validator%20IGAMT/display/redirect, version.findbugs.plugin=2.5.2, build.maven.execution.profile.active.mail-properties=settings.xml, ihehl7v3.validation.version=1.5.5, env.HUDSON_URL=https://gazelle.ihe.net/jenkins/, java.class.path=/home/jenkins/.hudson/plugins/maven-plugin/WEB-INF/lib/maven35-agent-1.13.jar:/home/jenkins/.hudson/tools/hudson.tasks.Maven_MavenInstallation/Maven3/boot/plexus-classworlds-2.5.2.jar:/home/jenkins/.hudson/tools/hudson.tasks.Maven_MavenInstallation/Maven3/conf/logging, env.HUDSON_COOKIE=6cc8459b-014a-4762-b1dd-0cf4a79263a9, os.version=4.9.0-8-amd64, JAVA_HOME=/usr/lib/jvm/java-8-oracle/, env.ROOT_BUILD_CAUSE=MANUALTRIGGER, build.maven.execution.profile.active.sonar=settings.xml, env.NODE_NAME=master, JENKINS_SERVER_COOKIE=76f5f4ef8af6c01d, ksahl7v3.validation.version=1.0.1, SHLVL=1, version.wicket=1.4.14, env.BUILD_CAUSE_MANUALTRIGGER=true, build.parent.reference=net.ihe.gazelle:GazelleHL7v2Validator:3.6.0-20200615-SNAPSHOT, maven3.interceptor=/home/jenkins/.hudson/plugins/maven-plugin/WEB-INF/lib/maven35-interceptor-1.13.jar, CLASSPATH=, env.LANG=en_US.UTF-8, java.awt.graphicsenv=sun.awt.X11GraphicsEnvironment, env.POM_VERSION=3.6.0-SNAPSHOT, java.vm.vendor=Oracle Corporation, scmBranch=UNKNOWN_BRANCH, version.war.plugin=2.3, build.year=2020, version.pir.plugin=2.6, version.source.plugin=2.2.1, version.compiler.plugin=3.0, env.BUILD_TAG=jenkins-Gazelle HL7 Validator IGAMT-30, HUDSON_URL=https://gazelle.ihe.net/jenkins/, env.GIT_URL=git@gitlab.inria.fr:gazelle/applications/test-execution/validator/gazellehl7v2validator.git, BUILD_DISPLAY_NAME=#30, file.encoding=UTF8, env.J2REDIR=/usr/lib/jvm/java-8-oracle/jre, jdbc.user=gazelle, awt.toolkit=sun.awt.X11.XToolkit, version.clover2.plugin=3.1.8}
[INFO] Using 'UTF-8' encoding to copy filtered resources.
[DEBUG] resource with targetPath null
directory /home/jenkins/.hudson/jobs/Gazelle HL7 Validator IGAMT/workspace/gazelle-hl7v2-validator-api-jar/src/main/resources
excludes []
includes []
[INFO] skip non existing resourceDirectory /home/jenkins/.hudson/jobs/Gazelle HL7 Validator IGAMT/workspace/gazelle-hl7v2-validator-api-jar/src/main/resources
[DEBUG] no use filter components
[INFO] 
[INFO] --- maven-compiler-plugin:3.1:compile (default-compile) @ gazelle-hl7v2-validator-api-jar ---
[DEBUG] Using compiler 'javac'.
[DEBUG] Source directories: [/home/jenkins/.hudson/jobs/Gazelle HL7 Validator IGAMT/workspace/gazelle-hl7v2-validator-api-jar/src/main/java]
[DEBUG] Classpath: [/home/jenkins/.hudson/jobs/Gazelle HL7 Validator IGAMT/workspace/gazelle-hl7v2-validator-api-jar/target/classes
 /home/jenkins/.hudson/jobs/Gazelle HL7 Validator IGAMT/workspace/gazelle-hl7-validator-report-jar/target/gazelle-hl7-validator-report-jar.jar
 /home/jenkins/.m2/repository/ca/uhn/hapi/hapi-base/2.2/hapi-base-2.2.jar
 /home/jenkins/.m2/repository/org/slf4j/slf4j-api/1.7.21/slf4j-api-1.7.21.jar
 /home/jenkins/.m2/repository/org/jboss/seam/jboss-seam/2.3.1.Final/jboss-seam-2.3.1.Final.jar
 /home/jenkins/.m2/repository/org/beanshell/bsh/1.3.0/bsh-1.3.0.jar
 /home/jenkins/.m2/repository/org/jboss/el/jboss-el/1.0_02.CR6/jboss-el-1.0_02.CR6.jar
 /home/jenkins/.m2/repository/javax/el/el-api/2.2/el-api-2.2.jar]
[DEBUG] Output directory: /home/jenkins/.hudson/jobs/Gazelle HL7 Validator IGAMT/workspace/gazelle-hl7v2-validator-api-jar/target/classes
[DEBUG] CompilerReuseStrategy: reuseCreated
[DEBUG] useIncrementalCompilation enabled
[DEBUG] Stale source detected: /home/jenkins/.hudson/jobs/Gazelle HL7 Validator IGAMT/workspace/gazelle-hl7v2-validator-api-jar/src/main/java/net/ihe/gazelle/hl7/messageprofiles/api/ResourceApi.java
[DEBUG] Stale source detected: /home/jenkins/.hudson/jobs/Gazelle HL7 Validator IGAMT/workspace/gazelle-hl7v2-validator-api-jar/src/main/java/net/ihe/gazelle/hl7/validator/api/GenericHL7Validator.java
[DEBUG] Stale source detected: /home/jenkins/.hudson/jobs/Gazelle HL7 Validator IGAMT/workspace/gazelle-hl7v2-validator-api-jar/src/main/java/net/ihe/gazelle/hl7/messageprofiles/api/ProfileApi.java
[INFO] Changes detected - recompiling the module!
[DEBUG] Classpath:
[DEBUG]  /home/jenkins/.hudson/jobs/Gazelle HL7 Validator IGAMT/workspace/gazelle-hl7v2-validator-api-jar/target/classes
[DEBUG]  /home/jenkins/.hudson/jobs/Gazelle HL7 Validator IGAMT/workspace/gazelle-hl7-validator-report-jar/target/gazelle-hl7-validator-report-jar.jar
[DEBUG]  /home/jenkins/.m2/repository/ca/uhn/hapi/hapi-base/2.2/hapi-base-2.2.jar
[DEBUG]  /home/jenkins/.m2/repository/org/slf4j/slf4j-api/1.7.21/slf4j-api-1.7.21.jar
[DEBUG]  /home/jenkins/.m2/repository/org/jboss/seam/jboss-seam/2.3.1.Final/jboss-seam-2.3.1.Final.jar
[DEBUG]  /home/jenkins/.m2/repository/org/beanshell/bsh/1.3.0/bsh-1.3.0.jar
[DEBUG]  /home/jenkins/.m2/repository/org/jboss/el/jboss-el/1.0_02.CR6/jboss-el-1.0_02.CR6.jar
[DEBUG]  /home/jenkins/.m2/repository/javax/el/el-api/2.2/el-api-2.2.jar
[DEBUG] Source roots:
[DEBUG]  /home/jenkins/.hudson/jobs/Gazelle HL7 Validator IGAMT/workspace/gazelle-hl7v2-validator-api-jar/src/main/java
[DEBUG] Command line options:
[DEBUG] -d /home/jenkins/.hudson/jobs/Gazelle HL7 Validator IGAMT/workspace/gazelle-hl7v2-validator-api-jar/target/classes -classpath /home/jenkins/.hudson/jobs/Gazelle HL7 Validator IGAMT/workspace/gazelle-hl7v2-validator-api-jar/target/classes:/home/jenkins/.hudson/jobs/Gazelle HL7 Validator IGAMT/workspace/gazelle-hl7-validator-report-jar/target/gazelle-hl7-validator-report-jar.jar:/home/jenkins/.m2/repository/ca/uhn/hapi/hapi-base/2.2/hapi-base-2.2.jar:/home/jenkins/.m2/repository/org/slf4j/slf4j-api/1.7.21/slf4j-api-1.7.21.jar:/home/jenkins/.m2/repository/org/jboss/seam/jboss-seam/2.3.1.Final/jboss-seam-2.3.1.Final.jar:/home/jenkins/.m2/repository/org/beanshell/bsh/1.3.0/bsh-1.3.0.jar:/home/jenkins/.m2/repository/org/jboss/el/jboss-el/1.0_02.CR6/jboss-el-1.0_02.CR6.jar:/home/jenkins/.m2/repository/javax/el/el-api/2.2/el-api-2.2.jar: -sourcepath /home/jenkins/.hudson/jobs/Gazelle HL7 Validator IGAMT/workspace/gazelle-hl7v2-validator-api-jar/src/main/java: /home/jenkins/.hudson/jobs/Gazelle HL7 Validator IGAMT/workspace/gazelle-hl7v2-validator-api-jar/src/main/java/net/ihe/gazelle/hl7/messageprofiles/api/ResourceApi.java /home/jenkins/.hudson/jobs/Gazelle HL7 Validator IGAMT/workspace/gazelle-hl7v2-validator-api-jar/src/main/java/net/ihe/gazelle/hl7/messageprofiles/api/ProfileApi.java /home/jenkins/.hudson/jobs/Gazelle HL7 Validator IGAMT/workspace/gazelle-hl7v2-validator-api-jar/src/main/java/net/ihe/gazelle/hl7/validator/api/GenericHL7Validator.java -s /home/jenkins/.hudson/jobs/Gazelle HL7 Validator IGAMT/workspace/gazelle-hl7v2-validator-api-jar/target/generated-sources/annotations -g -deprecation -target 8 -source 8 -encoding UTF-8 -source 1.7 -target 1.7
[DEBUG] incrementalBuildHelper#beforeRebuildExecution
[INFO] Compiling 3 source files to /home/jenkins/.hudson/jobs/Gazelle HL7 Validator IGAMT/workspace/gazelle-hl7v2-validator-api-jar/target/classes
[DEBUG] incrementalBuildHelper#afterRebuildExecution
[INFO] 
[INFO] --- maven-resources-plugin:3.0.2:testResources (default-testResources) @ gazelle-hl7v2-validator-api-jar ---
[DEBUG] properties used {project.baseUri=file:/home/jenkins/.hudson/jobs/Gazelle%20HL7%20Validator%20IGAMT/workspace/gazelle-hl7v2-validator-api-jar/, POM_GROUPID=net.ihe.gazelle, gazelle.preferences.version=1.1.0, env.BUILD_URL=https://gazelle.ihe.net/jenkins/job/Gazelle%20HL7%20Validator%20IGAMT/30/, application.url=http://gazelle.ihe.net/GazelleHL7Validator/, version.gpg.plugin=1.4, version.antrun.plugin=1.7, build.java.runtime.name=Java(TM) SE Runtime Environment, IS_M2RELEASEBUILD=false, build.parent.parent.reference=net.ihe.gazelle.maven:gazelle-tools:3.1.1, version.ear.plugin=2.8, SONARQUBE_SCANNER_PARAMS={ "sonar.host.url" : "https:\/\/gazelle.ihe.net\/sonar"}, user.dir=/home/jenkins/.hudson/jobs/Gazelle HL7 Validator IGAMT/workspace, build.copyright.year=null-2020, sonar.host.url=https://gazelle.ihe.net/sonar, build.java.compiler=HotSpot 64-Bit Tiered Compilers, java.vm.version=25.191-b12, application.name=GazelleHL7Validator, env.POM_DISPLAYNAME=GazelleHL7v2Validator, env.HUDSON_SERVER_COOKIE=76f5f4ef8af6c01d, version.install.plugin=2.4, M2_HOME=/home/jenkins/.hudson/tools/hudson.tasks.Maven_MavenInstallation/Maven3, version.emma=2.0.5312, version.shade.plugin=2.0, version.site.plugin=3.2, env.IS_M2RELEASEBUILD=false, max.pool.size=3, env.JENKINS_HOME=/home/jenkins/.hudson, exclude.bootstrap=true, sun.os.patch.level=unknown, env.HUDSON_HOME=/home/jenkins/.hudson, NODE_LABELS=master, version.injection.plugin=1.0.2, java.vm.specification.name=Java Virtual Machine Specification, SHELL=/bin/bash, EXECUTOR_NUMBER=2, jdk.min.version=1.7, WORKSPACE=/home/jenkins/.hudson/jobs/Gazelle HL7 Validator IGAMT/workspace, messages.mode=crowdin, profile=prod, version.rar.plugin=2.2, os.name=Linux, maven.version=3.5.2, hapi.version=2.2, build.os.name=Linux, java.vendor.url.bug=http://bugreport.sun.com/bugreport/, chhl7v3.validator.version=1.0.4, jboss.releases.repo.url=https://repository.jboss.org/nexus/service/local/staging/deploy/maven2/, arguments=-Pjboss-release, os.arch=amd64, user.name=jenkins, application.url.basename=GazelleHL7Validator, pdf.name=gazelle-hl7v2-validator-api-jar.pdf, sun.java.command=jenkins.maven3.agent.Maven35Main /home/jenkins/.hudson/tools/hudson.tasks.Maven_MavenInstallation/Maven3 /home/jenkins/.hudson/war/WEB-INF/lib/remoting-3.29.jar /home/jenkins/.hudson/plugins/maven-plugin/WEB-INF/lib/maven35-interceptor-1.13.jar /home/jenkins/.hudson/plugins/maven-plugin/WEB-INF/lib/maven3-interceptor-commons-1.13.jar 42337, env.SONAR_HOST_URL=https://gazelle.ihe.net/sonar, env.USER=jenkins, sonar.web.sourceDirectory=GazelleHL7v2Validation-ui/src/main/webapp, version.resources.plugin=2.6, PWD=/home/jenkins, env.XDG_SESSION_ID=c5, env.MAVEN_OPTS=-Djava.net.preferIPv4Stack=true -Dfile.encoding=UTF8 -Xmx4096m -XX:MaxPermSize=1024m, env.LOGNAME=jenkins, build.os.arch=amd64, project.reporting.outputEncoding=UTF-8, NODE_NAME=master, env.JENKINS_SERVER_COOKIE=76f5f4ef8af6c01d, build.version=3.6.0-SNAPSHOT, sourceReleaseAssemblyDescriptor=source-release, version.dependency.plugin=2.6, SONAR_MAVEN_GOAL=sonar:sonar, user.country=GB, build.contributors=IHE Development - KEREVAL and Inria, version.cobertura.plugin=2.5.2, env.SONARQUBE_SCANNER_PARAMS={ "sonar.host.url" : "https:\/\/gazelle.ihe.net\/sonar"}, BUILD_TAG=jenkins-Gazelle HL7 Validator IGAMT-30, RUN_CHANGES_DISPLAY_URL=https://gazelle.ihe.net/jenkins/job/Gazelle%20HL7%20Validator%20IGAMT/30/display/redirect?page=changes, java.endorsed.dirs=/usr/lib/jvm/java-8-oracle/jre/lib/endorsed, java.vm.specification.version=1.8, targetJdk=1.7, env.ROOT_BUILD_CAUSE_MANUALTRIGGER=true, env.SHLVL=1, version.javancss.plugin=2.0, LANGUAGE=en_GB.UTF-8, java.vendor=Oracle Corporation, MAVEN_OPTS=-Djava.net.preferIPv4Stack=true -Dfile.encoding=UTF8 -Xmx4096m -XX:MaxPermSize=1024m, sun.font.fontmanager=sun.awt.X11FontManager, version.jbossas7=7.1.1.Final, version.deploy.plugin=2.7, env.LANGUAGE=en_GB.UTF-8, env.POM_PACKAGING=pom, BUILD_URL=https://gazelle.ihe.net/jenkins/job/Gazelle%20HL7%20Validator%20IGAMT/30/, file.separator=/, HOME=/home/jenkins, build.version.full=3.6.0-20200615-SNAPSHOT, env.GIT_PREVIOUS_COMMIT=2df95e4706a3a13e9625d0c73afc7fe5c8da5afb, version.jee=6, sonar.exclusions=file:**/generated-sources/**, sun.java.launcher=SUN_STANDARD, env.MAIL=/var/mail/jenkins, build.java.runtime.version=1.8.0_191-b12, env.BUILD_NUMBER=30, min.pool.size=1, maven.min.version=3.0.3, java.library.path=/usr/java/packages/lib/amd64:/usr/lib64:/lib64:/lib:/usr/lib, version.release.plugin=2.3.2, env.LC_ALL=en_GB.UTF-8, GIT_URL=git@gitlab.inria.fr:gazelle/applications/test-execution/validator/gazellehl7v2validator.git, env.RUN_DISPLAY_URL=https://gazelle.ihe.net/jenkins/job/Gazelle%20HL7%20Validator%20IGAMT/30/display/redirect, project.build.sourceEncoding=UTF-8, sun.arch.data.model=64, version.jdepend.plugin=2.0-beta-2, J2REDIR=/usr/lib/jvm/java-8-oracle/jre, additionalparam=-Xdoclint:none, env.PATH=/home/jenkins/.hudson/tools/hudson.tasks.Maven_MavenInstallation/Maven3/bin:/usr/lib/jvm/java-8-oracle//bin:/usr/local/bin:/usr/bin:/bin:/usr/local/games:/usr/games:/usr/lib/jvm/java-8-oracle/bin:/usr/lib/jvm/java-8-oracle/db/bin:/usr/lib/jvm/java-8-oracle/jre/bin, path.separator=:, SONAR_CONFIG_NAME=Sonar, sun.io.unicode.encoding=UnicodeLittle, user.language=en, XDG_RUNTIME_DIR=/run/user/1002, env.GIT_COMMIT=2df95e4706a3a13e9625d0c73afc7fe5c8da5afb, build.timestamp.millis=1592213785234, version.surefire.plugin=2.12.3, JOB_NAME=Gazelle HL7 Validator IGAMT, JOB_DISPLAY_URL=https://gazelle.ihe.net/jenkins/job/Gazelle%20HL7%20Validator%20IGAMT/display/redirect, seam.debug=false, env.POM_GROUPID=net.ihe.gazelle, env.JOB_NAME=Gazelle HL7 Validator IGAMT, env.SONAR_CONFIG_NAME=Sonar, JENKINS_HOME=/home/jenkins/.hudson, LC_ALL=en_GB.UTF-8, vaadin.production.mode=true, build.java.vendor=Oracle Corporation, maven.compiler.source=1.7, java.class.version=52.0, env.GIT_BRANCH=origin/GazelleHL7v2Validator-IGAMT, gazelle.hql.version=2.1.2, buildNumber=UNKNOWN, timestamp=1592213786916, version.bundle.plugin=2.3.7, version.jacoco=0.5.8.201207111220, POM_ARTIFACTID=GazelleHL7v2Validator, file.encoding.pkg=sun.io, sun.cpu.endian=little, LANG=en_US.UTF-8, PATH+MAVEN=/home/jenkins/.hudson/tools/hudson.tasks.Maven_MavenInstallation/Maven3/bin, maven.compiler.target=1.7, build.application.name=gazelle-hl7v2-validator-api-jar, property=, JENKINS_URL=https://gazelle.ihe.net/jenkins/, env.SHELL=/bin/bash, jdbc.password=gazelle, java.home=/usr/lib/jvm/java-8-oracle/jre, hibernate.show_sql=false, gitb.version=1.0.0, GIT_COMMIT=2df95e4706a3a13e9625d0c73afc7fe5c8da5afb, ROOT_BUILD_CAUSE_MANUALTRIGGER=true, jdbc.driver.class=org.postgresql.Driver, env.NODE_LABELS=master, BUILD_CAUSE=MANUALTRIGGER, version.taglist.plugin=2.4, version.license.plugin=1.3, version.assembly.plugin=2.4, version.arquillian_core=1.0.1.Final, env.JENKINS_URL=https://gazelle.ihe.net/jenkins/, version.pmd.plugin=2.7.1, maven.home=/home/jenkins/.hudson/tools/hudson.tasks.Maven_MavenInstallation/Maven3, build.maven.execution.goals=clean, package, org.sonarsource.scanner.maven:sonar-maven-plugin:sonar, GIT_BRANCH=origin/GazelleHL7v2Validator-IGAMT, jdbc.connection.url=jdbc:postgresql:gazelle-hl7-validator, HUDSON_SERVER_COOKIE=76f5f4ef8af6c01d, build.maven.execution.isRoot=false, LOGNAME=jenkins, version.richfaces=4.3.5.Final, useReleaseProfile=false, version.plugin.plugin=3.1, version.checkstyle.plugin=2.9.1, sun.management.compiler=HotSpot 64-Bit Tiered Compilers, org.richfaces.bom.version=4.3.5.Final, POM_DISPLAYNAME=GazelleHL7v2Validator, BUILD_ID=30, version.richfaces.official=4.3.5.Final, version.ejb.plugin=2.3, env.BUILD_ID=30, version.testng=5.14.10, hibernate.hbm2ddl.auto=update, gmail.password=n3t.g@z3113, env.XDG_RUNTIME_DIR=/run/user/1002, maven.build.timestamp.format=yyyyMMdd-HHmm, java.vm.specification.vendor=Oracle Corporation, build.os.version=4.9.0-8-amd64, java.vm.name=Java HotSpot(TM) 64-Bit Server VM, ROOT_BUILD_CAUSE=MANUALTRIGGER, java.io.tmpdir=/tmp, java.vendor.url=http://java.oracle.com/, build.host.name=ns309963.ovh.net, mbval.documentation.version=1.1.10, gazelle.plugins.version=1.60, POM_VERSION=3.6.0-SNAPSHOT, build.maven.version=3.5.2, BUILD_NUMBER=30, sun.boot.library.path=/usr/lib/jvm/java-8-oracle/jre/lib/amd64, version.clean.plugin=2.5, build.java.vm=Java HotSpot(TM) 64-Bit Server VM, env.MAVEN_HOME=/home/jenkins/.hudson/tools/hudson.tasks.Maven_MavenInstallation/Maven3, build.user=jenkins, GIT_PREVIOUS_COMMIT=2df95e4706a3a13e9625d0c73afc7fe5c8da5afb, env.EXECUTOR_NUMBER=2, version.junit=4.8.2, version.drools=5.3.3.Final, java.runtime.name=Java(TM) SE Runtime Environment, exploded.war.file=false, maven.conf=/home/jenkins/.hudson/tools/hudson.tasks.Maven_MavenInstallation/Maven3/conf, USER=jenkins, gmail.account=net.gazelle@gmail.com, PATH+JDK=/usr/lib/jvm/java-8-oracle//bin, application.admin.email=anne-gaelle@ihe-europe.net, sun.cpu.isalist=, seam.docbook.version=1.1.0.GA, project.short.version=2.3, user.home=/home/jenkins, version.eclipse.plugin=2.9, env.JAVA_HOME=/usr/lib/jvm/java-8-oracle/, guice.disable.misplaced.annotation.check=true, java.specification.name=Java Platform API Specification, build.time=${build.date}, java.specification.vendor=Oracle Corporation, java.version=1.8.0_191, JOB_BASE_NAME=Gazelle HL7 Validator IGAMT, version.jsf2=2.1.7, crowdin.plugin.version=1.5, downloadSources=true, env._=/usr/lib/jvm/zulu-8-amd64/bin/java, env.DERBY_HOME=/usr/lib/jvm/java-8-oracle/db, version.resteasy=2.0-beta-2, hibernate.dialect=org.hibernate.dialect.PostgreSQLDialect, MAVEN_HOME=/home/jenkins/.hudson/tools/hudson.tasks.Maven_MavenInstallation/Maven3, BUILD_CAUSE_MANUALTRIGGER=true, version.sonar.plugin=2.0, env.BUILD_DISPLAY_NAME=#30, argLine="-javaagent:/home/jenkins/.m2/repository/org/jacoco/org.jacoco.agent/0.7.9/org.jacoco.agent-0.7.9-runtime.jar=destfile=/home/jenkins/.hudson/jobs/Gazelle HL7 Validator IGAMT/workspace/gazelle-hl7v2-validator-api-jar/target/jacoco.exec,append=true", build.datetime=Mon, 15 Jun 2020 11:36:26 +0200, version.buildhelper.plugin=1.7, version.apt.plugin=1.0-alpha-5, SONAR_HOST_URL=https://gazelle.ihe.net/sonar, XDG_SESSION_ID=c5, cas.service=http://gazelle.ihe.net/GazelleHL7Validator/, HUDSON_HOME=/home/jenkins/.hudson, env.M2_HOME=/home/jenkins/.hudson/tools/hudson.tasks.Maven_MavenInstallation/Maven3, gazelle.hl7.messagestructures.version=3.1.0, maven.build.timestamp=2020-06-15T09:36:38Z, env.PWD=/home/jenkins, line.separator=
, java.specification.version=1.8, java.vm.info=mixed mode, java.net.preferIPv4Stack=true, jbossorg.docbook.version=1.1.0, env.JOB_URL=https://gazelle.ihe.net/jenkins/job/Gazelle%20HL7%20Validator%20IGAMT/, MAIL=/var/mail/jenkins, xcpd.plq.validation.version=1.0.3, sun.boot.class.path=/usr/lib/jvm/java-8-oracle/jre/lib/resources.jar:/usr/lib/jvm/java-8-oracle/jre/lib/rt.jar:/usr/lib/jvm/java-8-oracle/jre/lib/sunrsasign.jar:/usr/lib/jvm/java-8-oracle/jre/lib/jsse.jar:/usr/lib/jvm/java-8-oracle/jre/lib/jce.jar:/usr/lib/jvm/java-8-oracle/jre/lib/charsets.jar:/usr/lib/jvm/java-8-oracle/jre/lib/jfr.jar:/usr/lib/jvm/java-8-oracle/jre/classes, version.jxr.plugin=2.3, build.maven.execution.project=net.ihe.gazelle:gazelle-hl7v2-validator-api-jar:jar:3.6.0-SNAPSHOT, DERBY_HOME=/usr/lib/jvm/java-8-oracle/db, JOB_URL=https://gazelle.ihe.net/jenkins/job/Gazelle%20HL7%20Validator%20IGAMT/, version.seam=2.3.1.Final, RUN_DISPLAY_URL=https://gazelle.ihe.net/jenkins/job/Gazelle%20HL7%20Validator%20IGAMT/30/display/redirect, jboss.snapshots.repo.url=https://repository.jboss.org/nexus/content/repositories/snapshots/, env.HOME=/home/jenkins, PATH=/usr/local/bin:/usr/bin:/bin:/usr/local/games:/usr/games:/usr/lib/jvm/java-8-oracle/bin:/usr/lib/jvm/java-8-oracle/db/bin:/usr/lib/jvm/java-8-oracle/jre/bin, env.JOB_BASE_NAME=Gazelle HL7 Validator IGAMT, maven.compiler.argument.source=1.7, env.BUILD_CAUSE=MANUALTRIGGER, cas.url=https://gazelle.ihe.net/, org.slf4j.simpleLogger.defaultLogLevel=debug, securerandom.source=file:/dev/./urandom, version.enforcer.plugin=1.2, version.failsafe.plugin=2.12.3, version.buildnumber.plugin=1.2, version.richfaces.cdk=4.2.2.Final, version.idea.plugin=2.2, env.SONAR_MAVEN_GOAL=sonar:sonar, java.awt.printerjob=sun.print.PSPrinterJob, sun.jnu.encoding=UTF-8, maven.compiler.argument.target=1.7, build.date.pattern=dd.MM.yyyy, env.POM_ARTIFACTID=GazelleHL7v2Validator, java.runtime.version=1.8.0_191-b12, build.maven.execution.profiles.active=prod, mail-properties, sonar, env.WORKSPACE=/home/jenkins/.hudson/jobs/Gazelle HL7 Validator IGAMT/workspace, POM_PACKAGING=pom, J2SDKDIR=/usr/lib/jvm/java-8-oracle, build.date.full=15/06/20 11:36:37 CEST, maven3.interceptor.common=/home/jenkins/.hudson/plugins/maven-plugin/WEB-INF/lib/maven3-interceptor-commons-1.13.jar, version.javacc.plugin=2.6, maven.build.version=Apache Maven 3.5.2 (138edd61fd100ec658bfa2d307c43b76940a5d7d; 2017-10-18T09:58:13+02:00), user.timezone=Europe/Paris, env.J2SDKDIR=/usr/lib/jvm/java-8-oracle, application.admin.name=Anne-Gaëlle Bergé, build.date=15.06.2020, version.javadoc.plugin=2.9, version.jar.plugin=2.4, env.RUN_CHANGES_DISPLAY_URL=https://gazelle.ihe.net/jenkins/job/Gazelle%20HL7%20Validator%20IGAMT/30/display/redirect?page=changes, java.ext.dirs=/usr/lib/jvm/java-8-oracle/jre/lib/ext:/usr/java/packages/lib/ext, _=/usr/lib/jvm/zulu-8-amd64/bin/java, env.JOB_DISPLAY_URL=https://gazelle.ihe.net/jenkins/job/Gazelle%20HL7%20Validator%20IGAMT/display/redirect, version.findbugs.plugin=2.5.2, build.maven.execution.profile.active.mail-properties=settings.xml, ihehl7v3.validation.version=1.5.5, env.HUDSON_URL=https://gazelle.ihe.net/jenkins/, java.class.path=/home/jenkins/.hudson/plugins/maven-plugin/WEB-INF/lib/maven35-agent-1.13.jar:/home/jenkins/.hudson/tools/hudson.tasks.Maven_MavenInstallation/Maven3/boot/plexus-classworlds-2.5.2.jar:/home/jenkins/.hudson/tools/hudson.tasks.Maven_MavenInstallation/Maven3/conf/logging, env.HUDSON_COOKIE=6cc8459b-014a-4762-b1dd-0cf4a79263a9, os.version=4.9.0-8-amd64, JAVA_HOME=/usr/lib/jvm/java-8-oracle/, env.ROOT_BUILD_CAUSE=MANUALTRIGGER, build.maven.execution.profile.active.sonar=settings.xml, env.NODE_NAME=master, JENKINS_SERVER_COOKIE=76f5f4ef8af6c01d, ksahl7v3.validation.version=1.0.1, SHLVL=1, version.wicket=1.4.14, env.BUILD_CAUSE_MANUALTRIGGER=true, build.parent.reference=net.ihe.gazelle:GazelleHL7v2Validator:3.6.0-20200615-SNAPSHOT, maven3.interceptor=/home/jenkins/.hudson/plugins/maven-plugin/WEB-INF/lib/maven35-interceptor-1.13.jar, CLASSPATH=, env.LANG=en_US.UTF-8, java.awt.graphicsenv=sun.awt.X11GraphicsEnvironment, env.POM_VERSION=3.6.0-SNAPSHOT, java.vm.vendor=Oracle Corporation, scmBranch=UNKNOWN_BRANCH, version.war.plugin=2.3, build.year=2020, version.pir.plugin=2.6, version.source.plugin=2.2.1, version.compiler.plugin=3.0, env.BUILD_TAG=jenkins-Gazelle HL7 Validator IGAMT-30, HUDSON_URL=https://gazelle.ihe.net/jenkins/, env.GIT_URL=git@gitlab.inria.fr:gazelle/applications/test-execution/validator/gazellehl7v2validator.git, BUILD_DISPLAY_NAME=#30, file.encoding=UTF8, env.J2REDIR=/usr/lib/jvm/java-8-oracle/jre, jdbc.user=gazelle, awt.toolkit=sun.awt.X11.XToolkit, version.clover2.plugin=3.1.8}
[INFO] Using 'UTF-8' encoding to copy filtered resources.
[DEBUG] resource with targetPath null
directory /home/jenkins/.hudson/jobs/Gazelle HL7 Validator IGAMT/workspace/gazelle-hl7v2-validator-api-jar/src/test/resources
excludes []
includes []
[INFO] skip non existing resourceDirectory /home/jenkins/.hudson/jobs/Gazelle HL7 Validator IGAMT/workspace/gazelle-hl7v2-validator-api-jar/src/test/resources
[DEBUG] no use filter components
[INFO] 
[INFO] --- maven-compiler-plugin:3.1:testCompile (default-testCompile) @ gazelle-hl7v2-validator-api-jar ---
[DEBUG] Using compiler 'javac'.
[INFO] No sources to compile
[INFO] 
[INFO] --- maven-surefire-plugin:2.20:test (default-test) @ gazelle-hl7v2-validator-api-jar ---
[INFO] No tests to run.
[JENKINS] Recording test results
[INFO] 
[INFO] --- jacoco-maven-plugin:0.7.9:report (post-unit-test) @ gazelle-hl7v2-validator-api-jar ---
[INFO] Skipping JaCoCo execution due to missing execution data file.
[INFO] 
[INFO] --- maven-jar-plugin:2.6:jar (default-jar) @ gazelle-hl7v2-validator-api-jar ---
[DEBUG] isUp2date: false (Destination /home/jenkins/.hudson/jobs/Gazelle HL7 Validator IGAMT/workspace/gazelle-hl7v2-validator-api-jar/target/gazelle-hl7v2-validator-api-jar.jar not found.)
[INFO] Building jar: /home/jenkins/.hudson/jobs/Gazelle HL7 Validator IGAMT/workspace/gazelle-hl7v2-validator-api-jar/target/gazelle-hl7v2-validator-api-jar.jar
[DEBUG] adding directory META-INF/
[DEBUG] adding entry META-INF/MANIFEST.MF
[DEBUG] adding directory net/
[DEBUG] adding directory net/ihe/
[DEBUG] adding directory net/ihe/gazelle/
[DEBUG] adding directory net/ihe/gazelle/hl7/
[DEBUG] adding directory net/ihe/gazelle/hl7/validator/
[DEBUG] adding directory net/ihe/gazelle/hl7/validator/api/
[DEBUG] adding directory net/ihe/gazelle/hl7/messageprofiles/
[DEBUG] adding directory net/ihe/gazelle/hl7/messageprofiles/api/
[DEBUG] adding entry javac.sh
[DEBUG] adding entry META-INF/build.properties
[DEBUG] adding entry org.codehaus.plexus.compiler.javac.JavacCompiler989392030585010006arguments
[DEBUG] adding entry net/ihe/gazelle/hl7/validator/api/GenericHL7Validator.class
[DEBUG] adding entry net/ihe/gazelle/hl7/messageprofiles/api/ResourceApi.class
[DEBUG] adding entry net/ihe/gazelle/hl7/messageprofiles/api/ProfileApi.class
[DEBUG] adding directory META-INF/maven/
[DEBUG] adding directory META-INF/maven/net.ihe.gazelle/
[DEBUG] adding directory META-INF/maven/net.ihe.gazelle/gazelle-hl7v2-validator-api-jar/
[DEBUG] adding entry META-INF/maven/net.ihe.gazelle/gazelle-hl7v2-validator-api-jar/pom.xml
[DEBUG] adding entry META-INF/maven/net.ihe.gazelle/gazelle-hl7v2-validator-api-jar/pom.properties
[DEBUG] adding entry META-INF/INDEX.LIST
[INFO] 
[INFO] --- maven-source-plugin:3.0.1:jar-no-fork (attach-sources) @ gazelle-hl7v2-validator-api-jar ---
[DEBUG] isUp2date: false (Destination /home/jenkins/.hudson/jobs/Gazelle HL7 Validator IGAMT/workspace/gazelle-hl7v2-validator-api-jar/target/gazelle-hl7v2-validator-api-jar-sources.jar not found.)
[INFO] Building jar: /home/jenkins/.hudson/jobs/Gazelle HL7 Validator IGAMT/workspace/gazelle-hl7v2-validator-api-jar/target/gazelle-hl7v2-validator-api-jar-sources.jar
[DEBUG] adding directory META-INF/
[DEBUG] adding entry META-INF/MANIFEST.MF
[DEBUG] adding directory net/
[DEBUG] adding directory net/ihe/
[DEBUG] adding directory net/ihe/gazelle/
[DEBUG] adding directory net/ihe/gazelle/hl7/
[DEBUG] adding directory net/ihe/gazelle/hl7/validator/
[DEBUG] adding directory net/ihe/gazelle/hl7/validator/api/
[DEBUG] adding directory net/ihe/gazelle/hl7/messageprofiles/
[DEBUG] adding directory net/ihe/gazelle/hl7/messageprofiles/api/
[DEBUG] adding entry net/ihe/gazelle/hl7/validator/api/GenericHL7Validator.java
[DEBUG] adding entry net/ihe/gazelle/hl7/messageprofiles/api/ProfileApi.java
[DEBUG] adding entry net/ihe/gazelle/hl7/messageprofiles/api/ResourceApi.java
[DEBUG] adding directory META-INF/maven/
[DEBUG] adding directory META-INF/maven/net.ihe.gazelle/
[DEBUG] adding directory META-INF/maven/net.ihe.gazelle/gazelle-hl7v2-validator-api-jar/
[DEBUG] adding entry META-INF/maven/net.ihe.gazelle/gazelle-hl7v2-validator-api-jar/pom.xml
[DEBUG] adding entry META-INF/maven/net.ihe.gazelle/gazelle-hl7v2-validator-api-jar/pom.properties
[DEBUG] adding entry META-INF/INDEX.LIST
[INFO] 
[INFO] --- maven-jar-plugin:2.6:test-jar (default) @ gazelle-hl7v2-validator-api-jar ---
[WARNING] JAR will be empty - no content was marked for inclusion!
[DEBUG] isUp2date: false (Destination /home/jenkins/.hudson/jobs/Gazelle HL7 Validator IGAMT/workspace/gazelle-hl7v2-validator-api-jar/target/gazelle-hl7v2-validator-api-jar-tests.jar not found.)
[INFO] Building jar: /home/jenkins/.hudson/jobs/Gazelle HL7 Validator IGAMT/workspace/gazelle-hl7v2-validator-api-jar/target/gazelle-hl7v2-validator-api-jar-tests.jar
[DEBUG] adding directory META-INF/
[DEBUG] adding entry META-INF/MANIFEST.MF
[DEBUG] adding directory META-INF/maven/
[DEBUG] adding directory META-INF/maven/net.ihe.gazelle/
[DEBUG] adding directory META-INF/maven/net.ihe.gazelle/gazelle-hl7v2-validator-api-jar/
[DEBUG] adding entry META-INF/maven/net.ihe.gazelle/gazelle-hl7v2-validator-api-jar/pom.xml
[DEBUG] adding entry META-INF/maven/net.ihe.gazelle/gazelle-hl7v2-validator-api-jar/pom.properties
[DEBUG] adding entry META-INF/INDEX.LIST
Collecting metadata...
Metadata collection done.
Started calculate disk usage of build
Finished Calculation of disk usage of build in 0 seconds
Started calculate disk usage of workspace
Finished Calculation of disk usage of workspace in 0 seconds
[INFO] 
[INFO] ------------------------------------------------------------------------
[INFO] Building gvt-validation-jar 3.6.0-SNAPSHOT
[INFO] ------------------------------------------------------------------------
[WARNING] The POM for gov.nist:hl7-v2-validation:jar:1.4.2 is missing, no dependency information available
Collecting metadata...
Metadata collection done.
Started calculate disk usage of build
Finished Calculation of disk usage of build in 0 seconds
Started calculate disk usage of workspace
Finished Calculation of disk usage of workspace in 0 seconds
[INFO] 
[INFO] ------------------------------------------------------------------------
[INFO] Skipping GazelleHL7v2Validator
[INFO] This project has been banned from the build due to previous failures.
[INFO] ------------------------------------------------------------------------
[INFO] ------------------------------------------------------------------------
[INFO] Reactor Summary:
[INFO] 
[INFO] GazelleHL7v2Validator .............................. SUCCESS [  4.682 s]
[INFO] gazelle-hl7-validator-report-jar ................... SUCCESS [  3.767 s]
[INFO] gazelle-hl7v2-validator-api-jar .................... SUCCESS [  3.131 s]
[INFO] gvt-validation-jar ................................. FAILURE [  0.041 s]
[INFO] GazelleHL7v2Validator-ejb .......................... SKIPPED
[INFO] GazelleHL7v2Validator-ui ........................... SKIPPED
[INFO] GazelleHL7v2Validator-ear .......................... SKIPPED
[INFO] ------------------------------------------------------------------------
[INFO] BUILD FAILURE
[INFO] ------------------------------------------------------------------------
[INFO] Total time: 15.276 s
[INFO] Finished at: 2020-06-15T11:36:40+02:00
[INFO] Final Memory: 48M/665M
[INFO] ------------------------------------------------------------------------
[ERROR] Failed to execute goal on project gvt-validation-jar: Could not resolve dependencies for project net.ihe.gazelle:gvt-validation-jar:jar:3.6.0-SNAPSHOT: Failure to find gov.nist:hl7-v2-validation:jar:1.4.2 in https://gazelle.ihe.net/nexus/content/groups/public was cached in the local repository, resolution will not be reattempted until the update interval of nexus has elapsed or updates are forced -> [Help 1]
org.apache.maven.lifecycle.LifecycleExecutionException: Failed to execute goal on project gvt-validation-jar: Could not resolve dependencies for project net.ihe.gazelle:gvt-validation-jar:jar:3.6.0-SNAPSHOT: Failure to find gov.nist:hl7-v2-validation:jar:1.4.2 in https://gazelle.ihe.net/nexus/content/groups/public was cached in the local repository, resolution will not be reattempted until the update interval of nexus has elapsed or updates are forced
    at org.apache.maven.lifecycle.internal.LifecycleDependencyResolver.getDependencies (LifecycleDependencyResolver.java:249)
    at org.apache.maven.lifecycle.internal.LifecycleDependencyResolver.resolveProjectDependencies (LifecycleDependencyResolver.java:145)
    at org.apache.maven.lifecycle.internal.MojoExecutor.ensureDependenciesAreResolved (MojoExecutor.java:246)
    at org.apache.maven.lifecycle.internal.MojoExecutor.execute (MojoExecutor.java:200)
    at org.apache.maven.lifecycle.internal.MojoExecutor.execute (MojoExecutor.java:154)
    at org.apache.maven.lifecycle.internal.MojoExecutor.execute (MojoExecutor.java:146)
    at org.apache.maven.lifecycle.internal.LifecycleModuleBuilder.buildProject (LifecycleModuleBuilder.java:117)
    at org.apache.maven.lifecycle.internal.LifecycleModuleBuilder.buildProject (LifecycleModuleBuilder.java:81)
    at org.apache.maven.lifecycle.internal.builder.singlethreaded.SingleThreadedBuilder.build (SingleThreadedBuilder.java:51)
    at org.apache.maven.lifecycle.internal.LifecycleStarter.execute (LifecycleStarter.java:128)
    at org.apache.maven.DefaultMaven.doExecute (DefaultMaven.java:309)
    at org.apache.maven.DefaultMaven.doExecute (DefaultMaven.java:194)
    at org.apache.maven.DefaultMaven.execute (DefaultMaven.java:107)
    at org.jvnet.hudson.maven3.launcher.Maven35Launcher.main (Maven35Launcher.java:130)
    at sun.reflect.NativeMethodAccessorImpl.invoke0 (Native Method)
    at sun.reflect.NativeMethodAccessorImpl.invoke (NativeMethodAccessorImpl.java:62)
    at sun.reflect.DelegatingMethodAccessorImpl.invoke (DelegatingMethodAccessorImpl.java:43)
    at java.lang.reflect.Method.invoke (Method.java:498)
    at org.codehaus.plexus.classworlds.launcher.Launcher.launchEnhanced (Launcher.java:289)
    at org.codehaus.plexus.classworlds.launcher.Launcher.launch (Launcher.java:229)
    at jenkins.maven3.agent.Maven35Main.launch (Maven35Main.java:178)
    at sun.reflect.NativeMethodAccessorImpl.invoke0 (Native Method)
    at sun.reflect.NativeMethodAccessorImpl.invoke (NativeMethodAccessorImpl.java:62)
    at sun.reflect.DelegatingMethodAccessorImpl.invoke (DelegatingMethodAccessorImpl.java:43)
    at java.lang.reflect.Method.invoke (Method.java:498)
    at hudson.maven.Maven3Builder.call (Maven3Builder.java:139)
    at hudson.maven.Maven3Builder.call (Maven3Builder.java:70)
    at hudson.remoting.UserRequest.perform (UserRequest.java:212)
    at hudson.remoting.UserRequest.perform (UserRequest.java:54)
    at hudson.remoting.Request$2.run (Request.java:369)
    at hudson.remoting.InterceptingExecutorService$1.call (InterceptingExecutorService.java:72)
    at java.util.concurrent.FutureTask.run (FutureTask.java:266)
    at java.util.concurrent.ThreadPoolExecutor.runWorker (ThreadPoolExecutor.java:1149)
    at java.util.concurrent.ThreadPoolExecutor$Worker.run (ThreadPoolExecutor.java:624)
    at java.lang.Thread.run (Thread.java:748)
Caused by: org.apache.maven.project.DependencyResolutionException: Could not resolve dependencies for project net.ihe.gazelle:gvt-validation-jar:jar:3.6.0-SNAPSHOT: Failure to find gov.nist:hl7-v2-validation:jar:1.4.2 in https://gazelle.ihe.net/nexus/content/groups/public was cached in the local repository, resolution will not be reattempted until the update interval of nexus has elapsed or updates are forced
    at org.apache.maven.project.DefaultProjectDependenciesResolver.resolve (DefaultProjectDependenciesResolver.java:209)
    at org.apache.maven.lifecycle.internal.LifecycleDependencyResolver.getDependencies (LifecycleDependencyResolver.java:223)
    at org.apache.maven.lifecycle.internal.LifecycleDependencyResolver.resolveProjectDependencies (LifecycleDependencyResolver.java:145)
    at org.apache.maven.lifecycle.internal.MojoExecutor.ensureDependenciesAreResolved (MojoExecutor.java:246)
    at org.apache.maven.lifecycle.internal.MojoExecutor.execute (MojoExecutor.java:200)
    at org.apache.maven.lifecycle.internal.MojoExecutor.execute (MojoExecutor.java:154)
    at org.apache.maven.lifecycle.internal.MojoExecutor.execute (MojoExecutor.java:146)
    at org.apache.maven.lifecycle.internal.LifecycleModuleBuilder.buildProject (LifecycleModuleBuilder.java:117)
    at org.apache.maven.lifecycle.internal.LifecycleModuleBuilder.buildProject (LifecycleModuleBuilder.java:81)
    at org.apache.maven.lifecycle.internal.builder.singlethreaded.SingleThreadedBuilder.build (SingleThreadedBuilder.java:51)
    at org.apache.maven.lifecycle.internal.LifecycleStarter.execute (LifecycleStarter.java:128)
    at org.apache.maven.DefaultMaven.doExecute (DefaultMaven.java:309)
    at org.apache.maven.DefaultMaven.doExecute (DefaultMaven.java:194)
    at org.apache.maven.DefaultMaven.execute (DefaultMaven.java:107)
    at org.jvnet.hudson.maven3.launcher.Maven35Launcher.main (Maven35Launcher.java:130)
    at sun.reflect.NativeMethodAccessorImpl.invoke0 (Native Method)
    at sun.reflect.NativeMethodAccessorImpl.invoke (NativeMethodAccessorImpl.java:62)
    at sun.reflect.DelegatingMethodAccessorImpl.invoke (DelegatingMethodAccessorImpl.java:43)
    at java.lang.reflect.Method.invoke (Method.java:498)
    at org.codehaus.plexus.classworlds.launcher.Launcher.launchEnhanced (Launcher.java:289)
    at org.codehaus.plexus.classworlds.launcher.Launcher.launch (Launcher.java:229)
    at jenkins.maven3.agent.Maven35Main.launch (Maven35Main.java:178)
    at sun.reflect.NativeMethodAccessorImpl.invoke0 (Native Method)
    at sun.reflect.NativeMethodAccessorImpl.invoke (NativeMethodAccessorImpl.java:62)
    at sun.reflect.DelegatingMethodAccessorImpl.invoke (DelegatingMethodAccessorImpl.java:43)
    at java.lang.reflect.Method.invoke (Method.java:498)
    at hudson.maven.Maven3Builder.call (Maven3Builder.java:139)
    at hudson.maven.Maven3Builder.call (Maven3Builder.java:70)
    at hudson.remoting.UserRequest.perform (UserRequest.java:212)
    at hudson.remoting.UserRequest.perform (UserRequest.java:54)
    at hudson.remoting.Request$2.run (Request.java:369)
    at hudson.remoting.InterceptingExecutorService$1.call (InterceptingExecutorService.java:72)
    at java.util.concurrent.FutureTask.run (FutureTask.java:266)
    at java.util.concurrent.ThreadPoolExecutor.runWorker (ThreadPoolExecutor.java:1149)
    at java.util.concurrent.ThreadPoolExecutor$Worker.run (ThreadPoolExecutor.java:624)
    at java.lang.Thread.run (Thread.java:748)
Caused by: org.eclipse.aether.resolution.DependencyResolutionException: Failure to find gov.nist:hl7-v2-validation:jar:1.4.2 in https://gazelle.ihe.net/nexus/content/groups/public was cached in the local repository, resolution will not be reattempted until the update interval of nexus has elapsed or updates are forced
    at org.eclipse.aether.internal.impl.DefaultRepositorySystem.resolveDependencies (DefaultRepositorySystem.java:355)
    at org.apache.maven.project.DefaultProjectDependenciesResolver.resolve (DefaultProjectDependenciesResolver.java:202)
    at org.apache.maven.lifecycle.internal.LifecycleDependencyResolver.getDependencies (LifecycleDependencyResolver.java:223)
    at org.apache.maven.lifecycle.internal.LifecycleDependencyResolver.resolveProjectDependencies (LifecycleDependencyResolver.java:145)
    at org.apache.maven.lifecycle.internal.MojoExecutor.ensureDependenciesAreResolved (MojoExecutor.java:246)
    at org.apache.maven.lifecycle.internal.MojoExecutor.execute (MojoExecutor.java:200)
    at org.apache.maven.lifecycle.internal.MojoExecutor.execute (MojoExecutor.java:154)
    at org.apache.maven.lifecycle.internal.MojoExecutor.execute (MojoExecutor.java:146)
    at org.apache.maven.lifecycle.internal.LifecycleModuleBuilder.buildProject (LifecycleModuleBuilder.java:117)
    at org.apache.maven.lifecycle.internal.LifecycleModuleBuilder.buildProject (LifecycleModuleBuilder.java:81)
    at org.apache.maven.lifecycle.internal.builder.singlethreaded.SingleThreadedBuilder.build (SingleThreadedBuilder.java:51)
    at org.apache.maven.lifecycle.internal.LifecycleStarter.execute (LifecycleStarter.java:128)
    at org.apache.maven.DefaultMaven.doExecute (DefaultMaven.java:309)
    at org.apache.maven.DefaultMaven.doExecute (DefaultMaven.java:194)
    at org.apache.maven.DefaultMaven.execute (DefaultMaven.java:107)
    at org.jvnet.hudson.maven3.launcher.Maven35Launcher.main (Maven35Launcher.java:130)
    at sun.reflect.NativeMethodAccessorImpl.invoke0 (Native Method)
    at sun.reflect.NativeMethodAccessorImpl.invoke (NativeMethodAccessorImpl.java:62)
    at sun.reflect.DelegatingMethodAccessorImpl.invoke (DelegatingMethodAccessorImpl.java:43)
    at java.lang.reflect.Method.invoke (Method.java:498)
    at org.codehaus.plexus.classworlds.launcher.Launcher.launchEnhanced (Launcher.java:289)
    at org.codehaus.plexus.classworlds.launcher.Launcher.launch (Launcher.java:229)
    at jenkins.maven3.agent.Maven35Main.launch (Maven35Main.java:178)
    at sun.reflect.NativeMethodAccessorImpl.invoke0 (Native Method)
    at sun.reflect.NativeMethodAccessorImpl.invoke (NativeMethodAccessorImpl.java:62)
    at sun.reflect.DelegatingMethodAccessorImpl.invoke (DelegatingMethodAccessorImpl.java:43)
    at java.lang.reflect.Method.invoke (Method.java:498)
    at hudson.maven.Maven3Builder.call (Maven3Builder.java:139)
    at hudson.maven.Maven3Builder.call (Maven3Builder.java:70)
    at hudson.remoting.UserRequest.perform (UserRequest.java:212)
    at hudson.remoting.UserRequest.perform (UserRequest.java:54)
    at hudson.remoting.Request$2.run (Request.java:369)
    at hudson.remoting.InterceptingExecutorService$1.call (InterceptingExecutorService.java:72)
    at java.util.concurrent.FutureTask.run (FutureTask.java:266)
    at java.util.concurrent.ThreadPoolExecutor.runWorker (ThreadPoolExecutor.java:1149)
    at java.util.concurrent.ThreadPoolExecutor$Worker.run (ThreadPoolExecutor.java:624)
    at java.lang.Thread.run (Thread.java:748)
Caused by: org.eclipse.aether.resolution.ArtifactResolutionException: Failure to find gov.nist:hl7-v2-validation:jar:1.4.2 in https://gazelle.ihe.net/nexus/content/groups/public was cached in the local repository, resolution will not be reattempted until the update interval of nexus has elapsed or updates are forced
    at org.eclipse.aether.internal.impl.DefaultArtifactResolver.resolve (DefaultArtifactResolver.java:422)
    at org.eclipse.aether.internal.impl.DefaultArtifactResolver.resolveArtifacts (DefaultArtifactResolver.java:224)
    at org.eclipse.aether.internal.impl.DefaultRepositorySystem.resolveDependencies (DefaultRepositorySystem.java:338)
    at org.apache.maven.project.DefaultProjectDependenciesResolver.resolve (DefaultProjectDependenciesResolver.java:202)
    at org.apache.maven.lifecycle.internal.LifecycleDependencyResolver.getDependencies (LifecycleDependencyResolver.java:223)
    at org.apache.maven.lifecycle.internal.LifecycleDependencyResolver.resolveProjectDependencies (LifecycleDependencyResolver.java:145)
    at org.apache.maven.lifecycle.internal.MojoExecutor.ensureDependenciesAreResolved (MojoExecutor.java:246)
    at org.apache.maven.lifecycle.internal.MojoExecutor.execute (MojoExecutor.java:200)
    at org.apache.maven.lifecycle.internal.MojoExecutor.execute (MojoExecutor.java:154)
    at org.apache.maven.lifecycle.internal.MojoExecutor.execute (MojoExecutor.java:146)
    at org.apache.maven.lifecycle.internal.LifecycleModuleBuilder.buildProject (LifecycleModuleBuilder.java:117)
    at org.apache.maven.lifecycle.internal.LifecycleModuleBuilder.buildProject (LifecycleModuleBuilder.java:81)
    at org.apache.maven.lifecycle.internal.builder.singlethreaded.SingleThreadedBuilder.build (SingleThreadedBuilder.java:51)
    at org.apache.maven.lifecycle.internal.LifecycleStarter.execute (LifecycleStarter.java:128)
    at org.apache.maven.DefaultMaven.doExecute (DefaultMaven.java:309)
    at org.apache.maven.DefaultMaven.doExecute (DefaultMaven.java:194)
    at org.apache.maven.DefaultMaven.execute (DefaultMaven.java:107)
    at org.jvnet.hudson.maven3.launcher.Maven35Launcher.main (Maven35Launcher.java:130)
    at sun.reflect.NativeMethodAccessorImpl.invoke0 (Native Method)
    at sun.reflect.NativeMethodAccessorImpl.invoke (NativeMethodAccessorImpl.java:62)
    at sun.reflect.DelegatingMethodAccessorImpl.invoke (DelegatingMethodAccessorImpl.java:43)
    at java.lang.reflect.Method.invoke (Method.java:498)
    at org.codehaus.plexus.classworlds.launcher.Launcher.launchEnhanced (Launcher.java:289)
    at org.codehaus.plexus.classworlds.launcher.Launcher.launch (Launcher.java:229)
    at jenkins.maven3.agent.Maven35Main.launch (Maven35Main.java:178)
    at sun.reflect.NativeMethodAccessorImpl.invoke0 (Native Method)
    at sun.reflect.NativeMethodAccessorImpl.invoke (NativeMethodAccessorImpl.java:62)
    at sun.reflect.DelegatingMethodAccessorImpl.invoke (DelegatingMethodAccessorImpl.java:43)
    at java.lang.reflect.Method.invoke (Method.java:498)
    at hudson.maven.Maven3Builder.call (Maven3Builder.java:139)
    at hudson.maven.Maven3Builder.call (Maven3Builder.java:70)
    at hudson.remoting.UserRequest.perform (UserRequest.java:212)
    at hudson.remoting.UserRequest.perform (UserRequest.java:54)
    at hudson.remoting.Request$2.run (Request.java:369)
    at hudson.remoting.InterceptingExecutorService$1.call (InterceptingExecutorService.java:72)
    at java.util.concurrent.FutureTask.run (FutureTask.java:266)
    at java.util.concurrent.ThreadPoolExecutor.runWorker (ThreadPoolExecutor.java:1149)
    at java.util.concurrent.ThreadPoolExecutor$Worker.run (ThreadPoolExecutor.java:624)
    at java.lang.Thread.run (Thread.java:748)
Caused by: org.eclipse.aether.transfer.ArtifactNotFoundException: Failure to find gov.nist:hl7-v2-validation:jar:1.4.2 in https://gazelle.ihe.net/nexus/content/groups/public was cached in the local repository, resolution will not be reattempted until the update interval of nexus has elapsed or updates are forced
    at org.eclipse.aether.internal.impl.DefaultUpdateCheckManager.newException (DefaultUpdateCheckManager.java:233)
    at org.eclipse.aether.internal.impl.DefaultUpdateCheckManager.checkArtifact (DefaultUpdateCheckManager.java:208)
    at org.eclipse.aether.internal.impl.DefaultArtifactResolver.gatherDownloads (DefaultArtifactResolver.java:563)
    at org.eclipse.aether.internal.impl.DefaultArtifactResolver.performDownloads (DefaultArtifactResolver.java:481)
    at org.eclipse.aether.internal.impl.DefaultArtifactResolver.resolve (DefaultArtifactResolver.java:399)
    at org.eclipse.aether.internal.impl.DefaultArtifactResolver.resolveArtifacts (DefaultArtifactResolver.java:224)
    at org.eclipse.aether.internal.impl.DefaultRepositorySystem.resolveDependencies (DefaultRepositorySystem.java:338)
    at org.apache.maven.project.DefaultProjectDependenciesResolver.resolve (DefaultProjectDependenciesResolver.java:202)
    at org.apache.maven.lifecycle.internal.LifecycleDependencyResolver.getDependencies (LifecycleDependencyResolver.java:223)
    at org.apache.maven.lifecycle.internal.LifecycleDependencyResolver.resolveProjectDependencies (LifecycleDependencyResolver.java:145)
    at org.apache.maven.lifecycle.internal.MojoExecutor.ensureDependenciesAreResolved (MojoExecutor.java:246)
    at org.apache.maven.lifecycle.internal.MojoExecutor.execute (MojoExecutor.java:200)
    at org.apache.maven.lifecycle.internal.MojoExecutor.execute (MojoExecutor.java:154)
    at org.apache.maven.lifecycle.internal.MojoExecutor.execute (MojoExecutor.java:146)
    at org.apache.maven.lifecycle.internal.LifecycleModuleBuilder.buildProject (LifecycleModuleBuilder.java:117)
    at org.apache.maven.lifecycle.internal.LifecycleModuleBuilder.buildProject (LifecycleModuleBuilder.java:81)
    at org.apache.maven.lifecycle.internal.builder.singlethreaded.SingleThreadedBuilder.build (SingleThreadedBuilder.java:51)
    at org.apache.maven.lifecycle.internal.LifecycleStarter.execute (LifecycleStarter.java:128)
    at org.apache.maven.DefaultMaven.doExecute (DefaultMaven.java:309)
    at org.apache.maven.DefaultMaven.doExecute (DefaultMaven.java:194)
    at org.apache.maven.DefaultMaven.execute (DefaultMaven.java:107)
    at org.jvnet.hudson.maven3.launcher.Maven35Launcher.main (Maven35Launcher.java:130)
    at sun.reflect.NativeMethodAccessorImpl.invoke0 (Native Method)
    at sun.reflect.NativeMethodAccessorImpl.invoke (NativeMethodAccessorImpl.java:62)
    at sun.reflect.DelegatingMethodAccessorImpl.invoke (DelegatingMethodAccessorImpl.java:43)
    at java.lang.reflect.Method.invoke (Method.java:498)
    at org.codehaus.plexus.classworlds.launcher.Launcher.launchEnhanced (Launcher.java:289)
    at org.codehaus.plexus.classworlds.launcher.Launcher.launch (Launcher.java:229)
    at jenkins.maven3.agent.Maven35Main.launch (Maven35Main.java:178)
    at sun.reflect.NativeMethodAccessorImpl.invoke0 (Native Method)
    at sun.reflect.NativeMethodAccessorImpl.invoke (NativeMethodAccessorImpl.java:62)
    at sun.reflect.DelegatingMethodAccessorImpl.invoke (DelegatingMethodAccessorImpl.java:43)
    at java.lang.reflect.Method.invoke (Method.java:498)
    at hudson.maven.Maven3Builder.call (Maven3Builder.java:139)
    at hudson.maven.Maven3Builder.call (Maven3Builder.java:70)
    at hudson.remoting.UserRequest.perform (UserRequest.java:212)
    at hudson.remoting.UserRequest.perform (UserRequest.java:54)
    at hudson.remoting.Request$2.run (Request.java:369)
    at hudson.remoting.InterceptingExecutorService$1.call (InterceptingExecutorService.java:72)
    at java.util.concurrent.FutureTask.run (FutureTask.java:266)
    at java.util.concurrent.ThreadPoolExecutor.runWorker (ThreadPoolExecutor.java:1149)
    at java.util.concurrent.ThreadPoolExecutor$Worker.run (ThreadPoolExecutor.java:624)
    at java.lang.Thread.run (Thread.java:748)
[ERROR] 
[ERROR] Re-run Maven using the -X switch to enable full debug logging.
[ERROR] 
[ERROR] For more information about the errors and possible solutions, please read the following articles:
[ERROR] [Help 1] http://cwiki.apache.org/confluence/display/MAVEN/DependencyResolutionException
[ERROR] 
[ERROR] After correcting the problems, you can resume the build with the command
[ERROR]   mvn <goals> -rf :gvt-validation-jar
[JENKINS] Archiving /home/jenkins/.hudson/jobs/Gazelle HL7 Validator IGAMT/workspace/pom.xml to net.ihe.gazelle/GazelleHL7v2Validator/3.6.0-SNAPSHOT/GazelleHL7v2Validator-3.6.0-SNAPSHOT.pom
[JENKINS] Archiving /home/jenkins/.hudson/jobs/Gazelle HL7 Validator IGAMT/workspace/target/GazelleHL7v2Validator-tests.jar to net.ihe.gazelle/GazelleHL7v2Validator/3.6.0-SNAPSHOT/GazelleHL7v2Validator-3.6.0-SNAPSHOT-tests.jar
[JENKINS] Archiving /home/jenkins/.hudson/jobs/Gazelle HL7 Validator IGAMT/workspace/target/GazelleHL7v2Validator-metadata.zip to net.ihe.gazelle/GazelleHL7v2Validator/3.6.0-SNAPSHOT/GazelleHL7v2Validator-3.6.0-SNAPSHOT-metadata.zip
[JENKINS] Archiving /home/jenkins/.hudson/jobs/Gazelle HL7 Validator IGAMT/workspace/gazelle-hl7-validator-report-jar/pom.xml to net.ihe.gazelle/gazelle-hl7-validator-report-jar/3.6.0-SNAPSHOT/gazelle-hl7-validator-report-jar-3.6.0-SNAPSHOT.pom
[JENKINS] Archiving /home/jenkins/.hudson/jobs/Gazelle HL7 Validator IGAMT/workspace/gazelle-hl7-validator-report-jar/target/gazelle-hl7-validator-report-jar.jar to net.ihe.gazelle/gazelle-hl7-validator-report-jar/3.6.0-SNAPSHOT/gazelle-hl7-validator-report-jar-3.6.0-SNAPSHOT.jar
[JENKINS] Archiving /home/jenkins/.hudson/jobs/Gazelle HL7 Validator IGAMT/workspace/gazelle-hl7-validator-report-jar/target/gazelle-hl7-validator-report-jar-sources.jar to net.ihe.gazelle/gazelle-hl7-validator-report-jar/3.6.0-SNAPSHOT/gazelle-hl7-validator-report-jar-3.6.0-SNAPSHOT-sources.jar
[JENKINS] Archiving /home/jenkins/.hudson/jobs/Gazelle HL7 Validator IGAMT/workspace/gazelle-hl7-validator-report-jar/target/gazelle-hl7-validator-report-jar-tests.jar to net.ihe.gazelle/gazelle-hl7-validator-report-jar/3.6.0-SNAPSHOT/gazelle-hl7-validator-report-jar-3.6.0-SNAPSHOT-tests.jar
[JENKINS] Archiving /home/jenkins/.hudson/jobs/Gazelle HL7 Validator IGAMT/workspace/GazelleHL7v2Validator-ejb/pom.xml to net.ihe.gazelle/GazelleHL7v2Validator-ejb/3.6.0-SNAPSHOT/GazelleHL7v2Validator-ejb-3.6.0-SNAPSHOT.pom
[JENKINS] Archiving /home/jenkins/.hudson/jobs/Gazelle HL7 Validator IGAMT/workspace/gazelle-hl7v2-validator-api-jar/pom.xml to net.ihe.gazelle/gazelle-hl7v2-validator-api-jar/3.6.0-SNAPSHOT/gazelle-hl7v2-validator-api-jar-3.6.0-SNAPSHOT.pom
[JENKINS] Archiving /home/jenkins/.hudson/jobs/Gazelle HL7 Validator IGAMT/workspace/gazelle-hl7v2-validator-api-jar/target/gazelle-hl7v2-validator-api-jar.jar to net.ihe.gazelle/gazelle-hl7v2-validator-api-jar/3.6.0-SNAPSHOT/gazelle-hl7v2-validator-api-jar-3.6.0-SNAPSHOT.jar
[JENKINS] Archiving /home/jenkins/.hudson/jobs/Gazelle HL7 Validator IGAMT/workspace/gazelle-hl7v2-validator-api-jar/target/gazelle-hl7v2-validator-api-jar-sources.jar to net.ihe.gazelle/gazelle-hl7v2-validator-api-jar/3.6.0-SNAPSHOT/gazelle-hl7v2-validator-api-jar-3.6.0-SNAPSHOT-sources.jar
[JENKINS] Archiving /home/jenkins/.hudson/jobs/Gazelle HL7 Validator IGAMT/workspace/gazelle-hl7v2-validator-api-jar/target/gazelle-hl7v2-validator-api-jar-tests.jar to net.ihe.gazelle/gazelle-hl7v2-validator-api-jar/3.6.0-SNAPSHOT/gazelle-hl7v2-validator-api-jar-3.6.0-SNAPSHOT-tests.jar
[JENKINS] Archiving /home/jenkins/.hudson/jobs/Gazelle HL7 Validator IGAMT/workspace/GazelleHL7v2Validator-ui/pom.xml to net.ihe.gazelle/GazelleHL7v2Validator-ui/3.6.0-SNAPSHOT/GazelleHL7v2Validator-ui-3.6.0-SNAPSHOT.pom
[JENKINS] Archiving /home/jenkins/.hudson/jobs/Gazelle HL7 Validator IGAMT/workspace/GazelleHL7v2Validator-ear/pom.xml to net.ihe.gazelle/GazelleHL7v2Validator-ear/3.6.0-SNAPSHOT/GazelleHL7v2Validator-ear-3.6.0-SNAPSHOT.pom
[JENKINS] Archiving /home/jenkins/.hudson/jobs/Gazelle HL7 Validator IGAMT/workspace/gvt-validation-jar/pom.xml to net.ihe.gazelle/gvt-validation-jar/3.6.0-SNAPSHOT/gvt-validation-jar-3.6.0-SNAPSHOT.pom
channel stopped
WARN: Unable to locate 'report-task.txt' in the workspace. Did the SonarScanner succeeded?
Collecting metadata...
Metadata collection done.
Started calculate disk usage of build
Finished Calculation of disk usage of build in 0 seconds
Started calculate disk usage of workspace
Finished Calculation of disk usage of workspace in 0 seconds
Sending e-mails to: abe@kereval.com fde@kereval.com
Finished: FAILURE