FailedConsole Output

Skipping 326 KB.. Full Log
[INFO] 15:22:28,306 DEBUG [main] AxisOperation:467 - Entry: AxisOperation::setSoapAction, previous soapAction: null updated soapAction: urn:anonOutonlyOp
[INFO] 15:22:28,306 DEBUG [main] AxisOperation:471 - Exit: AxisOperation::setSoapAction
[INFO] 15:22:28,306 DEBUG [main] AxisService:872 - mapActionToOperation: Mapping Action to Operation: action: anonOutonlyOp; operation: org.apache.axis2.description.OutOnlyAxisOperation@22d7b4f8named: {http://ws.apache.org/namespaces/axis2}anonOutonlyOp
[INFO] 15:22:28,306 DEBUG [main] AxisService:878 - DEBUG_FRAME = org.apache.axis2.util.JavaUtils.callStackToString(JavaUtils.java:564)
[INFO] 	DEBUG_FRAME = org.apache.axis2.description.AxisService.mapActionToOperation(AxisService.java:878)
[INFO] 	DEBUG_FRAME = org.apache.axis2.description.AxisService.addOperation(AxisService.java:724)
[INFO] 	DEBUG_FRAME = org.apache.axis2.client.Stub.addAnonymousOperations(Stub.java:237)
[INFO] 	DEBUG_FRAME = net.ihe.gazelle.ws.client.GazelleTRMServiceStub.populateAxisService(GazelleTRMServiceStub.java:94)
[INFO] 	DEBUG_FRAME = net.ihe.gazelle.ws.client.GazelleTRMServiceStub.<init>(GazelleTRMServiceStub.java:40)
[INFO] 	DEBUG_FRAME = net.ihe.gazelle.ws.client.GazelleTRMServiceStub.<init>(GazelleTRMServiceStub.java:29)
[INFO] 	DEBUG_FRAME = net.ihe.gazelle.ws.client.GazelleTRMServiceStub.<init>(GazelleTRMServiceStub.java:75)
[INFO] 	DEBUG_FRAME = net.ihe.gazelle.ws.client.GazelleTRMServiceClient.<init>(GazelleTRMServiceClient.java:11)
[INFO] 	DEBUG_FRAME = net.ihe.gazelle.ws.client.GazelleTRMServiceStubTest.getTestInstanceById(GazelleTRMServiceStubTest.java:41)
[INFO] 	DEBUG_FRAME = sun.reflect.NativeMethodAccessorImpl.invoke0(Native Method)
[INFO] 	DEBUG_FRAME = sun.reflect.NativeMethodAccessorImpl.invoke(NativeMethodAccessorImpl.java:62)
[INFO] 	DEBUG_FRAME = sun.reflect.DelegatingMethodAccessorImpl.invoke(DelegatingMethodAccessorImpl.java:43)
[INFO] 	DEBUG_FRAME = java.lang.reflect.Method.invoke(Method.java:498)
[INFO] 	DEBUG_FRAME = org.junit.runners.model.FrameworkMethod$1.runReflectiveCall(FrameworkMethod.java:44)
[INFO] 	DEBUG_FRAME = org.junit.internal.runners.model.ReflectiveCallable.run(ReflectiveCallable.java:15)
[INFO] 	DEBUG_FRAME = org.junit.runners.model.FrameworkMethod.invokeExplosively(FrameworkMethod.java:41)
[INFO] 	DEBUG_FRAME = org.junit.internal.runners.statements.InvokeMethod.evaluate(InvokeMethod.java:20)
[INFO] 	DEBUG_FRAME = org.junit.runners.BlockJUnit4ClassRunner.runNotIgnored(BlockJUnit4ClassRunner.java:79)
[INFO] 	DEBUG_FRAME = org.junit.runners.BlockJUnit4ClassRunner.runChild(BlockJUnit4ClassRunner.java:71)
[INFO] 	DEBUG_FRAME = org.junit.runners.BlockJUnit4ClassRunner.runChild(BlockJUnit4ClassRunner.java:49)
[INFO] 	DEBUG_FRAME = org.junit.runners.ParentRunner$3.run(ParentRunner.java:193)
[INFO] 	DEBUG_FRAME = org.junit.runners.ParentRunner$1.schedule(ParentRunner.java:52)
[INFO] 	DEBUG_FRAME = org.junit.runners.ParentRunner.runChildren(ParentRunner.java:191)
[INFO] 	DEBUG_FRAME = org.junit.runners.ParentRunner.access$000(ParentRunner.java:42)
[INFO] 	DEBUG_FRAME = org.junit.runners.ParentRunner$2.evaluate(ParentRunner.java:184)
[INFO] 	DEBUG_FRAME = org.junit.runners.ParentRunner.run(ParentRunner.java:236)
[INFO] 	DEBUG_FRAME = org.apache.maven.surefire.junit4.JUnit4Provider.execute(JUnit4Provider.java:252)
[INFO] 	DEBUG_FRAME = org.apache.maven.surefire.junit4.JUnit4Provider.executeTestSet(JUnit4Provider.java:141)
[INFO] 	DEBUG_FRAME = org.apache.maven.surefire.junit4.JUnit4Provider.invoke(JUnit4Provider.java:112)
[INFO] 	DEBUG_FRAME = sun.reflect.NativeMethodAccessorImpl.invoke0(Native Method)
[INFO] 	DEBUG_FRAME = sun.reflect.NativeMethodAccessorImpl.invoke(NativeMethodAccessorImpl.java:62)
[INFO] 	DEBUG_FRAME = sun.reflect.DelegatingMethodAccessorImpl.invoke(DelegatingMethodAccessorImpl.java:43)
[INFO] 	DEBUG_FRAME = java.lang.reflect.Method.invoke(Method.java:498)
[INFO] 	DEBUG_FRAME = org.apache.maven.surefire.util.ReflectionUtils.invokeMethodWithArray(ReflectionUtils.java:189)
[INFO] 	DEBUG_FRAME = org.apache.maven.surefire.booter.ProviderFactory$ProviderProxy.invoke(ProviderFactory.java:165)
[INFO] 	DEBUG_FRAME = org.apache.maven.surefire.booter.ProviderFactory.invokeProvider(ProviderFactory.java:85)
[INFO] 	DEBUG_FRAME = org.apache.maven.surefire.booter.ForkedBooter.runSuitesInProcess(ForkedBooter.java:115)
[INFO] 	DEBUG_FRAME = org.apache.maven.surefire.booter.ForkedBooter.main(ForkedBooter.java:75)
[INFO] 
[INFO] 15:22:28,306 DEBUG [main] AxisOperation:485 - Entry: AxisOperation::getInputAction
[INFO] 15:22:28,306 DEBUG [main] AxisOperation:490 - Debug: AxisOperation::getInputAction - using soapAction
[INFO] 15:22:28,307 DEBUG [main] AxisOperation:506 - Exit: AxisOperation::getInputAction urn:anonOutonlyOp
[INFO] 15:22:28,307 DEBUG [main] AxisService:872 - mapActionToOperation: Mapping Action to Operation: action: urn:anonOutonlyOp; operation: org.apache.axis2.description.OutOnlyAxisOperation@22d7b4f8named: {http://ws.apache.org/namespaces/axis2}anonOutonlyOp
[INFO] 15:22:28,307 DEBUG [main] AxisService:878 - DEBUG_FRAME = org.apache.axis2.util.JavaUtils.callStackToString(JavaUtils.java:564)
[INFO] 	DEBUG_FRAME = org.apache.axis2.description.AxisService.mapActionToOperation(AxisService.java:878)
[INFO] 	DEBUG_FRAME = org.apache.axis2.description.AxisService.addOperation(AxisService.java:728)
[INFO] 	DEBUG_FRAME = org.apache.axis2.client.Stub.addAnonymousOperations(Stub.java:237)
[INFO] 	DEBUG_FRAME = net.ihe.gazelle.ws.client.GazelleTRMServiceStub.populateAxisService(GazelleTRMServiceStub.java:94)
[INFO] 	DEBUG_FRAME = net.ihe.gazelle.ws.client.GazelleTRMServiceStub.<init>(GazelleTRMServiceStub.java:40)
[INFO] 	DEBUG_FRAME = net.ihe.gazelle.ws.client.GazelleTRMServiceStub.<init>(GazelleTRMServiceStub.java:29)
[INFO] 	DEBUG_FRAME = net.ihe.gazelle.ws.client.GazelleTRMServiceStub.<init>(GazelleTRMServiceStub.java:75)
[INFO] 	DEBUG_FRAME = net.ihe.gazelle.ws.client.GazelleTRMServiceClient.<init>(GazelleTRMServiceClient.java:11)
[INFO] 	DEBUG_FRAME = net.ihe.gazelle.ws.client.GazelleTRMServiceStubTest.getTestInstanceById(GazelleTRMServiceStubTest.java:41)
[INFO] 	DEBUG_FRAME = sun.reflect.NativeMethodAccessorImpl.invoke0(Native Method)
[INFO] 	DEBUG_FRAME = sun.reflect.NativeMethodAccessorImpl.invoke(NativeMethodAccessorImpl.java:62)
[INFO] 	DEBUG_FRAME = sun.reflect.DelegatingMethodAccessorImpl.invoke(DelegatingMethodAccessorImpl.java:43)
[INFO] 	DEBUG_FRAME = java.lang.reflect.Method.invoke(Method.java:498)
[INFO] 	DEBUG_FRAME = org.junit.runners.model.FrameworkMethod$1.runReflectiveCall(FrameworkMethod.java:44)
[INFO] 	DEBUG_FRAME = org.junit.internal.runners.model.ReflectiveCallable.run(ReflectiveCallable.java:15)
[INFO] 	DEBUG_FRAME = org.junit.runners.model.FrameworkMethod.invokeExplosively(FrameworkMethod.java:41)
[INFO] 	DEBUG_FRAME = org.junit.internal.runners.statements.InvokeMethod.evaluate(InvokeMethod.java:20)
[INFO] 	DEBUG_FRAME = org.junit.runners.BlockJUnit4ClassRunner.runNotIgnored(BlockJUnit4ClassRunner.java:79)
[INFO] 	DEBUG_FRAME = org.junit.runners.BlockJUnit4ClassRunner.runChild(BlockJUnit4ClassRunner.java:71)
[INFO] 	DEBUG_FRAME = org.junit.runners.BlockJUnit4ClassRunner.runChild(BlockJUnit4ClassRunner.java:49)
[INFO] 	DEBUG_FRAME = org.junit.runners.ParentRunner$3.run(ParentRunner.java:193)
[INFO] 	DEBUG_FRAME = org.junit.runners.ParentRunner$1.schedule(ParentRunner.java:52)
[INFO] 	DEBUG_FRAME = org.junit.runners.ParentRunner.runChildren(ParentRunner.java:191)
[INFO] 	DEBUG_FRAME = org.junit.runners.ParentRunner.access$000(ParentRunner.java:42)
[INFO] 	DEBUG_FRAME = org.junit.runners.ParentRunner$2.evaluate(ParentRunner.java:184)
[INFO] 	DEBUG_FRAME = org.junit.runners.ParentRunner.run(ParentRunner.java:236)
[INFO] 	DEBUG_FRAME = org.apache.maven.surefire.junit4.JUnit4Provider.execute(JUnit4Provider.java:252)
[INFO] 	DEBUG_FRAME = org.apache.maven.surefire.junit4.JUnit4Provider.executeTestSet(JUnit4Provider.java:141)
[INFO] 	DEBUG_FRAME = org.apache.maven.surefire.junit4.JUnit4Provider.invoke(JUnit4Provider.java:112)
[INFO] 	DEBUG_FRAME = sun.reflect.NativeMethodAccessorImpl.invoke0(Native Method)
[INFO] 	DEBUG_FRAME = sun.reflect.NativeMethodAccessorImpl.invoke(NativeMethodAccessorImpl.java:62)
[INFO] 	DEBUG_FRAME = sun.reflect.DelegatingMethodAccessorImpl.invoke(DelegatingMethodAccessorImpl.java:43)
[INFO] 	DEBUG_FRAME = java.lang.reflect.Method.invoke(Method.java:498)
[INFO] 	DEBUG_FRAME = org.apache.maven.surefire.util.ReflectionUtils.invokeMethodWithArray(ReflectionUtils.java:189)
[INFO] 	DEBUG_FRAME = org.apache.maven.surefire.booter.ProviderFactory$ProviderProxy.invoke(ProviderFactory.java:165)
[INFO] 	DEBUG_FRAME = org.apache.maven.surefire.booter.ProviderFactory.invokeProvider(ProviderFactory.java:85)
[INFO] 	DEBUG_FRAME = org.apache.maven.surefire.booter.ForkedBooter.runSuitesInProcess(ForkedBooter.java:115)
[INFO] 	DEBUG_FRAME = org.apache.maven.surefire.booter.ForkedBooter.main(ForkedBooter.java:75)
[INFO] 
[INFO] 15:22:28,307 DEBUG [main] AxisOperation:485 - Entry: AxisOperation::getInputAction
[INFO] 15:22:28,307 DEBUG [main] AxisOperation:506 - Exit: AxisOperation::getInputAction null
[INFO] 15:22:28,308 DEBUG [main] AxisOperation:467 - Entry: AxisOperation::setSoapAction, previous soapAction: null updated soapAction: urn:anonOutInOp
[INFO] 15:22:28,308 DEBUG [main] AxisOperation:471 - Exit: AxisOperation::setSoapAction
[INFO] 15:22:28,308 DEBUG [main] AxisService:872 - mapActionToOperation: Mapping Action to Operation: action: anonOutInOp; operation: org.apache.axis2.description.OutInAxisOperation@3f270e0anamed: {http://ws.apache.org/namespaces/axis2}anonOutInOp
[INFO] 15:22:28,308 DEBUG [main] AxisService:878 - DEBUG_FRAME = org.apache.axis2.util.JavaUtils.callStackToString(JavaUtils.java:564)
[INFO] 	DEBUG_FRAME = org.apache.axis2.description.AxisService.mapActionToOperation(AxisService.java:878)
[INFO] 	DEBUG_FRAME = org.apache.axis2.description.AxisService.addOperation(AxisService.java:724)
[INFO] 	DEBUG_FRAME = org.apache.axis2.client.Stub.addAnonymousOperations(Stub.java:240)
[INFO] 	DEBUG_FRAME = net.ihe.gazelle.ws.client.GazelleTRMServiceStub.populateAxisService(GazelleTRMServiceStub.java:94)
[INFO] 	DEBUG_FRAME = net.ihe.gazelle.ws.client.GazelleTRMServiceStub.<init>(GazelleTRMServiceStub.java:40)
[INFO] 	DEBUG_FRAME = net.ihe.gazelle.ws.client.GazelleTRMServiceStub.<init>(GazelleTRMServiceStub.java:29)
[INFO] 	DEBUG_FRAME = net.ihe.gazelle.ws.client.GazelleTRMServiceStub.<init>(GazelleTRMServiceStub.java:75)
[INFO] 	DEBUG_FRAME = net.ihe.gazelle.ws.client.GazelleTRMServiceClient.<init>(GazelleTRMServiceClient.java:11)
[INFO] 	DEBUG_FRAME = net.ihe.gazelle.ws.client.GazelleTRMServiceStubTest.getTestInstanceById(GazelleTRMServiceStubTest.java:41)
[INFO] 	DEBUG_FRAME = sun.reflect.NativeMethodAccessorImpl.invoke0(Native Method)
[INFO] 	DEBUG_FRAME = sun.reflect.NativeMethodAccessorImpl.invoke(NativeMethodAccessorImpl.java:62)
[INFO] 	DEBUG_FRAME = sun.reflect.DelegatingMethodAccessorImpl.invoke(DelegatingMethodAccessorImpl.java:43)
[INFO] 	DEBUG_FRAME = java.lang.reflect.Method.invoke(Method.java:498)
[INFO] 	DEBUG_FRAME = org.junit.runners.model.FrameworkMethod$1.runReflectiveCall(FrameworkMethod.java:44)
[INFO] 	DEBUG_FRAME = org.junit.internal.runners.model.ReflectiveCallable.run(ReflectiveCallable.java:15)
[INFO] 	DEBUG_FRAME = org.junit.runners.model.FrameworkMethod.invokeExplosively(FrameworkMethod.java:41)
[INFO] 	DEBUG_FRAME = org.junit.internal.runners.statements.InvokeMethod.evaluate(InvokeMethod.java:20)
[INFO] 	DEBUG_FRAME = org.junit.runners.BlockJUnit4ClassRunner.runNotIgnored(BlockJUnit4ClassRunner.java:79)
[INFO] 	DEBUG_FRAME = org.junit.runners.BlockJUnit4ClassRunner.runChild(BlockJUnit4ClassRunner.java:71)
[INFO] 	DEBUG_FRAME = org.junit.runners.BlockJUnit4ClassRunner.runChild(BlockJUnit4ClassRunner.java:49)
[INFO] 	DEBUG_FRAME = org.junit.runners.ParentRunner$3.run(ParentRunner.java:193)
[INFO] 	DEBUG_FRAME = org.junit.runners.ParentRunner$1.schedule(ParentRunner.java:52)
[INFO] 	DEBUG_FRAME = org.junit.runners.ParentRunner.runChildren(ParentRunner.java:191)
[INFO] 	DEBUG_FRAME = org.junit.runners.ParentRunner.access$000(ParentRunner.java:42)
[INFO] 	DEBUG_FRAME = org.junit.runners.ParentRunner$2.evaluate(ParentRunner.java:184)
[INFO] 	DEBUG_FRAME = org.junit.runners.ParentRunner.run(ParentRunner.java:236)
[INFO] 	DEBUG_FRAME = org.apache.maven.surefire.junit4.JUnit4Provider.execute(JUnit4Provider.java:252)
[INFO] 	DEBUG_FRAME = org.apache.maven.surefire.junit4.JUnit4Provider.executeTestSet(JUnit4Provider.java:141)
[INFO] 	DEBUG_FRAME = org.apache.maven.surefire.junit4.JUnit4Provider.invoke(JUnit4Provider.java:112)
[INFO] 	DEBUG_FRAME = sun.reflect.NativeMethodAccessorImpl.invoke0(Native Method)
[INFO] 	DEBUG_FRAME = sun.reflect.NativeMethodAccessorImpl.invoke(NativeMethodAccessorImpl.java:62)
[INFO] 	DEBUG_FRAME = sun.reflect.DelegatingMethodAccessorImpl.invoke(DelegatingMethodAccessorImpl.java:43)
[INFO] 	DEBUG_FRAME = java.lang.reflect.Method.invoke(Method.java:498)
[INFO] 	DEBUG_FRAME = org.apache.maven.surefire.util.ReflectionUtils.invokeMethodWithArray(ReflectionUtils.java:189)
[INFO] 	DEBUG_FRAME = org.apache.maven.surefire.booter.ProviderFactory$ProviderProxy.invoke(ProviderFactory.java:165)
[INFO] 	DEBUG_FRAME = org.apache.maven.surefire.booter.ProviderFactory.invokeProvider(ProviderFactory.java:85)
[INFO] 	DEBUG_FRAME = org.apache.maven.surefire.booter.ForkedBooter.runSuitesInProcess(ForkedBooter.java:115)
[INFO] 	DEBUG_FRAME = org.apache.maven.surefire.booter.ForkedBooter.main(ForkedBooter.java:75)
[INFO] 
[INFO] 15:22:28,308 DEBUG [main] AxisOperation:485 - Entry: AxisOperation::getInputAction
[INFO] 15:22:28,308 DEBUG [main] AxisOperation:490 - Debug: AxisOperation::getInputAction - using soapAction
[INFO] 15:22:28,309 DEBUG [main] AxisOperation:506 - Exit: AxisOperation::getInputAction urn:anonOutInOp
[INFO] 15:22:28,309 DEBUG [main] AxisService:872 - mapActionToOperation: Mapping Action to Operation: action: urn:anonOutInOp; operation: org.apache.axis2.description.OutInAxisOperation@3f270e0anamed: {http://ws.apache.org/namespaces/axis2}anonOutInOp
[INFO] 15:22:28,309 DEBUG [main] AxisService:878 - DEBUG_FRAME = org.apache.axis2.util.JavaUtils.callStackToString(JavaUtils.java:564)
[INFO] 	DEBUG_FRAME = org.apache.axis2.description.AxisService.mapActionToOperation(AxisService.java:878)
[INFO] 	DEBUG_FRAME = org.apache.axis2.description.AxisService.addOperation(AxisService.java:728)
[INFO] 	DEBUG_FRAME = org.apache.axis2.client.Stub.addAnonymousOperations(Stub.java:240)
[INFO] 	DEBUG_FRAME = net.ihe.gazelle.ws.client.GazelleTRMServiceStub.populateAxisService(GazelleTRMServiceStub.java:94)
[INFO] 	DEBUG_FRAME = net.ihe.gazelle.ws.client.GazelleTRMServiceStub.<init>(GazelleTRMServiceStub.java:40)
[INFO] 	DEBUG_FRAME = net.ihe.gazelle.ws.client.GazelleTRMServiceStub.<init>(GazelleTRMServiceStub.java:29)
[INFO] 	DEBUG_FRAME = net.ihe.gazelle.ws.client.GazelleTRMServiceStub.<init>(GazelleTRMServiceStub.java:75)
[INFO] 	DEBUG_FRAME = net.ihe.gazelle.ws.client.GazelleTRMServiceClient.<init>(GazelleTRMServiceClient.java:11)
[INFO] 	DEBUG_FRAME = net.ihe.gazelle.ws.client.GazelleTRMServiceStubTest.getTestInstanceById(GazelleTRMServiceStubTest.java:41)
[INFO] 	DEBUG_FRAME = sun.reflect.NativeMethodAccessorImpl.invoke0(Native Method)
[INFO] 	DEBUG_FRAME = sun.reflect.NativeMethodAccessorImpl.invoke(NativeMethodAccessorImpl.java:62)
[INFO] 	DEBUG_FRAME = sun.reflect.DelegatingMethodAccessorImpl.invoke(DelegatingMethodAccessorImpl.java:43)
[INFO] 	DEBUG_FRAME = java.lang.reflect.Method.invoke(Method.java:498)
[INFO] 	DEBUG_FRAME = org.junit.runners.model.FrameworkMethod$1.runReflectiveCall(FrameworkMethod.java:44)
[INFO] 	DEBUG_FRAME = org.junit.internal.runners.model.ReflectiveCallable.run(ReflectiveCallable.java:15)
[INFO] 	DEBUG_FRAME = org.junit.runners.model.FrameworkMethod.invokeExplosively(FrameworkMethod.java:41)
[INFO] 	DEBUG_FRAME = org.junit.internal.runners.statements.InvokeMethod.evaluate(InvokeMethod.java:20)
[INFO] 	DEBUG_FRAME = org.junit.runners.BlockJUnit4ClassRunner.runNotIgnored(BlockJUnit4ClassRunner.java:79)
[INFO] 	DEBUG_FRAME = org.junit.runners.BlockJUnit4ClassRunner.runChild(BlockJUnit4ClassRunner.java:71)
[INFO] 	DEBUG_FRAME = org.junit.runners.BlockJUnit4ClassRunner.runChild(BlockJUnit4ClassRunner.java:49)
[INFO] 	DEBUG_FRAME = org.junit.runners.ParentRunner$3.run(ParentRunner.java:193)
[INFO] 	DEBUG_FRAME = org.junit.runners.ParentRunner$1.schedule(ParentRunner.java:52)
[INFO] 	DEBUG_FRAME = org.junit.runners.ParentRunner.runChildren(ParentRunner.java:191)
[INFO] 	DEBUG_FRAME = org.junit.runners.ParentRunner.access$000(ParentRunner.java:42)
[INFO] 	DEBUG_FRAME = org.junit.runners.ParentRunner$2.evaluate(ParentRunner.java:184)
[INFO] 	DEBUG_FRAME = org.junit.runners.ParentRunner.run(ParentRunner.java:236)
[INFO] 	DEBUG_FRAME = org.apache.maven.surefire.junit4.JUnit4Provider.execute(JUnit4Provider.java:252)
[INFO] 	DEBUG_FRAME = org.apache.maven.surefire.junit4.JUnit4Provider.executeTestSet(JUnit4Provider.java:141)
[INFO] 	DEBUG_FRAME = org.apache.maven.surefire.junit4.JUnit4Provider.invoke(JUnit4Provider.java:112)
[INFO] 	DEBUG_FRAME = sun.reflect.NativeMethodAccessorImpl.invoke0(Native Method)
[INFO] 	DEBUG_FRAME = sun.reflect.NativeMethodAccessorImpl.invoke(NativeMethodAccessorImpl.java:62)
[INFO] 	DEBUG_FRAME = sun.reflect.DelegatingMethodAccessorImpl.invoke(DelegatingMethodAccessorImpl.java:43)
[INFO] 	DEBUG_FRAME = java.lang.reflect.Method.invoke(Method.java:498)
[INFO] 	DEBUG_FRAME = org.apache.maven.surefire.util.ReflectionUtils.invokeMethodWithArray(ReflectionUtils.java:189)
[INFO] 	DEBUG_FRAME = org.apache.maven.surefire.booter.ProviderFactory$ProviderProxy.invoke(ProviderFactory.java:165)
[INFO] 	DEBUG_FRAME = org.apache.maven.surefire.booter.ProviderFactory.invokeProvider(ProviderFactory.java:85)
[INFO] 	DEBUG_FRAME = org.apache.maven.surefire.booter.ForkedBooter.runSuitesInProcess(ForkedBooter.java:115)
[INFO] 	DEBUG_FRAME = org.apache.maven.surefire.booter.ForkedBooter.main(ForkedBooter.java:75)
[INFO] 
[INFO] 15:22:28,309 DEBUG [main] AxisOperation:485 - Entry: AxisOperation::getInputAction
[INFO] 15:22:28,310 DEBUG [main] AxisOperation:506 - Exit: AxisOperation::getInputAction null
[INFO] 15:22:28,310 DEBUG [main] AxisOperation:467 - Entry: AxisOperation::setSoapAction, previous soapAction: null updated soapAction: urn:getSystemIsATool
[INFO] 15:22:28,310 DEBUG [main] AxisOperation:471 - Exit: AxisOperation::setSoapAction
[INFO] 15:22:28,310 DEBUG [main] AxisService:872 - mapActionToOperation: Mapping Action to Operation: action: getSystemIsATool; operation: org.apache.axis2.description.OutInAxisOperation@6aa3a905named: {http://trm.ws.gazelletest.tm.gazelle.ihe.net/}getSystemIsATool
[INFO] 15:22:28,310 DEBUG [main] AxisService:878 - DEBUG_FRAME = org.apache.axis2.util.JavaUtils.callStackToString(JavaUtils.java:564)
[INFO] 	DEBUG_FRAME = org.apache.axis2.description.AxisService.mapActionToOperation(AxisService.java:878)
[INFO] 	DEBUG_FRAME = org.apache.axis2.description.AxisService.addOperation(AxisService.java:724)
[INFO] 	DEBUG_FRAME = net.ihe.gazelle.ws.client.GazelleTRMServiceStub.populateAxisService(GazelleTRMServiceStub.java:106)
[INFO] 	DEBUG_FRAME = net.ihe.gazelle.ws.client.GazelleTRMServiceStub.<init>(GazelleTRMServiceStub.java:40)
[INFO] 	DEBUG_FRAME = net.ihe.gazelle.ws.client.GazelleTRMServiceStub.<init>(GazelleTRMServiceStub.java:29)
[INFO] 	DEBUG_FRAME = net.ihe.gazelle.ws.client.GazelleTRMServiceStub.<init>(GazelleTRMServiceStub.java:75)
[INFO] 	DEBUG_FRAME = net.ihe.gazelle.ws.client.GazelleTRMServiceClient.<init>(GazelleTRMServiceClient.java:11)
[INFO] 	DEBUG_FRAME = net.ihe.gazelle.ws.client.GazelleTRMServiceStubTest.getTestInstanceById(GazelleTRMServiceStubTest.java:41)
[INFO] 	DEBUG_FRAME = sun.reflect.NativeMethodAccessorImpl.invoke0(Native Method)
[INFO] 	DEBUG_FRAME = sun.reflect.NativeMethodAccessorImpl.invoke(NativeMethodAccessorImpl.java:62)
[INFO] 	DEBUG_FRAME = sun.reflect.DelegatingMethodAccessorImpl.invoke(DelegatingMethodAccessorImpl.java:43)
[INFO] 	DEBUG_FRAME = java.lang.reflect.Method.invoke(Method.java:498)
[INFO] 	DEBUG_FRAME = org.junit.runners.model.FrameworkMethod$1.runReflectiveCall(FrameworkMethod.java:44)
[INFO] 	DEBUG_FRAME = org.junit.internal.runners.model.ReflectiveCallable.run(ReflectiveCallable.java:15)
[INFO] 	DEBUG_FRAME = org.junit.runners.model.FrameworkMethod.invokeExplosively(FrameworkMethod.java:41)
[INFO] 	DEBUG_FRAME = org.junit.internal.runners.statements.InvokeMethod.evaluate(InvokeMethod.java:20)
[INFO] 	DEBUG_FRAME = org.junit.runners.BlockJUnit4ClassRunner.runNotIgnored(BlockJUnit4ClassRunner.java:79)
[INFO] 	DEBUG_FRAME = org.junit.runners.BlockJUnit4ClassRunner.runChild(BlockJUnit4ClassRunner.java:71)
[INFO] 	DEBUG_FRAME = org.junit.runners.BlockJUnit4ClassRunner.runChild(BlockJUnit4ClassRunner.java:49)
[INFO] 	DEBUG_FRAME = org.junit.runners.ParentRunner$3.run(ParentRunner.java:193)
[INFO] 	DEBUG_FRAME = org.junit.runners.ParentRunner$1.schedule(ParentRunner.java:52)
[INFO] 	DEBUG_FRAME = org.junit.runners.ParentRunner.runChildren(ParentRunner.java:191)
[INFO] 	DEBUG_FRAME = org.junit.runners.ParentRunner.access$000(ParentRunner.java:42)
[INFO] 	DEBUG_FRAME = org.junit.runners.ParentRunner$2.evaluate(ParentRunner.java:184)
[INFO] 	DEBUG_FRAME = org.junit.runners.ParentRunner.run(ParentRunner.java:236)
[INFO] 	DEBUG_FRAME = org.apache.maven.surefire.junit4.JUnit4Provider.execute(JUnit4Provider.java:252)
[INFO] 	DEBUG_FRAME = org.apache.maven.surefire.junit4.JUnit4Provider.executeTestSet(JUnit4Provider.java:141)
[INFO] 	DEBUG_FRAME = org.apache.maven.surefire.junit4.JUnit4Provider.invoke(JUnit4Provider.java:112)
[INFO] 	DEBUG_FRAME = sun.reflect.NativeMethodAccessorImpl.invoke0(Native Method)
[INFO] 	DEBUG_FRAME = sun.reflect.NativeMethodAccessorImpl.invoke(NativeMethodAccessorImpl.java:62)
[INFO] 	DEBUG_FRAME = sun.reflect.DelegatingMethodAccessorImpl.invoke(DelegatingMethodAccessorImpl.java:43)
[INFO] 	DEBUG_FRAME = java.lang.reflect.Method.invoke(Method.java:498)
[INFO] 	DEBUG_FRAME = org.apache.maven.surefire.util.ReflectionUtils.invokeMethodWithArray(ReflectionUtils.java:189)
[INFO] 	DEBUG_FRAME = org.apache.maven.surefire.booter.ProviderFactory$ProviderProxy.invoke(ProviderFactory.java:165)
[INFO] 	DEBUG_FRAME = org.apache.maven.surefire.booter.ProviderFactory.invokeProvider(ProviderFactory.java:85)
[INFO] 	DEBUG_FRAME = org.apache.maven.surefire.booter.ForkedBooter.runSuitesInProcess(ForkedBooter.java:115)
[INFO] 	DEBUG_FRAME = org.apache.maven.surefire.booter.ForkedBooter.main(ForkedBooter.java:75)
[INFO] 
[INFO] 15:22:28,311 DEBUG [main] AxisOperation:485 - Entry: AxisOperation::getInputAction
[INFO] 15:22:28,311 DEBUG [main] AxisOperation:490 - Debug: AxisOperation::getInputAction - using soapAction
[INFO] 15:22:28,311 DEBUG [main] AxisOperation:506 - Exit: AxisOperation::getInputAction urn:getSystemIsATool
[INFO] 15:22:28,311 DEBUG [main] AxisService:872 - mapActionToOperation: Mapping Action to Operation: action: urn:getSystemIsATool; operation: org.apache.axis2.description.OutInAxisOperation@6aa3a905named: {http://trm.ws.gazelletest.tm.gazelle.ihe.net/}getSystemIsATool
[INFO] 15:22:28,312 DEBUG [main] AxisService:878 - DEBUG_FRAME = org.apache.axis2.util.JavaUtils.callStackToString(JavaUtils.java:564)
[INFO] 	DEBUG_FRAME = org.apache.axis2.description.AxisService.mapActionToOperation(AxisService.java:878)
[INFO] 	DEBUG_FRAME = org.apache.axis2.description.AxisService.addOperation(AxisService.java:728)
[INFO] 	DEBUG_FRAME = net.ihe.gazelle.ws.client.GazelleTRMServiceStub.populateAxisService(GazelleTRMServiceStub.java:106)
[INFO] 	DEBUG_FRAME = net.ihe.gazelle.ws.client.GazelleTRMServiceStub.<init>(GazelleTRMServiceStub.java:40)
[INFO] 	DEBUG_FRAME = net.ihe.gazelle.ws.client.GazelleTRMServiceStub.<init>(GazelleTRMServiceStub.java:29)
[INFO] 	DEBUG_FRAME = net.ihe.gazelle.ws.client.GazelleTRMServiceStub.<init>(GazelleTRMServiceStub.java:75)
[INFO] 	DEBUG_FRAME = net.ihe.gazelle.ws.client.GazelleTRMServiceClient.<init>(GazelleTRMServiceClient.java:11)
[INFO] 	DEBUG_FRAME = net.ihe.gazelle.ws.client.GazelleTRMServiceStubTest.getTestInstanceById(GazelleTRMServiceStubTest.java:41)
[INFO] 	DEBUG_FRAME = sun.reflect.NativeMethodAccessorImpl.invoke0(Native Method)
[INFO] 	DEBUG_FRAME = sun.reflect.NativeMethodAccessorImpl.invoke(NativeMethodAccessorImpl.java:62)
[INFO] 	DEBUG_FRAME = sun.reflect.DelegatingMethodAccessorImpl.invoke(DelegatingMethodAccessorImpl.java:43)
[INFO] 	DEBUG_FRAME = java.lang.reflect.Method.invoke(Method.java:498)
[INFO] 	DEBUG_FRAME = org.junit.runners.model.FrameworkMethod$1.runReflectiveCall(FrameworkMethod.java:44)
[INFO] 	DEBUG_FRAME = org.junit.internal.runners.model.ReflectiveCallable.run(ReflectiveCallable.java:15)
[INFO] 	DEBUG_FRAME = org.junit.runners.model.FrameworkMethod.invokeExplosively(FrameworkMethod.java:41)
[INFO] 	DEBUG_FRAME = org.junit.internal.runners.statements.InvokeMethod.evaluate(InvokeMethod.java:20)
[INFO] 	DEBUG_FRAME = org.junit.runners.BlockJUnit4ClassRunner.runNotIgnored(BlockJUnit4ClassRunner.java:79)
[INFO] 	DEBUG_FRAME = org.junit.runners.BlockJUnit4ClassRunner.runChild(BlockJUnit4ClassRunner.java:71)
[INFO] 	DEBUG_FRAME = org.junit.runners.BlockJUnit4ClassRunner.runChild(BlockJUnit4ClassRunner.java:49)
[INFO] 	DEBUG_FRAME = org.junit.runners.ParentRunner$3.run(ParentRunner.java:193)
[INFO] 	DEBUG_FRAME = org.junit.runners.ParentRunner$1.schedule(ParentRunner.java:52)
[INFO] 	DEBUG_FRAME = org.junit.runners.ParentRunner.runChildren(ParentRunner.java:191)
[INFO] 	DEBUG_FRAME = org.junit.runners.ParentRunner.access$000(ParentRunner.java:42)
[INFO] 	DEBUG_FRAME = org.junit.runners.ParentRunner$2.evaluate(ParentRunner.java:184)
[INFO] 	DEBUG_FRAME = org.junit.runners.ParentRunner.run(ParentRunner.java:236)
[INFO] 	DEBUG_FRAME = org.apache.maven.surefire.junit4.JUnit4Provider.execute(JUnit4Provider.java:252)
[INFO] 	DEBUG_FRAME = org.apache.maven.surefire.junit4.JUnit4Provider.executeTestSet(JUnit4Provider.java:141)
[INFO] 	DEBUG_FRAME = org.apache.maven.surefire.junit4.JUnit4Provider.invoke(JUnit4Provider.java:112)
[INFO] 	DEBUG_FRAME = sun.reflect.NativeMethodAccessorImpl.invoke0(Native Method)
[INFO] 	DEBUG_FRAME = sun.reflect.NativeMethodAccessorImpl.invoke(NativeMethodAccessorImpl.java:62)
[INFO] 	DEBUG_FRAME = sun.reflect.DelegatingMethodAccessorImpl.invoke(DelegatingMethodAccessorImpl.java:43)
[INFO] 	DEBUG_FRAME = java.lang.reflect.Method.invoke(Method.java:498)
[INFO] 	DEBUG_FRAME = org.apache.maven.surefire.util.ReflectionUtils.invokeMethodWithArray(ReflectionUtils.java:189)
[INFO] 	DEBUG_FRAME = org.apache.maven.surefire.booter.ProviderFactory$ProviderProxy.invoke(ProviderFactory.java:165)
[INFO] 	DEBUG_FRAME = org.apache.maven.surefire.booter.ProviderFactory.invokeProvider(ProviderFactory.java:85)
[INFO] 	DEBUG_FRAME = org.apache.maven.surefire.booter.ForkedBooter.runSuitesInProcess(ForkedBooter.java:115)
[INFO] 	DEBUG_FRAME = org.apache.maven.surefire.booter.ForkedBooter.main(ForkedBooter.java:75)
[INFO] 
[INFO] 15:22:28,312 DEBUG [main] AxisOperation:485 - Entry: AxisOperation::getInputAction
[INFO] 15:22:28,312 DEBUG [main] AxisOperation:506 - Exit: AxisOperation::getInputAction null
[INFO] 15:22:28,312 DEBUG [main] AxisOperation:467 - Entry: AxisOperation::setSoapAction, previous soapAction: null updated soapAction: urn:getTestInstancesByTestingSession
[INFO] 15:22:28,313 DEBUG [main] AxisOperation:471 - Exit: AxisOperation::setSoapAction
[INFO] 15:22:28,313 DEBUG [main] AxisService:872 - mapActionToOperation: Mapping Action to Operation: action: getTestInstancesByTestingSession; operation: org.apache.axis2.description.OutInAxisOperation@4612b856named: {http://trm.ws.gazelletest.tm.gazelle.ihe.net/}getTestInstancesByTestingSession
[INFO] 15:22:28,313 DEBUG [main] AxisService:878 - DEBUG_FRAME = org.apache.axis2.util.JavaUtils.callStackToString(JavaUtils.java:564)
[INFO] 	DEBUG_FRAME = org.apache.axis2.description.AxisService.mapActionToOperation(AxisService.java:878)
[INFO] 	DEBUG_FRAME = org.apache.axis2.description.AxisService.addOperation(AxisService.java:724)
[INFO] 	DEBUG_FRAME = net.ihe.gazelle.ws.client.GazelleTRMServiceStub.populateAxisService(GazelleTRMServiceStub.java:115)
[INFO] 	DEBUG_FRAME = net.ihe.gazelle.ws.client.GazelleTRMServiceStub.<init>(GazelleTRMServiceStub.java:40)
[INFO] 	DEBUG_FRAME = net.ihe.gazelle.ws.client.GazelleTRMServiceStub.<init>(GazelleTRMServiceStub.java:29)
[INFO] 	DEBUG_FRAME = net.ihe.gazelle.ws.client.GazelleTRMServiceStub.<init>(GazelleTRMServiceStub.java:75)
[INFO] 	DEBUG_FRAME = net.ihe.gazelle.ws.client.GazelleTRMServiceClient.<init>(GazelleTRMServiceClient.java:11)
[INFO] 	DEBUG_FRAME = net.ihe.gazelle.ws.client.GazelleTRMServiceStubTest.getTestInstanceById(GazelleTRMServiceStubTest.java:41)
[INFO] 	DEBUG_FRAME = sun.reflect.NativeMethodAccessorImpl.invoke0(Native Method)
[INFO] 	DEBUG_FRAME = sun.reflect.NativeMethodAccessorImpl.invoke(NativeMethodAccessorImpl.java:62)
[INFO] 	DEBUG_FRAME = sun.reflect.DelegatingMethodAccessorImpl.invoke(DelegatingMethodAccessorImpl.java:43)
[INFO] 	DEBUG_FRAME = java.lang.reflect.Method.invoke(Method.java:498)
[INFO] 	DEBUG_FRAME = org.junit.runners.model.FrameworkMethod$1.runReflectiveCall(FrameworkMethod.java:44)
[INFO] 	DEBUG_FRAME = org.junit.internal.runners.model.ReflectiveCallable.run(ReflectiveCallable.java:15)
[INFO] 	DEBUG_FRAME = org.junit.runners.model.FrameworkMethod.invokeExplosively(FrameworkMethod.java:41)
[INFO] 	DEBUG_FRAME = org.junit.internal.runners.statements.InvokeMethod.evaluate(InvokeMethod.java:20)
[INFO] 	DEBUG_FRAME = org.junit.runners.BlockJUnit4ClassRunner.runNotIgnored(BlockJUnit4ClassRunner.java:79)
[INFO] 	DEBUG_FRAME = org.junit.runners.BlockJUnit4ClassRunner.runChild(BlockJUnit4ClassRunner.java:71)
[INFO] 	DEBUG_FRAME = org.junit.runners.BlockJUnit4ClassRunner.runChild(BlockJUnit4ClassRunner.java:49)
[INFO] 	DEBUG_FRAME = org.junit.runners.ParentRunner$3.run(ParentRunner.java:193)
[INFO] 	DEBUG_FRAME = org.junit.runners.ParentRunner$1.schedule(ParentRunner.java:52)
[INFO] 	DEBUG_FRAME = org.junit.runners.ParentRunner.runChildren(ParentRunner.java:191)
[INFO] 	DEBUG_FRAME = org.junit.runners.ParentRunner.access$000(ParentRunner.java:42)
[INFO] 	DEBUG_FRAME = org.junit.runners.ParentRunner$2.evaluate(ParentRunner.java:184)
[INFO] 	DEBUG_FRAME = org.junit.runners.ParentRunner.run(ParentRunner.java:236)
[INFO] 	DEBUG_FRAME = org.apache.maven.surefire.junit4.JUnit4Provider.execute(JUnit4Provider.java:252)
[INFO] 	DEBUG_FRAME = org.apache.maven.surefire.junit4.JUnit4Provider.executeTestSet(JUnit4Provider.java:141)
[INFO] 	DEBUG_FRAME = org.apache.maven.surefire.junit4.JUnit4Provider.invoke(JUnit4Provider.java:112)
[INFO] 	DEBUG_FRAME = sun.reflect.NativeMethodAccessorImpl.invoke0(Native Method)
[INFO] 	DEBUG_FRAME = sun.reflect.NativeMethodAccessorImpl.invoke(NativeMethodAccessorImpl.java:62)
[INFO] 	DEBUG_FRAME = sun.reflect.DelegatingMethodAccessorImpl.invoke(DelegatingMethodAccessorImpl.java:43)
[INFO] 	DEBUG_FRAME = java.lang.reflect.Method.invoke(Method.java:498)
[INFO] 	DEBUG_FRAME = org.apache.maven.surefire.util.ReflectionUtils.invokeMethodWithArray(ReflectionUtils.java:189)
[INFO] 	DEBUG_FRAME = org.apache.maven.surefire.booter.ProviderFactory$ProviderProxy.invoke(ProviderFactory.java:165)
[INFO] 	DEBUG_FRAME = org.apache.maven.surefire.booter.ProviderFactory.invokeProvider(ProviderFactory.java:85)
[INFO] 	DEBUG_FRAME = org.apache.maven.surefire.booter.ForkedBooter.runSuitesInProcess(ForkedBooter.java:115)
[INFO] 	DEBUG_FRAME = org.apache.maven.surefire.booter.ForkedBooter.main(ForkedBooter.java:75)
[INFO] 
[INFO] 15:22:28,313 DEBUG [main] AxisOperation:485 - Entry: AxisOperation::getInputAction
[INFO] 15:22:28,313 DEBUG [main] AxisOperation:490 - Debug: AxisOperation::getInputAction - using soapAction
[INFO] 15:22:28,314 DEBUG [main] AxisOperation:506 - Exit: AxisOperation::getInputAction urn:getTestInstancesByTestingSession
[INFO] 15:22:28,314 DEBUG [main] AxisService:872 - mapActionToOperation: Mapping Action to Operation: action: urn:getTestInstancesByTestingSession; operation: org.apache.axis2.description.OutInAxisOperation@4612b856named: {http://trm.ws.gazelletest.tm.gazelle.ihe.net/}getTestInstancesByTestingSession
[INFO] 15:22:28,314 DEBUG [main] AxisService:878 - DEBUG_FRAME = org.apache.axis2.util.JavaUtils.callStackToString(JavaUtils.java:564)
[INFO] 	DEBUG_FRAME = org.apache.axis2.description.AxisService.mapActionToOperation(AxisService.java:878)
[INFO] 	DEBUG_FRAME = org.apache.axis2.description.AxisService.addOperation(AxisService.java:728)
[INFO] 	DEBUG_FRAME = net.ihe.gazelle.ws.client.GazelleTRMServiceStub.populateAxisService(GazelleTRMServiceStub.java:115)
[INFO] 	DEBUG_FRAME = net.ihe.gazelle.ws.client.GazelleTRMServiceStub.<init>(GazelleTRMServiceStub.java:40)
[INFO] 	DEBUG_FRAME = net.ihe.gazelle.ws.client.GazelleTRMServiceStub.<init>(GazelleTRMServiceStub.java:29)
[INFO] 	DEBUG_FRAME = net.ihe.gazelle.ws.client.GazelleTRMServiceStub.<init>(GazelleTRMServiceStub.java:75)
[INFO] 	DEBUG_FRAME = net.ihe.gazelle.ws.client.GazelleTRMServiceClient.<init>(GazelleTRMServiceClient.java:11)
[INFO] 	DEBUG_FRAME = net.ihe.gazelle.ws.client.GazelleTRMServiceStubTest.getTestInstanceById(GazelleTRMServiceStubTest.java:41)
[INFO] 	DEBUG_FRAME = sun.reflect.NativeMethodAccessorImpl.invoke0(Native Method)
[INFO] 	DEBUG_FRAME = sun.reflect.NativeMethodAccessorImpl.invoke(NativeMethodAccessorImpl.java:62)
[INFO] 	DEBUG_FRAME = sun.reflect.DelegatingMethodAccessorImpl.invoke(DelegatingMethodAccessorImpl.java:43)
[INFO] 	DEBUG_FRAME = java.lang.reflect.Method.invoke(Method.java:498)
[INFO] 	DEBUG_FRAME = org.junit.runners.model.FrameworkMethod$1.runReflectiveCall(FrameworkMethod.java:44)
[INFO] 	DEBUG_FRAME = org.junit.internal.runners.model.ReflectiveCallable.run(ReflectiveCallable.java:15)
[INFO] 	DEBUG_FRAME = org.junit.runners.model.FrameworkMethod.invokeExplosively(FrameworkMethod.java:41)
[INFO] 	DEBUG_FRAME = org.junit.internal.runners.statements.InvokeMethod.evaluate(InvokeMethod.java:20)
[INFO] 	DEBUG_FRAME = org.junit.runners.BlockJUnit4ClassRunner.runNotIgnored(BlockJUnit4ClassRunner.java:79)
[INFO] 	DEBUG_FRAME = org.junit.runners.BlockJUnit4ClassRunner.runChild(BlockJUnit4ClassRunner.java:71)
[INFO] 	DEBUG_FRAME = org.junit.runners.BlockJUnit4ClassRunner.runChild(BlockJUnit4ClassRunner.java:49)
[INFO] 	DEBUG_FRAME = org.junit.runners.ParentRunner$3.run(ParentRunner.java:193)
[INFO] 	DEBUG_FRAME = org.junit.runners.ParentRunner$1.schedule(ParentRunner.java:52)
[INFO] 	DEBUG_FRAME = org.junit.runners.ParentRunner.runChildren(ParentRunner.java:191)
[INFO] 	DEBUG_FRAME = org.junit.runners.ParentRunner.access$000(ParentRunner.java:42)
[INFO] 	DEBUG_FRAME = org.junit.runners.ParentRunner$2.evaluate(ParentRunner.java:184)
[INFO] 	DEBUG_FRAME = org.junit.runners.ParentRunner.run(ParentRunner.java:236)
[INFO] 	DEBUG_FRAME = org.apache.maven.surefire.junit4.JUnit4Provider.execute(JUnit4Provider.java:252)
[INFO] 	DEBUG_FRAME = org.apache.maven.surefire.junit4.JUnit4Provider.executeTestSet(JUnit4Provider.java:141)
[INFO] 	DEBUG_FRAME = org.apache.maven.surefire.junit4.JUnit4Provider.invoke(JUnit4Provider.java:112)
[INFO] 	DEBUG_FRAME = sun.reflect.NativeMethodAccessorImpl.invoke0(Native Method)
[INFO] 	DEBUG_FRAME = sun.reflect.NativeMethodAccessorImpl.invoke(NativeMethodAccessorImpl.java:62)
[INFO] 	DEBUG_FRAME = sun.reflect.DelegatingMethodAccessorImpl.invoke(DelegatingMethodAccessorImpl.java:43)
[INFO] 	DEBUG_FRAME = java.lang.reflect.Method.invoke(Method.java:498)
[INFO] 	DEBUG_FRAME = org.apache.maven.surefire.util.ReflectionUtils.invokeMethodWithArray(ReflectionUtils.java:189)
[INFO] 	DEBUG_FRAME = org.apache.maven.surefire.booter.ProviderFactory$ProviderProxy.invoke(ProviderFactory.java:165)
[INFO] 	DEBUG_FRAME = org.apache.maven.surefire.booter.ProviderFactory.invokeProvider(ProviderFactory.java:85)
[INFO] 	DEBUG_FRAME = org.apache.maven.surefire.booter.ForkedBooter.runSuitesInProcess(ForkedBooter.java:115)
[INFO] 	DEBUG_FRAME = org.apache.maven.surefire.booter.ForkedBooter.main(ForkedBooter.java:75)
[INFO] 
[INFO] 15:22:28,314 DEBUG [main] AxisOperation:485 - Entry: AxisOperation::getInputAction
[INFO] 15:22:28,314 DEBUG [main] AxisOperation:506 - Exit: AxisOperation::getInputAction null
[INFO] 15:22:28,315 DEBUG [main] AxisOperation:467 - Entry: AxisOperation::setSoapAction, previous soapAction: null updated soapAction: urn:getTestInstanceById
[INFO] 15:22:28,315 DEBUG [main] AxisOperation:471 - Exit: AxisOperation::setSoapAction
[INFO] 15:22:28,315 DEBUG [main] AxisService:872 - mapActionToOperation: Mapping Action to Operation: action: getTestInstanceById; operation: org.apache.axis2.description.OutInAxisOperation@2df6226dnamed: {http://trm.ws.gazelletest.tm.gazelle.ihe.net/}getTestInstanceById
[INFO] 15:22:28,315 DEBUG [main] AxisService:878 - DEBUG_FRAME = org.apache.axis2.util.JavaUtils.callStackToString(JavaUtils.java:564)
[INFO] 	DEBUG_FRAME = org.apache.axis2.description.AxisService.mapActionToOperation(AxisService.java:878)
[INFO] 	DEBUG_FRAME = org.apache.axis2.description.AxisService.addOperation(AxisService.java:724)
[INFO] 	DEBUG_FRAME = net.ihe.gazelle.ws.client.GazelleTRMServiceStub.populateAxisService(GazelleTRMServiceStub.java:124)
[INFO] 	DEBUG_FRAME = net.ihe.gazelle.ws.client.GazelleTRMServiceStub.<init>(GazelleTRMServiceStub.java:40)
[INFO] 	DEBUG_FRAME = net.ihe.gazelle.ws.client.GazelleTRMServiceStub.<init>(GazelleTRMServiceStub.java:29)
[INFO] 	DEBUG_FRAME = net.ihe.gazelle.ws.client.GazelleTRMServiceStub.<init>(GazelleTRMServiceStub.java:75)
[INFO] 	DEBUG_FRAME = net.ihe.gazelle.ws.client.GazelleTRMServiceClient.<init>(GazelleTRMServiceClient.java:11)
[INFO] 	DEBUG_FRAME = net.ihe.gazelle.ws.client.GazelleTRMServiceStubTest.getTestInstanceById(GazelleTRMServiceStubTest.java:41)
[INFO] 	DEBUG_FRAME = sun.reflect.NativeMethodAccessorImpl.invoke0(Native Method)
[INFO] 	DEBUG_FRAME = sun.reflect.NativeMethodAccessorImpl.invoke(NativeMethodAccessorImpl.java:62)
[INFO] 	DEBUG_FRAME = sun.reflect.DelegatingMethodAccessorImpl.invoke(DelegatingMethodAccessorImpl.java:43)
[INFO] 	DEBUG_FRAME = java.lang.reflect.Method.invoke(Method.java:498)
[INFO] 	DEBUG_FRAME = org.junit.runners.model.FrameworkMethod$1.runReflectiveCall(FrameworkMethod.java:44)
[INFO] 	DEBUG_FRAME = org.junit.internal.runners.model.ReflectiveCallable.run(ReflectiveCallable.java:15)
[INFO] 	DEBUG_FRAME = org.junit.runners.model.FrameworkMethod.invokeExplosively(FrameworkMethod.java:41)
[INFO] 	DEBUG_FRAME = org.junit.internal.runners.statements.InvokeMethod.evaluate(InvokeMethod.java:20)
[INFO] 	DEBUG_FRAME = org.junit.runners.BlockJUnit4ClassRunner.runNotIgnored(BlockJUnit4ClassRunner.java:79)
[INFO] 	DEBUG_FRAME = org.junit.runners.BlockJUnit4ClassRunner.runChild(BlockJUnit4ClassRunner.java:71)
[INFO] 	DEBUG_FRAME = org.junit.runners.BlockJUnit4ClassRunner.runChild(BlockJUnit4ClassRunner.java:49)
[INFO] 	DEBUG_FRAME = org.junit.runners.ParentRunner$3.run(ParentRunner.java:193)
[INFO] 	DEBUG_FRAME = org.junit.runners.ParentRunner$1.schedule(ParentRunner.java:52)
[INFO] 	DEBUG_FRAME = org.junit.runners.ParentRunner.runChildren(ParentRunner.java:191)
[INFO] 	DEBUG_FRAME = org.junit.runners.ParentRunner.access$000(ParentRunner.java:42)
[INFO] 	DEBUG_FRAME = org.junit.runners.ParentRunner$2.evaluate(ParentRunner.java:184)
[INFO] 	DEBUG_FRAME = org.junit.runners.ParentRunner.run(ParentRunner.java:236)
[INFO] 	DEBUG_FRAME = org.apache.maven.surefire.junit4.JUnit4Provider.execute(JUnit4Provider.java:252)
[INFO] 	DEBUG_FRAME = org.apache.maven.surefire.junit4.JUnit4Provider.executeTestSet(JUnit4Provider.java:141)
[INFO] 	DEBUG_FRAME = org.apache.maven.surefire.junit4.JUnit4Provider.invoke(JUnit4Provider.java:112)
[INFO] 	DEBUG_FRAME = sun.reflect.NativeMethodAccessorImpl.invoke0(Native Method)
[INFO] 	DEBUG_FRAME = sun.reflect.NativeMethodAccessorImpl.invoke(NativeMethodAccessorImpl.java:62)
[INFO] 	DEBUG_FRAME = sun.reflect.DelegatingMethodAccessorImpl.invoke(DelegatingMethodAccessorImpl.java:43)
[INFO] 	DEBUG_FRAME = java.lang.reflect.Method.invoke(Method.java:498)
[INFO] 	DEBUG_FRAME = org.apache.maven.surefire.util.ReflectionUtils.invokeMethodWithArray(ReflectionUtils.java:189)
[INFO] 	DEBUG_FRAME = org.apache.maven.surefire.booter.ProviderFactory$ProviderProxy.invoke(ProviderFactory.java:165)
[INFO] 	DEBUG_FRAME = org.apache.maven.surefire.booter.ProviderFactory.invokeProvider(ProviderFactory.java:85)
[INFO] 	DEBUG_FRAME = org.apache.maven.surefire.booter.ForkedBooter.runSuitesInProcess(ForkedBooter.java:115)
[INFO] 	DEBUG_FRAME = org.apache.maven.surefire.booter.ForkedBooter.main(ForkedBooter.java:75)
[INFO] 
[INFO] 15:22:28,315 DEBUG [main] AxisOperation:485 - Entry: AxisOperation::getInputAction
[INFO] 15:22:28,315 DEBUG [main] AxisOperation:490 - Debug: AxisOperation::getInputAction - using soapAction
[INFO] 15:22:28,316 DEBUG [main] AxisOperation:506 - Exit: AxisOperation::getInputAction urn:getTestInstanceById
[INFO] 15:22:28,316 DEBUG [main] AxisService:872 - mapActionToOperation: Mapping Action to Operation: action: urn:getTestInstanceById; operation: org.apache.axis2.description.OutInAxisOperation@2df6226dnamed: {http://trm.ws.gazelletest.tm.gazelle.ihe.net/}getTestInstanceById
[INFO] 15:22:28,316 DEBUG [main] AxisService:878 - DEBUG_FRAME = org.apache.axis2.util.JavaUtils.callStackToString(JavaUtils.java:564)
[INFO] 	DEBUG_FRAME = org.apache.axis2.description.AxisService.mapActionToOperation(AxisService.java:878)
[INFO] 	DEBUG_FRAME = org.apache.axis2.description.AxisService.addOperation(AxisService.java:728)
[INFO] 	DEBUG_FRAME = net.ihe.gazelle.ws.client.GazelleTRMServiceStub.populateAxisService(GazelleTRMServiceStub.java:124)
[INFO] 	DEBUG_FRAME = net.ihe.gazelle.ws.client.GazelleTRMServiceStub.<init>(GazelleTRMServiceStub.java:40)
[INFO] 	DEBUG_FRAME = net.ihe.gazelle.ws.client.GazelleTRMServiceStub.<init>(GazelleTRMServiceStub.java:29)
[INFO] 	DEBUG_FRAME = net.ihe.gazelle.ws.client.GazelleTRMServiceStub.<init>(GazelleTRMServiceStub.java:75)
[INFO] 	DEBUG_FRAME = net.ihe.gazelle.ws.client.GazelleTRMServiceClient.<init>(GazelleTRMServiceClient.java:11)
[INFO] 	DEBUG_FRAME = net.ihe.gazelle.ws.client.GazelleTRMServiceStubTest.getTestInstanceById(GazelleTRMServiceStubTest.java:41)
[INFO] 	DEBUG_FRAME = sun.reflect.NativeMethodAccessorImpl.invoke0(Native Method)
[INFO] 	DEBUG_FRAME = sun.reflect.NativeMethodAccessorImpl.invoke(NativeMethodAccessorImpl.java:62)
[INFO] 	DEBUG_FRAME = sun.reflect.DelegatingMethodAccessorImpl.invoke(DelegatingMethodAccessorImpl.java:43)
[INFO] 	DEBUG_FRAME = java.lang.reflect.Method.invoke(Method.java:498)
[INFO] 	DEBUG_FRAME = org.junit.runners.model.FrameworkMethod$1.runReflectiveCall(FrameworkMethod.java:44)
[INFO] 	DEBUG_FRAME = org.junit.internal.runners.model.ReflectiveCallable.run(ReflectiveCallable.java:15)
[INFO] 	DEBUG_FRAME = org.junit.runners.model.FrameworkMethod.invokeExplosively(FrameworkMethod.java:41)
[INFO] 	DEBUG_FRAME = org.junit.internal.runners.statements.InvokeMethod.evaluate(InvokeMethod.java:20)
[INFO] 	DEBUG_FRAME = org.junit.runners.BlockJUnit4ClassRunner.runNotIgnored(BlockJUnit4ClassRunner.java:79)
[INFO] 	DEBUG_FRAME = org.junit.runners.BlockJUnit4ClassRunner.runChild(BlockJUnit4ClassRunner.java:71)
[INFO] 	DEBUG_FRAME = org.junit.runners.BlockJUnit4ClassRunner.runChild(BlockJUnit4ClassRunner.java:49)
[INFO] 	DEBUG_FRAME = org.junit.runners.ParentRunner$3.run(ParentRunner.java:193)
[INFO] 	DEBUG_FRAME = org.junit.runners.ParentRunner$1.schedule(ParentRunner.java:52)
[INFO] 	DEBUG_FRAME = org.junit.runners.ParentRunner.runChildren(ParentRunner.java:191)
[INFO] 	DEBUG_FRAME = org.junit.runners.ParentRunner.access$000(ParentRunner.java:42)
[INFO] 	DEBUG_FRAME = org.junit.runners.ParentRunner$2.evaluate(ParentRunner.java:184)
[INFO] 	DEBUG_FRAME = org.junit.runners.ParentRunner.run(ParentRunner.java:236)
[INFO] 	DEBUG_FRAME = org.apache.maven.surefire.junit4.JUnit4Provider.execute(JUnit4Provider.java:252)
[INFO] 	DEBUG_FRAME = org.apache.maven.surefire.junit4.JUnit4Provider.executeTestSet(JUnit4Provider.java:141)
[INFO] 	DEBUG_FRAME = org.apache.maven.surefire.junit4.JUnit4Provider.invoke(JUnit4Provider.java:112)
[INFO] 	DEBUG_FRAME = sun.reflect.NativeMethodAccessorImpl.invoke0(Native Method)
[INFO] 	DEBUG_FRAME = sun.reflect.NativeMethodAccessorImpl.invoke(NativeMethodAccessorImpl.java:62)
[INFO] 	DEBUG_FRAME = sun.reflect.DelegatingMethodAccessorImpl.invoke(DelegatingMethodAccessorImpl.java:43)
[INFO] 	DEBUG_FRAME = java.lang.reflect.Method.invoke(Method.java:498)
[INFO] 	DEBUG_FRAME = org.apache.maven.surefire.util.ReflectionUtils.invokeMethodWithArray(ReflectionUtils.java:189)
[INFO] 	DEBUG_FRAME = org.apache.maven.surefire.booter.ProviderFactory$ProviderProxy.invoke(ProviderFactory.java:165)
[INFO] 	DEBUG_FRAME = org.apache.maven.surefire.booter.ProviderFactory.invokeProvider(ProviderFactory.java:85)
[INFO] 	DEBUG_FRAME = org.apache.maven.surefire.booter.ForkedBooter.runSuitesInProcess(ForkedBooter.java:115)
[INFO] 	DEBUG_FRAME = org.apache.maven.surefire.booter.ForkedBooter.main(ForkedBooter.java:75)
[INFO] 
[INFO] 15:22:28,316 DEBUG [main] Loader:132 - Trying to find [org/apache/axis2/deployment/axis2_default.xml] using sun.misc.Launcher$AppClassLoader@232204a1 class loader.
[INFO] 15:22:28,317 DEBUG [main] StAXUtils:210 - XMLStreamReader is org.apache.axiom.util.stax.dialect.Woodstox4StreamReaderWrapper
[INFO] 15:22:28,332 DEBUG [main] AxiomContainerSupport:172 - Builder is already complete.
[INFO] 15:22:28,334 DEBUG [main] Phase:98 - Handler RequestURIBasedDispatcher added to Phase Transport
[INFO] 15:22:28,335 DEBUG [main] Phase:98 - Handler SOAPActionBasedDispatcher added to Phase Transport
[INFO] 15:22:28,335 DEBUG [main] Phase:98 - Handler AddressingBasedDispatcher added to Phase Addressing
[INFO] 15:22:28,335 DEBUG [main] Phase:98 - Handler RequestURIBasedDispatcher added to Phase Dispatch
[INFO] 15:22:28,335 DEBUG [main] Phase:98 - Handler SOAPActionBasedDispatcher added to Phase Dispatch
[INFO] 15:22:28,336 DEBUG [main] Phase:98 - Handler RequestURIOperationDispatcher added to Phase Dispatch
[INFO] 15:22:28,336 DEBUG [main] Phase:98 - Handler SOAPMessageBodyBasedDispatcher added to Phase Dispatch
[INFO] 15:22:28,336 DEBUG [main] Phase:98 - Handler HTTPLocationBasedDispatcher added to Phase Dispatch
[INFO] 15:22:28,336 DEBUG [main] Phase:98 - Handler RequestURIBasedDispatcher added to Phase Transport
[INFO] 15:22:28,336 DEBUG [main] Phase:98 - Handler SOAPActionBasedDispatcher added to Phase Transport
[INFO] 15:22:28,337 DEBUG [main] Phase:98 - Handler AddressingBasedDispatcher added to Phase Addressing
[INFO] 15:22:28,337 DEBUG [main] Phase:98 - Handler RequestURIBasedDispatcher added to Phase Dispatch
[INFO] 15:22:28,337 DEBUG [main] Phase:98 - Handler SOAPActionBasedDispatcher added to Phase Dispatch
[INFO] 15:22:28,337 DEBUG [main] Phase:98 - Handler RequestURIOperationDispatcher added to Phase Dispatch
[INFO] 15:22:28,337 DEBUG [main] Phase:98 - Handler SOAPMessageBodyBasedDispatcher added to Phase Dispatch
[INFO] 15:22:28,338 DEBUG [main] Phase:98 - Handler HTTPLocationBasedDispatcher added to Phase Dispatch
[INFO] 15:22:28,339 DEBUG [main] Loader:256 - java.lang.ClassNotFoundException: org.apache.axis2.jaxws.framework.JAXWSServiceBuilderExtension
[INFO] 15:22:28,340  WARN [main] AxisConfigBuilder:442 - Unable to instantiate deployer org.apache.axis2.deployment.ServiceDeployer; see debug logs for more details
[INFO] 15:22:28,340 DEBUG [main] AxisConfigBuilder:444 - org.apache.axis2.jaxws.framework.JAXWSServiceBuilderExtension
[INFO] java.lang.ClassNotFoundException: org.apache.axis2.jaxws.framework.JAXWSServiceBuilderExtension
[INFO] 	at java.net.URLClassLoader.findClass(URLClassLoader.java:381)
[INFO] 	at java.lang.ClassLoader.loadClass(ClassLoader.java:424)
[INFO] 	at sun.misc.Launcher$AppClassLoader.loadClass(Launcher.java:338)
[INFO] 	at java.lang.ClassLoader.loadClass(ClassLoader.java:357)
[INFO] 	at java.lang.Class.forName0(Native Method)
[INFO] 	at java.lang.Class.forName(Class.java:264)
[INFO] 	at org.apache.axis2.util.Loader.loadClass(Loader.java:261)
[INFO] 	at org.apache.axis2.deployment.AxisConfigBuilder.processDeployers(AxisConfigBuilder.java:434)
[INFO] 	at org.apache.axis2.deployment.AxisConfigBuilder.populateConfig(AxisConfigBuilder.java:275)
[INFO] 	at org.apache.axis2.deployment.DeploymentEngine.populateAxisConfiguration(DeploymentEngine.java:629)
[INFO] 	at org.apache.axis2.deployment.FileSystemConfigurator.getAxisConfiguration(FileSystemConfigurator.java:116)
[INFO] 	at org.apache.axis2.context.ConfigurationContextFactory.createConfigurationContext(ConfigurationContextFactory.java:64)
[INFO] 	at org.apache.axis2.context.ConfigurationContextFactory.createConfigurationContextFromFileSystem(ConfigurationContextFactory.java:210)
[INFO] 	at org.apache.axis2.client.ServiceClient.configureServiceClient(ServiceClient.java:150)
[INFO] 	at org.apache.axis2.client.ServiceClient.<init>(ServiceClient.java:143)
[INFO] 	at net.ihe.gazelle.ws.client.GazelleTRMServiceStub.<init>(GazelleTRMServiceStub.java:43)
[INFO] 	at net.ihe.gazelle.ws.client.GazelleTRMServiceStub.<init>(GazelleTRMServiceStub.java:29)
[INFO] 	at net.ihe.gazelle.ws.client.GazelleTRMServiceStub.<init>(GazelleTRMServiceStub.java:75)
[INFO] 	at net.ihe.gazelle.ws.client.GazelleTRMServiceClient.<init>(GazelleTRMServiceClient.java:11)
[INFO] 	at net.ihe.gazelle.ws.client.GazelleTRMServiceStubTest.getTestInstanceById(GazelleTRMServiceStubTest.java:41)
[INFO] 	at sun.reflect.NativeMethodAccessorImpl.invoke0(Native Method)
[INFO] 	at sun.reflect.NativeMethodAccessorImpl.invoke(NativeMethodAccessorImpl.java:62)
[INFO] 	at sun.reflect.DelegatingMethodAccessorImpl.invoke(DelegatingMethodAccessorImpl.java:43)
[INFO] 	at java.lang.reflect.Method.invoke(Method.java:498)
[INFO] 	at org.junit.runners.model.FrameworkMethod$1.runReflectiveCall(FrameworkMethod.java:44)
[INFO] 	at org.junit.internal.runners.model.ReflectiveCallable.run(ReflectiveCallable.java:15)
[INFO] 	at org.junit.runners.model.FrameworkMethod.invokeExplosively(FrameworkMethod.java:41)
[INFO] 	at org.junit.internal.runners.statements.InvokeMethod.evaluate(InvokeMethod.java:20)
[INFO] 	at org.junit.runners.BlockJUnit4ClassRunner.runNotIgnored(BlockJUnit4ClassRunner.java:79)
[INFO] 	at org.junit.runners.BlockJUnit4ClassRunner.runChild(BlockJUnit4ClassRunner.java:71)
[INFO] 	at org.junit.runners.BlockJUnit4ClassRunner.runChild(BlockJUnit4ClassRunner.java:49)
[INFO] 	at org.junit.runners.ParentRunner$3.run(ParentRunner.java:193)
[INFO] 	at org.junit.runners.ParentRunner$1.schedule(ParentRunner.java:52)
[INFO] 	at org.junit.runners.ParentRunner.runChildren(ParentRunner.java:191)
[INFO] 	at org.junit.runners.ParentRunner.access$000(ParentRunner.java:42)
[INFO] 	at org.junit.runners.ParentRunner$2.evaluate(ParentRunner.java:184)
[INFO] 	at org.junit.runners.ParentRunner.run(ParentRunner.java:236)
[INFO] 	at org.apache.maven.surefire.junit4.JUnit4Provider.execute(JUnit4Provider.java:252)
[INFO] 	at org.apache.maven.surefire.junit4.JUnit4Provider.executeTestSet(JUnit4Provider.java:141)
[INFO] 	at org.apache.maven.surefire.junit4.JUnit4Provider.invoke(JUnit4Provider.java:112)
[INFO] 	at sun.reflect.NativeMethodAccessorImpl.invoke0(Native Method)
[INFO] 	at sun.reflect.NativeMethodAccessorImpl.invoke(NativeMethodAccessorImpl.java:62)
[INFO] 	at sun.reflect.DelegatingMethodAccessorImpl.invoke(DelegatingMethodAccessorImpl.java:43)
[INFO] 	at java.lang.reflect.Method.invoke(Method.java:498)
[INFO] 	at org.apache.maven.surefire.util.ReflectionUtils.invokeMethodWithArray(ReflectionUtils.java:189)
[INFO] 	at org.apache.maven.surefire.booter.ProviderFactory$ProviderProxy.invoke(ProviderFactory.java:165)
[INFO] 	at org.apache.maven.surefire.booter.ProviderFactory.invokeProvider(ProviderFactory.java:85)
[INFO] 	at org.apache.maven.surefire.booter.ForkedBooter.runSuitesInProcess(ForkedBooter.java:115)
[INFO] 	at org.apache.maven.surefire.booter.ForkedBooter.main(ForkedBooter.java:75)
[INFO] 15:22:28,341 DEBUG [main] AxisConfiguration:486 - Adding service to allServices map: [GazelleTRMService1523539348302_2] 
[INFO] 15:22:28,342 DEBUG [main] AxisOperation:567 - AxisOperation::getSoapAction urn:anonRobustOp
[INFO] 15:22:28,342 DEBUG [main] AxisOperation:567 - AxisOperation::getSoapAction urn:anonOutonlyOp
[INFO] 15:22:28,342 DEBUG [main] AxisOperation:567 - AxisOperation::getSoapAction urn:getSystemIsATool
[INFO] 15:22:28,342 DEBUG [main] AxisOperation:567 - AxisOperation::getSoapAction urn:anonOutInOp
[INFO] 15:22:28,343 DEBUG [main] AxisOperation:567 - AxisOperation::getSoapAction urn:getTestInstancesByTestingSession
[INFO] 15:22:28,343 DEBUG [main] AxisOperation:567 - AxisOperation::getSoapAction urn:getTestInstanceById
[INFO] 15:22:28,343 DEBUG [main] AxisOperation:567 - AxisOperation::getSoapAction urn:anonRobustOp
[INFO] 15:22:28,343 DEBUG [main] AxisOperation:567 - AxisOperation::getSoapAction urn:anonOutonlyOp
[INFO] 15:22:28,343 DEBUG [main] AxisOperation:567 - AxisOperation::getSoapAction urn:getSystemIsATool
[INFO] 15:22:28,344 DEBUG [main] AxisOperation:567 - AxisOperation::getSoapAction urn:anonOutInOp
[INFO] 15:22:28,344 DEBUG [main] AxisOperation:567 - AxisOperation::getSoapAction urn:getTestInstancesByTestingSession
[INFO] 15:22:28,344 DEBUG [main] AxisOperation:567 - AxisOperation::getSoapAction urn:getTestInstanceById
[INFO] 15:22:28,345 DEBUG [main] AxisConfiguration:396 - Adding service to allEndpoints map: (GazelleTRMService1523539348302_2,GazelleTRMService1523539348302_2HttpEndpoint) 
[INFO] 15:22:28,345 DEBUG [main] AxisConfiguration:396 - Adding service to allEndpoints map: (GazelleTRMService1523539348302_2,GazelleTRMService1523539348302_2HttpSoap11Endpoint) 
[INFO] 15:22:28,345 DEBUG [main] AxisConfiguration:396 - Adding service to allEndpoints map: (GazelleTRMService1523539348302_2,GazelleTRMService1523539348302_2HttpSoap12Endpoint) 
[INFO] 15:22:28,345 DEBUG [main] AxisConfiguration:403 - After adding to allEndpoints map, size is 3
[INFO] 15:22:28,351 DEBUG [main] AxisService:1971 - Get operation for {http://trm.ws.gazelletest.tm.gazelle.ihe.net/}getTestInstanceById
[INFO] 15:22:28,354 DEBUG [main] AxisService:2014 - Found axis operation:  org.apache.axis2.description.OutInAxisOperation@2df6226d
[INFO] 15:22:28,354 DEBUG [main] Options:589 - setAction Old action is (null)
[INFO] 15:22:28,354 DEBUG [main] Options:590 - setAction New action is (http://trm.ws.gazelletest.tm.gazelle.ihe.net/gazelleTRM/getTestInstanceById)
[INFO] 15:22:28,355 DEBUG [main] ConfigurationContext:85 - registerOperationContext (false): org.apache.axis2.context.OperationContext@93cf163 with key: urn:uuid:3aafe347-d7cb-47f1-93d6-5fd5a087c50f
[INFO] 15:22:28,355 DEBUG [main] OutInAxisOperationClient:164 - Entry: OutInAxisOperationClient::execute, true
[INFO] 15:22:28,355 DEBUG [main] Options:246 - getAction (null) from org.apache.axis2.client.Options@25bfcafd
[INFO] 15:22:28,356 DEBUG [main] MessageContext:1119 - SoapAction is (null)
[INFO] 15:22:28,356 DEBUG [main] Options:246 - getAction (http://trm.ws.gazelletest.tm.gazelle.ihe.net/gazelleTRM/getTestInstanceById) from org.apache.axis2.client.Options@2a76840c
[INFO] 15:22:28,359 DEBUG [main] Options:246 - getAction (null) from org.apache.axis2.client.Options@25bfcafd
[INFO] 15:22:28,359 DEBUG [main] MessageContext:1524 - Old SoapAction is (null)
[INFO] 15:22:28,359 DEBUG [main] MessageContext:1525 - New SoapAction is (http://trm.ws.gazelletest.tm.gazelle.ihe.net/gazelleTRM/getTestInstanceById)
[INFO] 15:22:28,359 DEBUG [main] Options:589 - setAction Old action is (null)
[INFO] 15:22:28,360 DEBUG [main] Options:590 - setAction New action is (http://trm.ws.gazelletest.tm.gazelle.ihe.net/gazelleTRM/getTestInstanceById)
[INFO] 15:22:28,360 DEBUG [main] OutInAxisOperationClient:194 - OutInAxisOperationClient: useAsyncOption null
[INFO] 15:22:28,360 DEBUG [main] ConfigurationContext:85 - registerOperationContext (false): org.apache.axis2.context.OperationContext@93cf163 with key: urn:uuid:3aafe347-d7cb-47f1-93d6-5fd5a087c50f
[INFO] 15:22:28,360 DEBUG [main] Options:246 - getAction (http://trm.ws.gazelletest.tm.gazelle.ihe.net/gazelleTRM/getTestInstanceById) from org.apache.axis2.client.Options@25bfcafd
[INFO] 15:22:28,360 DEBUG [main] MessageContext:1154 - WASAction is (http://trm.ws.gazelletest.tm.gazelle.ihe.net/gazelleTRM/getTestInstanceById)
[INFO] 15:22:28,361 DEBUG [main] ConfigurationContext:85 - msgContext: [MessageContext: logID=bf99648540d7ac89cb8aa7eea8557996118bb24f72781510] action: http://trm.ws.gazelletest.tm.gazelle.ihe.net/gazelleTRM/getTestInstanceById
[INFO] 15:22:28,361 DEBUG [main] Phase:289 - [MessageContext: logID=bf99648540d7ac89cb8aa7eea8557996118bb24f72781510] Checking pre-condition for Phase "RMPhase"
[INFO] 15:22:28,361 DEBUG [main] Phase:300 - [MessageContext: logID=bf99648540d7ac89cb8aa7eea8557996118bb24f72781510] Invoking phase "RMPhase"
[INFO] 15:22:28,361 DEBUG [main] Phase:319 - [MessageContext: logID=bf99648540d7ac89cb8aa7eea8557996118bb24f72781510] Checking post-conditions for phase "RMPhase"
[INFO] 15:22:28,362 DEBUG [main] Phase:289 - [MessageContext: logID=bf99648540d7ac89cb8aa7eea8557996118bb24f72781510] Checking pre-condition for Phase "OpPhase"
[INFO] 15:22:28,362 DEBUG [main] Phase:300 - [MessageContext: logID=bf99648540d7ac89cb8aa7eea8557996118bb24f72781510] Invoking phase "OpPhase"
[INFO] 15:22:28,362 DEBUG [main] Phase:319 - [MessageContext: logID=bf99648540d7ac89cb8aa7eea8557996118bb24f72781510] Checking post-conditions for phase "OpPhase"
[INFO] 15:22:28,362 DEBUG [main] Phase:289 - [MessageContext: logID=bf99648540d7ac89cb8aa7eea8557996118bb24f72781510] Checking pre-condition for Phase "OperationOutPhase"
[INFO] 15:22:28,362 DEBUG [main] Phase:300 - [MessageContext: logID=bf99648540d7ac89cb8aa7eea8557996118bb24f72781510] Invoking phase "OperationOutPhase"
[INFO] 15:22:28,363 DEBUG [main] Phase:319 - [MessageContext: logID=bf99648540d7ac89cb8aa7eea8557996118bb24f72781510] Checking post-conditions for phase "OperationOutPhase"
[INFO] 15:22:28,363 DEBUG [main] Phase:289 - [MessageContext: logID=bf99648540d7ac89cb8aa7eea8557996118bb24f72781510] Checking pre-condition for Phase "PolicyDetermination"
[INFO] 15:22:28,363 DEBUG [main] Phase:300 - [MessageContext: logID=bf99648540d7ac89cb8aa7eea8557996118bb24f72781510] Invoking phase "PolicyDetermination"
[INFO] 15:22:28,363 DEBUG [main] Phase:319 - [MessageContext: logID=bf99648540d7ac89cb8aa7eea8557996118bb24f72781510] Checking post-conditions for phase "PolicyDetermination"
[INFO] 15:22:28,363 DEBUG [main] Phase:289 - [MessageContext: logID=bf99648540d7ac89cb8aa7eea8557996118bb24f72781510] Checking pre-condition for Phase "MessageOut"
[INFO] 15:22:28,364 DEBUG [main] Phase:300 - [MessageContext: logID=bf99648540d7ac89cb8aa7eea8557996118bb24f72781510] Invoking phase "MessageOut"
[INFO] 15:22:28,364 DEBUG [main] Phase:319 - [MessageContext: logID=bf99648540d7ac89cb8aa7eea8557996118bb24f72781510] Checking post-conditions for phase "MessageOut"
[INFO] 15:22:28,364 DEBUG [main] Phase:289 - [MessageContext: logID=bf99648540d7ac89cb8aa7eea8557996118bb24f72781510] Checking pre-condition for Phase "Security"
[INFO] 15:22:28,364 DEBUG [main] Phase:300 - [MessageContext: logID=bf99648540d7ac89cb8aa7eea8557996118bb24f72781510] Invoking phase "Security"
[INFO] 15:22:28,364 DEBUG [main] Phase:319 - [MessageContext: logID=bf99648540d7ac89cb8aa7eea8557996118bb24f72781510] Checking post-conditions for phase "Security"
[INFO] 15:22:28,365 DEBUG [main] DefaultHttpParams:151 - Set parameter http.connection-manager.timeout = 30000
[INFO] 15:22:28,365 DEBUG [main] DefaultHttpParams:151 - Set parameter http.connection.timeout = 60000
[INFO] 15:22:28,366 DEBUG [main] DefaultHttpParams:151 - Set parameter http.socket.timeout = 60000
[INFO] 15:22:28,366 DEBUG [main] DefaultHttpParams:151 - Set parameter http.socket.timeout = 60000
[INFO] 15:22:28,366 DEBUG [main] OMOutputFormat:196 - Start getContentType: OMOutputFormat [ mimeBoundary =null rootContentId=null doOptimize=false doingSWA=false isSOAP11=true charSetEncoding=UTF-8 xmlVersion=null contentType=null ignoreXmlDeclaration=false autoCloseWriter=false actionProperty=null optimizedThreshold=0]
[INFO] 15:22:28,366 DEBUG [main] OMOutputFormat:215 - getContentType= {text/xml}   OMOutputFormat [ mimeBoundary =null rootContentId=null doOptimize=false doingSWA=false isSOAP11=true charSetEncoding=UTF-8 xmlVersion=null contentType=text/xml ignoreXmlDeclaration=false autoCloseWriter=false actionProperty=null optimizedThreshold=0]
[INFO] 15:22:28,367 DEBUG [main] SOAPMessageFormatter:123 - contentType from the OMOutputFormat =text/xml
[INFO] 15:22:28,367 DEBUG [main] SOAPMessageFormatter:148 - contentType returned =text/xml; charset=UTF-8
[INFO] 15:22:28,368 DEBUG [main] DefaultHttpParams:151 - Set parameter http.connection.timeout = 60000
[INFO] 15:22:28,368 DEBUG [main] DefaultHttpParams:151 - Set parameter http.socket.timeout = 60000
[INFO] 15:22:28,368 DEBUG [main] MultiThreadedHttpConnectionManager:412 - HttpConnectionManager.getConnection:  config = HostConfiguration[host=https://gazelle.ihe.net], timeout = 30000
[INFO] 15:22:28,368 DEBUG [main] MultiThreadedHttpConnectionManager:760 - Allocating new connection, hostConfig=HostConfiguration[host=https://gazelle.ihe.net]
[INFO] 15:22:28,369 DEBUG [main] HttpConnection:692 - Open connection to gazelle.ihe.net:443
[INFO] 15:22:28,370 DEBUG [main] header:70 - >> "POST //gazelle-tm-ejb/GazelleTRMService/gazelleTRM HTTP/1.1[\r][\n]"
[INFO] 15:22:28,370 DEBUG [main] HttpMethodBase:1352 - Adding Host request header
[INFO] 15:22:28,370 DEBUG [main] header:70 - >> "Content-Type: text/xml; charset=UTF-8[\r][\n]"
[INFO] 15:22:28,371 DEBUG [main] header:70 - >> "SOAPAction: ""[\r][\n]"
[INFO] 15:22:28,371 DEBUG [main] header:70 - >> "User-Agent: Axis2[\r][\n]"
[INFO] 15:22:28,371 DEBUG [main] header:70 - >> "Host: gazelle.ihe.net[\r][\n]"
[INFO] 15:22:28,371 DEBUG [main] header:70 - >> "Transfer-Encoding: chunked[\r][\n]"
[INFO] 15:22:28,372 DEBUG [main] header:70 - >> "[\r][\n]"
[INFO] 15:22:28,372 DEBUG [main] SOAPMessageFormatter:51 - start writeTo()
[INFO] 15:22:28,372 DEBUG [main] SOAPMessageFormatter:52 -   preserve=false
[INFO] 15:22:28,372 DEBUG [main] SOAPMessageFormatter:53 -   isOptimized=false
[INFO] 15:22:28,373 DEBUG [main] SOAPMessageFormatter:54 -   isDoingSWA=false
[INFO] 15:22:28,373 DEBUG [main] MTOMXMLStreamWriter:130 - Creating MTOMXMLStreamWriter
[INFO] 15:22:28,373 DEBUG [main] MTOMXMLStreamWriter:131 - OutputStream =class org.apache.commons.httpclient.ChunkedOutputStream
[INFO] 15:22:28,373 DEBUG [main] MTOMXMLStreamWriter:132 - OMFormat = OMOutputFormat [ mimeBoundary =null rootContentId=null doOptimize=false doingSWA=false isSOAP11=true charSetEncoding=UTF-8 xmlVersion=null contentType=text/xml ignoreXmlDeclaration=false autoCloseWriter=false actionProperty=null optimizedThreshold=0]
[INFO] 15:22:28,373 DEBUG [main] MTOMXMLStreamWriter:133 - preserveAttachments = false
[INFO] 15:22:28,374 DEBUG [main] StAXUtils:344 - XMLStreamWriter is org.apache.axiom.util.stax.dialect.Woodstox4StreamWriterWrapper
[INFO] 15:22:28,374 DEBUG [main] MTOMXMLStreamWriter:230 - Calling MTOMXMLStreamWriter.flush
[INFO] 15:22:28,391 DEBUG [main] SOAPEnvelopeImpl:180 - Could not close builder or parser due to:
[INFO] 15:22:28,391 DEBUG [main] SOAPEnvelopeImpl:182 - builder is null
[INFO] 15:22:28,391 DEBUG [main] MTOMXMLStreamWriter:219 - close
[INFO] 15:22:28,391 DEBUG [main] MTOMXMLStreamWriter:230 - Calling MTOMXMLStreamWriter.flush
[INFO] 15:22:28,391 DEBUG [main] SOAPMessageFormatter:81 - end writeTo()
[INFO] 15:22:28,392 DEBUG [main] content:70 - >> "146[\r][\n]"
[INFO] 15:22:28,392 DEBUG [main] content:84 - >> "<?xml version='1.0' encoding='UTF-8'?><soapenv:Envelope xmlns:soapenv="http://schemas.xmlsoap.org/soap/envelope/"><soapenv:Header/><soapenv:Body><ns1:getTestInstanceById xmlns:ns1="http://trm.ws.gazelletest.tm.gazelle.ihe.net/"><testInstanceId>56342</testInstanceId></ns1:getTestInstanceById></soapenv:Body></soapenv:Envelope>"
[INFO] 15:22:28,392 DEBUG [main] content:70 - >> "[\r][\n]"
[INFO] 15:22:28,392 DEBUG [main] content:84 - >> "0"
[INFO] 15:22:28,392 DEBUG [main] content:70 - >> "[\r][\n]"
[INFO] 15:22:28,392 DEBUG [main] content:70 - >> "[\r][\n]"
[INFO] 15:22:28,393 DEBUG [main] EntityEnclosingMethod:508 - Request body sent
[INFO] 15:22:28,595 DEBUG [main] header:70 - << "HTTP/1.1 200 OK[\r][\n]"
[INFO] 15:22:28,596 DEBUG [main] header:70 - << "HTTP/1.1 200 OK[\r][\n]"
[INFO] 15:22:28,596 DEBUG [main] header:70 - << "Date: Thu, 12 Apr 2018 13:22:28 GMT[\r][\n]"
[INFO] 15:22:28,596 DEBUG [main] header:70 - << "Server: Apache[\r][\n]"
[INFO] 15:22:28,596 DEBUG [main] header:70 - << "Strict-Transport-Security: max-age=63072000; includeSubdomains;[\r][\n]"
[INFO] 15:22:28,596 DEBUG [main] header:70 - << "Content-Type: text/xml;charset=UTF-8[\r][\n]"
[INFO] 15:22:28,597 DEBUG [main] header:70 - << "Content-Length: 5637[\r][\n]"
[INFO] 15:22:28,597 DEBUG [main] header:70 - << "Vary: Accept-Encoding[\r][\n]"
[INFO] 15:22:28,597 DEBUG [main] header:70 - << "X-Frame-Options: sameorigin[\r][\n]"
[INFO] 15:22:28,597 DEBUG [main] header:70 - << "[\r][\n]"
[INFO] 15:22:28,597 DEBUG [main] Phase:340 - [MessageContext: logID=bf99648540d7ac89cb8aa7eea8557996118bb24f72781510] Invoking flowComplete() in Phase "Security"
[INFO] 15:22:28,597 DEBUG [main] Phase:340 - [MessageContext: logID=bf99648540d7ac89cb8aa7eea8557996118bb24f72781510] Invoking flowComplete() in Phase "MessageOut"
[INFO] 15:22:28,598 DEBUG [main] Phase:340 - [MessageContext: logID=bf99648540d7ac89cb8aa7eea8557996118bb24f72781510] Invoking flowComplete() in Phase "PolicyDetermination"
[INFO] 15:22:28,598 DEBUG [main] Phase:340 - [MessageContext: logID=bf99648540d7ac89cb8aa7eea8557996118bb24f72781510] Invoking flowComplete() in Phase "OperationOutPhase"
[INFO] 15:22:28,598 DEBUG [main] Phase:340 - [MessageContext: logID=bf99648540d7ac89cb8aa7eea8557996118bb24f72781510] Invoking flowComplete() in Phase "OpPhase"
[INFO] 15:22:28,598 DEBUG [main] Phase:340 - [MessageContext: logID=bf99648540d7ac89cb8aa7eea8557996118bb24f72781510] Invoking flowComplete() in Phase "RMPhase"
[INFO] 15:22:28,598 DEBUG [main] Options:246 - getAction (http://trm.ws.gazelletest.tm.gazelle.ihe.net/gazelleTRM/getTestInstanceById) from org.apache.axis2.client.Options@2a76840c
[INFO] 15:22:28,598 DEBUG [main] MessageContext:1524 - Old SoapAction is (http://trm.ws.gazelletest.tm.gazelle.ihe.net/gazelleTRM/getTestInstanceById)
[INFO] 15:22:28,598 DEBUG [main] MessageContext:1525 - New SoapAction is (null)
[INFO] 15:22:28,598 DEBUG [main] Options:589 - setAction Old action is (null)
[INFO] 15:22:28,599 DEBUG [main] Options:590 - setAction New action is (null)
[INFO] 15:22:28,599 DEBUG [main] Options:246 - getAction (http://trm.ws.gazelletest.tm.gazelle.ihe.net/gazelleTRM/getTestInstanceById) from org.apache.axis2.client.Options@2a76840c
[INFO] 15:22:28,599 DEBUG [main] MessageContext:1119 - SoapAction is (http://trm.ws.gazelletest.tm.gazelle.ihe.net/gazelleTRM/getTestInstanceById)
[INFO] 15:22:28,599 DEBUG [main] TransportUtils:200 - createSOAPEnvelope using Builder (class org.apache.axis2.builder.SOAPBuilder) selected from type (text/xml)
[INFO] 15:22:28,601 DEBUG [main] content:70 - << "<soap:Envelope xmlns:soap="http://schemas.xmlsoap.org/soap/envelope/"><soap:Body><ns2:getTestInstanceByIdResponse xmlns:ns2="http://trm.ws.gazelletest.tm.gazelle.ihe.net/"><testInstance><id>56342</id><lastStatus>paused</lastStatus><participants><aipo><actor>REFERRAL_REQUESTER</actor><id>1840</id><integrationProfile>XBeR-WD</integrationProfile><integrationProfileOption>NONE</integrationProfileOption></aipo><roleInTestId>12580</roleInTestId><status>unverified</status><system>OTHER_VANAD Enovation</system><systemUsername>evermeulen</systemUsername></participants><test><id>12123</id><keyword>XBER_WD_10-Request</keyword><name>XBER / WD Request Referral</name><shortDescription>Referral Requestor Actor generates a Request Referral, then uploads XDW document to gazelle for evaluation.</shortDescription><testPeerType>NO_PEER_TEST</testPeerType><testStatus>ready</testStatus><testType>connectathon</testType><trmTestDescriptions><description>&lt;h2&gt;Special Instructions&lt;/h2&gt;[\n]"
[INFO] 15:22:28,601 DEBUG [main] content:70 - << "&lt;p&gt;&amp;nbsp;&lt;/p&gt;[\n]"
[INFO] 15:22:28,602 DEBUG [main] content:70 - << "&lt;div id="_mcePaste" style="position: absolute; left: -10000px; top: 0px; width: 1px; height: 1px; overflow: hidden;"&gt;Connectathon testers using XDS.b based XDW documents should use the Connectathon XDW registry/repository for testing.&lt;/div&gt;[\n]"
[INFO] 15:22:28,602 DEBUG [main] content:70 - << "&lt;div id="_mcePaste" style="position: absolute; left: -10000px; top: 0px; width: 1px; height: 1px; overflow: hidden;"&gt;Monitors will evaluate uploaded messages by downloading them to an XML viewer tool and visually identifying need components.&lt;/div&gt;[\n]"
[INFO] 15:22:28,602 DEBUG [main] content:70 - << "&lt;p&gt;&amp;nbsp;&lt;/p&gt;[\n]"
[INFO] 15:22:28,602 DEBUG [main] content:70 - << "&lt;ul&gt;[\n]"
[INFO] 15:22:28,602 DEBUG [main] content:70 - << "&lt;li&gt;Connectathon testers using XDS.b based XDW documents should use the Connectathon XDW registry/repository for testing.&lt;/li&gt;[\n]"
[INFO] 15:22:28,602 DEBUG [main] content:70 - << "&lt;li&gt;Monitors will evaluate uploaded messages by downloading them to an XML viewer tool and visually identifying need components.&lt;/li&gt;[\n]"
[INFO] 15:22:28,603 DEBUG [main] content:70 - << "&lt;/ul&gt;[\n]"
[INFO] 15:22:28,603 DEBUG [main] content:70 - << "&lt;h2&gt;Description&lt;/h2&gt;[\n]"
[INFO] 15:22:28,603 DEBUG [main] content:70 - << "&lt;p&gt;Tests the ability to generate a request for referral.&lt;/p&gt;[\n]"
[INFO] 15:22:28,603 DEBUG [main] content:70 - << "&lt;h2&gt;Evaluation&lt;/h2&gt;[\n]"
[INFO] 15:22:28,603 DEBUG [main] content:70 - << "&lt;p&gt;A connectathon Monitor will evaluate the uploaded XDW document, checking for a Request Referral task with:&lt;/p&gt;[\n]"
[INFO] 15:22:28,603 DEBUG [main] content:70 - << "&lt;ul&gt;[\n]"
[INFO] 15:22:28,604 DEBUG [main] content:70 - << "&lt;li&gt;taskType &amp;nbsp; &amp;nbsp; &amp;nbsp; &amp;nbsp;Request Referral&amp;nbsp;&lt;/li&gt;[\n]"
[INFO] 15:22:28,604 DEBUG [main] content:70 - << "&lt;li&gt;taskName &amp;nbsp; &amp;nbsp; &amp;nbsp; &amp;nbsp;RequestReferral&lt;/li&gt;[\n]"
[INFO] 15:22:28,604 DEBUG [main] content:70 - << "&lt;li&gt;status &amp;nbsp; &amp;nbsp; &amp;nbsp; &amp;nbsp; &amp;nbsp;COMPLETED&lt;/li&gt;[\n]"
[INFO] 15:22:28,604 DEBUG [main] content:70 - << "&lt;li&gt;Optional input of medical record(s)&lt;/li&gt;[\n]"
[INFO] 15:22:28,604 DEBUG [main] content:70 - << "&lt;li&gt;No ancestor tasks in input&lt;/li&gt;[\n]"
[INFO] 15:22:28,604 DEBUG [main] content:70 - << "&lt;li&gt;Required output of an eReferral&lt;/li&gt;[\n]"
[INFO] 15:22:28,605 DEBUG [main] content:70 - << "&lt;/ul&gt;[\n]"
[INFO] 15:22:28,605 DEBUG [main] content:84 - << "&lt;p&gt;&amp;nbsp;&lt;/p&gt;</description><language>English</language></trmTestDescriptions><trmTestRoles><cardMax>1</cardMax><cardMin>1</cardMin><id>2131396</id><roleInTest><aipos><actor>REFERRAL_REQUESTER</actor><id>1840</id><integrationProfile>XBeR-WD</integrationProfile><integrationProfileOption>NONE</integrationProfileOption></aipos><id>12580</id><keyword>REFERRAL_REQUESTER-XBeR-WD</keyword></roleInTest><testOption>R</testOption></trmTestRoles><trmTestSteps><description>Use the gazelle patient generator to generate a new patient and ID. Use this patient as the subject for your work.</description><messageType>None</messageType><stepIndex>10</stepIndex><testRoleInitiatorId>2131396</testRoleInitiatorId><testRoleResponderId>2131396</testRoleResponderId><testStepOption>R</testStepOption></trmTestSteps><trmTestSteps><description>Create a referral request, including an XDW workflow document containing a Request Referral task in COMPLETED status and an eReferral output document</description><messageType>XDW Workflow Doc</messageType><stepIndex>20</stepIndex><testRoleInitiatorId>2131396</testRoleInitiatorId><testRoleResponderId>2131396</testRoleResponderId><testStepOption>R</testStepOption></trmTestSteps><trmTestSteps><description>Enter the Referral Request UID, the Patient ID, and the Patient Name in the test chat area.</description><messageType>None</messageType><stepIndex>30</stepInde"
[INFO] 15:22:28,605 DEBUG [main] StAXUtils:194 - XMLStreamReader is org.apache.axiom.util.stax.dialect.Woodstox4StreamReaderWrapper
[INFO] 15:22:28,605 DEBUG [main] StAXSOAPModelBuilder:210 - Starting to process SOAP 1.1 message
[INFO] 15:22:28,606 DEBUG [main] StAXOMBuilder:696 - Performing look-ahead; START_ELEMENT found
[INFO] 15:22:28,606 DEBUG [main] Phase:289 - [MessageContext: logID=af99648540d7ac89cb8aa7eea8557996118bb24f72781510] Checking pre-condition for Phase "Transport"
[INFO] 15:22:28,606 DEBUG [main] Phase:300 - [MessageContext: logID=af99648540d7ac89cb8aa7eea8557996118bb24f72781510] Invoking phase "Transport"
[INFO] 15:22:28,606 DEBUG [main] Phase:331 - [MessageContext: logID=af99648540d7ac89cb8aa7eea8557996118bb24f72781510] Invoking Handler 'RequestURIBasedDispatcher' in Phase 'Transport'
[INFO] 15:22:28,606 DEBUG [main] Phase:331 - [MessageContext: logID=af99648540d7ac89cb8aa7eea8557996118bb24f72781510] Invoking Handler 'SOAPActionBasedDispatcher' in Phase 'Transport'
[INFO] 15:22:28,607 DEBUG [main] Phase:319 - [MessageContext: logID=af99648540d7ac89cb8aa7eea8557996118bb24f72781510] Checking post-conditions for phase "Transport"
[INFO] 15:22:28,607 DEBUG [main] Phase:289 - [MessageContext: logID=af99648540d7ac89cb8aa7eea8557996118bb24f72781510] Checking pre-condition for Phase "Addressing"
[INFO] 15:22:28,607 DEBUG [main] Phase:300 - [MessageContext: logID=af99648540d7ac89cb8aa7eea8557996118bb24f72781510] Invoking phase "Addressing"
[INFO] 15:22:28,607 DEBUG [main] Phase:331 - [MessageContext: logID=af99648540d7ac89cb8aa7eea8557996118bb24f72781510] Invoking Handler 'AddressingBasedDispatcher' in Phase 'Addressing'
[INFO] 15:22:28,607 DEBUG [main] Phase:319 - [MessageContext: logID=af99648540d7ac89cb8aa7eea8557996118bb24f72781510] Checking post-conditions for phase "Addressing"
[INFO] 15:22:28,607 DEBUG [main] Phase:289 - [MessageContext: logID=af99648540d7ac89cb8aa7eea8557996118bb24f72781510] Checking pre-condition for Phase "Security"
[INFO] 15:22:28,607 DEBUG [main] Phase:300 - [MessageContext: logID=af99648540d7ac89cb8aa7eea8557996118bb24f72781510] Invoking phase "Security"
[INFO] 15:22:28,607 DEBUG [main] Phase:319 - [MessageContext: logID=af99648540d7ac89cb8aa7eea8557996118bb24f72781510] Checking post-conditions for phase "Security"
[INFO] 15:22:28,608 DEBUG [main] Phase:289 - [MessageContext: logID=af99648540d7ac89cb8aa7eea8557996118bb24f72781510] Checking pre-condition for Phase "PreDispatch"
[INFO] 15:22:28,608 DEBUG [main] Phase:300 - [MessageContext: logID=af99648540d7ac89cb8aa7eea8557996118bb24f72781510] Invoking phase "PreDispatch"
[INFO] 15:22:28,608 DEBUG [main] Phase:319 - [MessageContext: logID=af99648540d7ac89cb8aa7eea8557996118bb24f72781510] Checking post-conditions for phase "PreDispatch"
[INFO] 15:22:28,608 DEBUG [main] Phase:289 - [MessageContext: logID=af99648540d7ac89cb8aa7eea8557996118bb24f72781510] Checking pre-condition for Phase "Dispatch"
[INFO] 15:22:28,608 DEBUG [main] Phase:300 - [MessageContext: logID=af99648540d7ac89cb8aa7eea8557996118bb24f72781510] Invoking phase "Dispatch"
[INFO] 15:22:28,608 DEBUG [main] Phase:331 - [MessageContext: logID=af99648540d7ac89cb8aa7eea8557996118bb24f72781510] Invoking Handler 'RequestURIBasedDispatcher' in Phase 'Dispatch'
[INFO] 15:22:28,608 DEBUG [main] Phase:331 - [MessageContext: logID=af99648540d7ac89cb8aa7eea8557996118bb24f72781510] Invoking Handler 'SOAPActionBasedDispatcher' in Phase 'Dispatch'
[INFO] 15:22:28,608 DEBUG [main] Phase:331 - [MessageContext: logID=af99648540d7ac89cb8aa7eea8557996118bb24f72781510] Invoking Handler 'RequestURIOperationDispatcher' in Phase 'Dispatch'
[INFO] 15:22:28,608 DEBUG [main] Phase:331 - [MessageContext: logID=af99648540d7ac89cb8aa7eea8557996118bb24f72781510] Invoking Handler 'SOAPMessageBodyBasedDispatcher' in Phase 'Dispatch'
[INFO] 15:22:28,609 DEBUG [main] Phase:331 - [MessageContext: logID=af99648540d7ac89cb8aa7eea8557996118bb24f72781510] Invoking Handler 'HTTPLocationBasedDispatcher' in Phase 'Dispatch'
[INFO] 15:22:28,609 DEBUG [main] Phase:319 - [MessageContext: logID=af99648540d7ac89cb8aa7eea8557996118bb24f72781510] Checking post-conditions for phase "Dispatch"
[INFO] 15:22:28,609 DEBUG [main] AddressingHelper:102 - [MessageContext: logID=af99648540d7ac89cb8aa7eea8557996118bb24f72781510] isReplyRedirected: ReplyTo is null. Returning false
[INFO] 15:22:28,609 DEBUG [main] Phase:289 - [MessageContext: logID=af99648540d7ac89cb8aa7eea8557996118bb24f72781510] Checking pre-condition for Phase "RMPhase"
[INFO] 15:22:28,609 DEBUG [main] Phase:300 - [MessageContext: logID=af99648540d7ac89cb8aa7eea8557996118bb24f72781510] Invoking phase "RMPhase"
[INFO] 15:22:28,609 DEBUG [main] Phase:319 - [MessageContext: logID=af99648540d7ac89cb8aa7eea8557996118bb24f72781510] Checking post-conditions for phase "RMPhase"
[INFO] 15:22:28,609 DEBUG [main] Phase:289 - [MessageContext: logID=af99648540d7ac89cb8aa7eea8557996118bb24f72781510] Checking pre-condition for Phase "OpPhase"
[INFO] 15:22:28,609 DEBUG [main] Phase:300 - [MessageContext: logID=af99648540d7ac89cb8aa7eea8557996118bb24f72781510] Invoking phase "OpPhase"
[INFO] 15:22:28,610 DEBUG [main] Phase:319 - [MessageContext: logID=af99648540d7ac89cb8aa7eea8557996118bb24f72781510] Checking post-conditions for phase "OpPhase"
[INFO] 15:22:28,610 DEBUG [main] Phase:289 - [MessageContext: logID=af99648540d7ac89cb8aa7eea8557996118bb24f72781510] Checking pre-condition for Phase "OperationInPhase"
[INFO] 15:22:28,610 DEBUG [main] Phase:300 - [MessageContext: logID=af99648540d7ac89cb8aa7eea8557996118bb24f72781510] Invoking phase "OperationInPhase"
[INFO] 15:22:28,610 DEBUG [main] Phase:319 - [MessageContext: logID=af99648540d7ac89cb8aa7eea8557996118bb24f72781510] Checking post-conditions for phase "OperationInPhase"
[INFO] 15:22:28,610 DEBUG [main] Phase:340 - [MessageContext: logID=af99648540d7ac89cb8aa7eea8557996118bb24f72781510] Invoking flowComplete() in Phase "OperationInPhase"
[INFO] 15:22:28,610 DEBUG [main] Phase:340 - [MessageContext: logID=af99648540d7ac89cb8aa7eea8557996118bb24f72781510] Invoking flowComplete() in Phase "OpPhase"
[INFO] 15:22:28,610 DEBUG [main] Phase:340 - [MessageContext: logID=af99648540d7ac89cb8aa7eea8557996118bb24f72781510] Invoking flowComplete() in Phase "RMPhase"
[INFO] 15:22:28,611 DEBUG [main] Phase:340 - [MessageContext: logID=af99648540d7ac89cb8aa7eea8557996118bb24f72781510] Invoking flowComplete() in Phase "Dispatch"
[INFO] 15:22:28,611 DEBUG [main] Phase:359 - [MessageContext: logID=af99648540d7ac89cb8aa7eea8557996118bb24f72781510] Invoking flowComplete() for Handler 'HTTPLocationBasedDispatcher' in Phase 'Dispatch'
[INFO] 15:22:28,611 DEBUG [main] Phase:359 - [MessageContext: logID=af99648540d7ac89cb8aa7eea8557996118bb24f72781510] Invoking flowComplete() for Handler 'SOAPMessageBodyBasedDispatcher' in Phase 'Dispatch'
[INFO] 15:22:28,611 DEBUG [main] Phase:359 - [MessageContext: logID=af99648540d7ac89cb8aa7eea8557996118bb24f72781510] Invoking flowComplete() for Handler 'RequestURIOperationDispatcher' in Phase 'Dispatch'
[INFO] 15:22:28,611 DEBUG [main] Phase:359 - [MessageContext: logID=af99648540d7ac89cb8aa7eea8557996118bb24f72781510] Invoking flowComplete() for Handler 'SOAPActionBasedDispatcher' in Phase 'Dispatch'
[INFO] 15:22:28,611 DEBUG [main] Phase:359 - [MessageContext: logID=af99648540d7ac89cb8aa7eea8557996118bb24f72781510] Invoking flowComplete() for Handler 'RequestURIBasedDispatcher' in Phase 'Dispatch'
[INFO] 15:22:28,611 DEBUG [main] Phase:340 - [MessageContext: logID=af99648540d7ac89cb8aa7eea8557996118bb24f72781510] Invoking flowComplete() in Phase "PreDispatch"
[INFO] 15:22:28,611 DEBUG [main] Phase:340 - [MessageContext: logID=af99648540d7ac89cb8aa7eea8557996118bb24f72781510] Invoking flowComplete() in Phase "Security"
[INFO] 15:22:28,611 DEBUG [main] Phase:340 - [MessageContext: logID=af99648540d7ac89cb8aa7eea8557996118bb24f72781510] Invoking flowComplete() in Phase "Addressing"
[INFO] 15:22:28,612 DEBUG [main] Phase:359 - [MessageContext: logID=af99648540d7ac89cb8aa7eea8557996118bb24f72781510] Invoking flowComplete() for Handler 'AddressingBasedDispatcher' in Phase 'Addressing'
[INFO] 15:22:28,612 DEBUG [main] Phase:340 - [MessageContext: logID=af99648540d7ac89cb8aa7eea8557996118bb24f72781510] Invoking flowComplete() in Phase "Transport"
[INFO] 15:22:28,612 DEBUG [main] Phase:359 - [MessageContext: logID=af99648540d7ac89cb8aa7eea8557996118bb24f72781510] Invoking flowComplete() for Handler 'SOAPActionBasedDispatcher' in Phase 'Transport'
[INFO] 15:22:28,612 DEBUG [main] Phase:359 - [MessageContext: logID=af99648540d7ac89cb8aa7eea8557996118bb24f72781510] Invoking flowComplete() for Handler 'RequestURIBasedDispatcher' in Phase 'Transport'
[INFO] 15:22:28,612 DEBUG [main] StAXOMBuilder:648 - Consuming look-ahead token START_ELEMENT
[INFO] 15:22:28,613 DEBUG [main] PullSerializer:66 - Pull serializer created; initial state is org.apache.axiom.om.impl.common.serializer.pull.Navigator@47f4e407[cache=false,document=false]
[INFO] 15:22:28,614 DEBUG [main] StAXBuilder:575 - Caching disabled; current element level is 3
[INFO] 15:22:28,614 DEBUG [main] Navigator:661 - Switching to pull-through mode; first event is START_ELEMENT; depth is 1
[INFO] 15:22:28,614 DEBUG [main] PullSerializer:109 - Switching to state org.apache.axiom.om.impl.common.serializer.pull.PullThroughWrapper@6ff65192[reader=org.apache.axiom.util.stax.dialect.Woodstox4StreamReaderWrapper@2dd80673]
[INFO] 15:22:28,625 DEBUG [main] content:84 - << "x><testRoleInitiatorId>2131396</testRoleInitiatorId><testRoleResponderId>2131396</testRoleResponderId><testStepOption>R</testStepOption></trmTestSteps><trmTestSteps><description>Upload the XDW document to into the samples area of Gazelle.</description><messageType>XDW Workflow Doc</messageType><stepIndex>40</stepIndex><testRoleInitiatorId>2131396</testRoleInitiatorId><testRoleResponderId>2131396</testRoleResponderId><testStepOption>R</testStepOption></trmTestSteps><version>NA2014</version></test><testSteps><initiator>OTHER_VANAD Enovation</initiator><responder>OTHER_VANAD Enovation</responder><roleInTestInitId>12580</roleInTestInitId><roleInTestRespId>12580</roleInTestRespId><status2>activated</status2><testStepId>1501470</testStepId></testSteps><testSteps><initiator>OTHER_VANAD Enovation</initiator><responder>OTHER_VANAD Enovation</responder><roleInTestInitId>12580</roleInTestInitId><roleInTestRespId>12580</roleInTestRespId><status2>activated</status2><testStepId>1501471</testStepId></testSteps><testSteps><initiator>OTHER_VANAD Enovation</initiator><responder>OTHER_VANAD Enovation</responder><roleInTestInitId>12580</roleInTestInitId><roleInTestRespId>12580</roleInTestRespId><status2>activated</status2><testStepId>1501472</testStepId></testSteps><testSteps><initiator>OTHER_VANAD Enovation</initiator><responder>OTHER_VANAD Enovation</responder><roleInTestInitId>12580</roleInTestInitId><roleInTestRespId>12580</roleInTestRespId><status2>activated</status2><testStepId>1501473</testStepId></testSteps><testingSessionId>40</testingSessionId></testInstance></ns2:getTestInstanceByIdResponse></soap:Body></soap:Envelope>"
[INFO] 15:22:28,628 DEBUG [main] HttpMethodBase:1024 - Resorting to protocol version default close connection policy
[INFO] 15:22:28,628 DEBUG [main] HttpMethodBase:1028 - Should NOT close connection, using HTTP/1.1
[INFO] 15:22:28,628 DEBUG [main] HttpConnection:1178 - Releasing connection back to connection manager.
[INFO] 15:22:28,628 DEBUG [main] MultiThreadedHttpConnectionManager:979 - Freeing connection, hostConfig=HostConfiguration[host=https://gazelle.ihe.net]
[INFO] 15:22:28,628 DEBUG [main] IdleConnectionHandler:76 - Adding connection at: 1523539348628
[INFO] 15:22:28,628 DEBUG [main] MultiThreadedHttpConnectionManager:961 - Notifying no-one, there are no waiting threads
[INFO] Tests run: 2, Failures: 0, Errors: 0, Skipped: 0, Time elapsed: 1.493 sec
[INFO] 
[INFO] Results :
[INFO] 
[INFO] Tests run: 2, Failures: 0, Errors: 0, Skipped: 0
[INFO] 
[INFO] [INFO] 
[INFO] [INFO] --- maven-jar-plugin:2.4:jar (default-jar) @ GazelleTRMClient ---
[INFO] [INFO] Building jar: /home/jenkins/.hudson/jobs/GazelleTRMClient-SNAPSHOT/workspace/target/checkout/target/GazelleTRMClient-1.1.0.jar
[INFO] [INFO] 
[INFO] [INFO] >>> maven-source-plugin:3.0.1:jar (attach-sources) > generate-sources @ GazelleTRMClient >>>
[INFO] [INFO] 
[INFO] [INFO] --- axis2-wsdl2code-maven-plugin:1.7.6:wsdl2code (GazelleTRM) @ GazelleTRMClient ---
[INFO] Retrieving document at '/home/jenkins/.hudson/jobs/GazelleTRMClient-SNAPSHOT/workspace/target/checkout/src/main/wsdl/gazelleTRM.wsdl'.
[INFO] [INFO] 
[INFO] [INFO] <<< maven-source-plugin:3.0.1:jar (attach-sources) < generate-sources @ GazelleTRMClient <<<
[INFO] [INFO] 
[INFO] [INFO] 
[INFO] [INFO] --- maven-source-plugin:3.0.1:jar (attach-sources) @ GazelleTRMClient ---
[INFO] [INFO] Building jar: /home/jenkins/.hudson/jobs/GazelleTRMClient-SNAPSHOT/workspace/target/checkout/target/GazelleTRMClient-1.1.0-sources.jar
[INFO] [INFO] 
[INFO] [INFO] --- maven-javadoc-plugin:3.0.0:jar (attach-javadocs) @ GazelleTRMClient ---
[INFO] [WARNING] Source files encoding has not been set, using platform encoding UTF8, i.e. build is platform dependent!
[INFO] [INFO] 
[INFO] Loading source files for package net.ihe.gazelle.ws.client...
[INFO] Constructing Javadoc information...
[INFO] Standard Doclet version 1.8.0_161
[INFO] Building tree for all the packages and classes...
[INFO] Generating /home/jenkins/.hudson/jobs/GazelleTRMClient-SNAPSHOT/workspace/target/checkout/target/apidocs/net/ihe/gazelle/ws/client/GazelleTRMServiceCallbackHandler.html...
[INFO] Generating /home/jenkins/.hudson/jobs/GazelleTRMClient-SNAPSHOT/workspace/target/checkout/target/apidocs/net/ihe/gazelle/ws/client/GazelleTRMServiceClient.html...
[INFO] Generating /home/jenkins/.hudson/jobs/GazelleTRMClient-SNAPSHOT/workspace/target/checkout/target/apidocs/net/ihe/gazelle/ws/client/GazelleTRMServiceStub.html...
[INFO] Generating /home/jenkins/.hudson/jobs/GazelleTRMClient-SNAPSHOT/workspace/target/checkout/target/apidocs/net/ihe/gazelle/ws/client/GazelleTRMServiceStub.ExtensionMapper.html...
[INFO] Generating /home/jenkins/.hudson/jobs/GazelleTRMClient-SNAPSHOT/workspace/target/checkout/target/apidocs/net/ihe/gazelle/ws/client/GazelleTRMServiceStub.GetSystemIsATool.html...
[INFO] Generating /home/jenkins/.hudson/jobs/GazelleTRMClient-SNAPSHOT/workspace/target/checkout/target/apidocs/net/ihe/gazelle/ws/client/GazelleTRMServiceStub.GetSystemIsATool.Factory.html...
[INFO] Generating /home/jenkins/.hudson/jobs/GazelleTRMClient-SNAPSHOT/workspace/target/checkout/target/apidocs/net/ihe/gazelle/ws/client/GazelleTRMServiceStub.GetSystemIsAToolE.html...
[INFO] Generating /home/jenkins/.hudson/jobs/GazelleTRMClient-SNAPSHOT/workspace/target/checkout/target/apidocs/net/ihe/gazelle/ws/client/GazelleTRMServiceStub.GetSystemIsAToolE.Factory.html...
[INFO] Generating /home/jenkins/.hudson/jobs/GazelleTRMClient-SNAPSHOT/workspace/target/checkout/target/apidocs/net/ihe/gazelle/ws/client/GazelleTRMServiceStub.GetSystemIsAToolResponse.html...
[INFO] Generating /home/jenkins/.hudson/jobs/GazelleTRMClient-SNAPSHOT/workspace/target/checkout/target/apidocs/net/ihe/gazelle/ws/client/GazelleTRMServiceStub.GetSystemIsAToolResponse.Factory.html...
[INFO] Generating /home/jenkins/.hudson/jobs/GazelleTRMClient-SNAPSHOT/workspace/target/checkout/target/apidocs/net/ihe/gazelle/ws/client/GazelleTRMServiceStub.GetSystemIsAToolResponseE.html...
[INFO] Generating /home/jenkins/.hudson/jobs/GazelleTRMClient-SNAPSHOT/workspace/target/checkout/target/apidocs/net/ihe/gazelle/ws/client/GazelleTRMServiceStub.GetSystemIsAToolResponseE.Factory.html...
[INFO] Generating /home/jenkins/.hudson/jobs/GazelleTRMClient-SNAPSHOT/workspace/target/checkout/target/apidocs/net/ihe/gazelle/ws/client/GazelleTRMServiceStub.GetTestInstanceById.html...
[INFO] Generating /home/jenkins/.hudson/jobs/GazelleTRMClient-SNAPSHOT/workspace/target/checkout/target/apidocs/net/ihe/gazelle/ws/client/GazelleTRMServiceStub.GetTestInstanceById.Factory.html...
[INFO] Generating /home/jenkins/.hudson/jobs/GazelleTRMClient-SNAPSHOT/workspace/target/checkout/target/apidocs/net/ihe/gazelle/ws/client/GazelleTRMServiceStub.GetTestInstanceByIdE.html...
[INFO] Generating /home/jenkins/.hudson/jobs/GazelleTRMClient-SNAPSHOT/workspace/target/checkout/target/apidocs/net/ihe/gazelle/ws/client/GazelleTRMServiceStub.GetTestInstanceByIdE.Factory.html...
[INFO] Generating /home/jenkins/.hudson/jobs/GazelleTRMClient-SNAPSHOT/workspace/target/checkout/target/apidocs/net/ihe/gazelle/ws/client/GazelleTRMServiceStub.GetTestInstanceByIdResponse.html...
[INFO] Generating /home/jenkins/.hudson/jobs/GazelleTRMClient-SNAPSHOT/workspace/target/checkout/target/apidocs/net/ihe/gazelle/ws/client/GazelleTRMServiceStub.GetTestInstanceByIdResponse.Factory.html...
[INFO] Generating /home/jenkins/.hudson/jobs/GazelleTRMClient-SNAPSHOT/workspace/target/checkout/target/apidocs/net/ihe/gazelle/ws/client/GazelleTRMServiceStub.GetTestInstanceByIdResponseE.html...
[INFO] Generating /home/jenkins/.hudson/jobs/GazelleTRMClient-SNAPSHOT/workspace/target/checkout/target/apidocs/net/ihe/gazelle/ws/client/GazelleTRMServiceStub.GetTestInstanceByIdResponseE.Factory.html...
[INFO] Generating /home/jenkins/.hudson/jobs/GazelleTRMClient-SNAPSHOT/workspace/target/checkout/target/apidocs/net/ihe/gazelle/ws/client/GazelleTRMServiceStub.GetTestInstancesByTestingSession.html...
[INFO] Generating /home/jenkins/.hudson/jobs/GazelleTRMClient-SNAPSHOT/workspace/target/checkout/target/apidocs/net/ihe/gazelle/ws/client/GazelleTRMServiceStub.GetTestInstancesByTestingSession.Factory.html...
[INFO] Generating /home/jenkins/.hudson/jobs/GazelleTRMClient-SNAPSHOT/workspace/target/checkout/target/apidocs/net/ihe/gazelle/ws/client/GazelleTRMServiceStub.GetTestInstancesByTestingSessionE.html...
[INFO] Generating /home/jenkins/.hudson/jobs/GazelleTRMClient-SNAPSHOT/workspace/target/checkout/target/apidocs/net/ihe/gazelle/ws/client/GazelleTRMServiceStub.GetTestInstancesByTestingSessionE.Factory.html...
[INFO] Generating /home/jenkins/.hudson/jobs/GazelleTRMClient-SNAPSHOT/workspace/target/checkout/target/apidocs/net/ihe/gazelle/ws/client/GazelleTRMServiceStub.GetTestInstancesByTestingSessionResponse.html...
[INFO] Generating /home/jenkins/.hudson/jobs/GazelleTRMClient-SNAPSHOT/workspace/target/checkout/target/apidocs/net/ihe/gazelle/ws/client/GazelleTRMServiceStub.GetTestInstancesByTestingSessionResponse.Factory.html...
[INFO] Generating /home/jenkins/.hudson/jobs/GazelleTRMClient-SNAPSHOT/workspace/target/checkout/target/apidocs/net/ihe/gazelle/ws/client/GazelleTRMServiceStub.GetTestInstancesByTestingSessionResponseE.html...
[INFO] Generating /home/jenkins/.hudson/jobs/GazelleTRMClient-SNAPSHOT/workspace/target/checkout/target/apidocs/net/ihe/gazelle/ws/client/GazelleTRMServiceStub.GetTestInstancesByTestingSessionResponseE.Factory.html...
[INFO] Generating /home/jenkins/.hudson/jobs/GazelleTRMClient-SNAPSHOT/workspace/target/checkout/target/apidocs/net/ihe/gazelle/ws/client/GazelleTRMServiceStub.SOAPException.html...
[INFO] Generating /home/jenkins/.hudson/jobs/GazelleTRMClient-SNAPSHOT/workspace/target/checkout/target/apidocs/net/ihe/gazelle/ws/client/GazelleTRMServiceStub.SOAPException.Factory.html...
[INFO] Generating /home/jenkins/.hudson/jobs/GazelleTRMClient-SNAPSHOT/workspace/target/checkout/target/apidocs/net/ihe/gazelle/ws/client/GazelleTRMServiceStub.SOAPExceptionE.html...
[INFO] Generating /home/jenkins/.hudson/jobs/GazelleTRMClient-SNAPSHOT/workspace/target/checkout/target/apidocs/net/ihe/gazelle/ws/client/GazelleTRMServiceStub.SOAPExceptionE.Factory.html...
[INFO] Generating /home/jenkins/.hudson/jobs/GazelleTRMClient-SNAPSHOT/workspace/target/checkout/target/apidocs/net/ihe/gazelle/ws/client/GazelleTRMServiceStub.TrMaipo.html...
[INFO] Generating /home/jenkins/.hudson/jobs/GazelleTRMClient-SNAPSHOT/workspace/target/checkout/target/apidocs/net/ihe/gazelle/ws/client/GazelleTRMServiceStub.TrMaipo.Factory.html...
[INFO] Generating /home/jenkins/.hudson/jobs/GazelleTRMClient-SNAPSHOT/workspace/target/checkout/target/apidocs/net/ihe/gazelle/ws/client/GazelleTRMServiceStub.TrmChannelType.html...
[INFO] Generating /home/jenkins/.hudson/jobs/GazelleTRMClient-SNAPSHOT/workspace/target/checkout/target/apidocs/net/ihe/gazelle/ws/client/GazelleTRMServiceStub.TrmChannelType.Factory.html...
[INFO] Generating /home/jenkins/.hudson/jobs/GazelleTRMClient-SNAPSHOT/workspace/target/checkout/target/apidocs/net/ihe/gazelle/ws/client/GazelleTRMServiceStub.TrmConfiguration.html...
[INFO] Generating /home/jenkins/.hudson/jobs/GazelleTRMClient-SNAPSHOT/workspace/target/checkout/target/apidocs/net/ihe/gazelle/ws/client/GazelleTRMServiceStub.TrmConfiguration.Factory.html...
[INFO] Generating /home/jenkins/.hudson/jobs/GazelleTRMClient-SNAPSHOT/workspace/target/checkout/target/apidocs/net/ihe/gazelle/ws/client/GazelleTRMServiceStub.TrmParticipant.html...
[INFO] Generating /home/jenkins/.hudson/jobs/GazelleTRMClient-SNAPSHOT/workspace/target/checkout/target/apidocs/net/ihe/gazelle/ws/client/GazelleTRMServiceStub.TrmParticipant.Factory.html...
[INFO] Generating /home/jenkins/.hudson/jobs/GazelleTRMClient-SNAPSHOT/workspace/target/checkout/target/apidocs/net/ihe/gazelle/ws/client/GazelleTRMServiceStub.TrmRoleInTest.html...
[INFO] Generating /home/jenkins/.hudson/jobs/GazelleTRMClient-SNAPSHOT/workspace/target/checkout/target/apidocs/net/ihe/gazelle/ws/client/GazelleTRMServiceStub.TrmRoleInTest.Factory.html...
[INFO] Generating /home/jenkins/.hudson/jobs/GazelleTRMClient-SNAPSHOT/workspace/target/checkout/target/apidocs/net/ihe/gazelle/ws/client/GazelleTRMServiceStub.TrmShortTestInstance.html...
[INFO] Generating /home/jenkins/.hudson/jobs/GazelleTRMClient-SNAPSHOT/workspace/target/checkout/target/apidocs/net/ihe/gazelle/ws/client/GazelleTRMServiceStub.TrmShortTestInstance.Factory.html...
[INFO] Generating /home/jenkins/.hudson/jobs/GazelleTRMClient-SNAPSHOT/workspace/target/checkout/target/apidocs/net/ihe/gazelle/ws/client/GazelleTRMServiceStub.TrmTest.html...
[INFO] Generating /home/jenkins/.hudson/jobs/GazelleTRMClient-SNAPSHOT/workspace/target/checkout/target/apidocs/net/ihe/gazelle/ws/client/GazelleTRMServiceStub.TrmTest.Factory.html...
[INFO] Generating /home/jenkins/.hudson/jobs/GazelleTRMClient-SNAPSHOT/workspace/target/checkout/target/apidocs/net/ihe/gazelle/ws/client/GazelleTRMServiceStub.TrmTestDescription.html...
[INFO] Generating /home/jenkins/.hudson/jobs/GazelleTRMClient-SNAPSHOT/workspace/target/checkout/target/apidocs/net/ihe/gazelle/ws/client/GazelleTRMServiceStub.TrmTestDescription.Factory.html...
[INFO] Generating /home/jenkins/.hudson/jobs/GazelleTRMClient-SNAPSHOT/workspace/target/checkout/target/apidocs/net/ihe/gazelle/ws/client/GazelleTRMServiceStub.TrmTestInstance.html...
[INFO] Generating /home/jenkins/.hudson/jobs/GazelleTRMClient-SNAPSHOT/workspace/target/checkout/target/apidocs/net/ihe/gazelle/ws/client/GazelleTRMServiceStub.TrmTestInstance.Factory.html...
[INFO] Generating /home/jenkins/.hudson/jobs/GazelleTRMClient-SNAPSHOT/workspace/target/checkout/target/apidocs/net/ihe/gazelle/ws/client/GazelleTRMServiceStub.TrmTestInstances.html...
[INFO] Generating /home/jenkins/.hudson/jobs/GazelleTRMClient-SNAPSHOT/workspace/target/checkout/target/apidocs/net/ihe/gazelle/ws/client/GazelleTRMServiceStub.TrmTestInstances.Factory.html...
[INFO] Generating /home/jenkins/.hudson/jobs/GazelleTRMClient-SNAPSHOT/workspace/target/checkout/target/apidocs/net/ihe/gazelle/ws/client/GazelleTRMServiceStub.TrmTestRole.html...
[INFO] Generating /home/jenkins/.hudson/jobs/GazelleTRMClient-SNAPSHOT/workspace/target/checkout/target/apidocs/net/ihe/gazelle/ws/client/GazelleTRMServiceStub.TrmTestRole.Factory.html...
[INFO] Generating /home/jenkins/.hudson/jobs/GazelleTRMClient-SNAPSHOT/workspace/target/checkout/target/apidocs/net/ihe/gazelle/ws/client/GazelleTRMServiceStub.TrmTestStep.html...
[INFO] Generating /home/jenkins/.hudson/jobs/GazelleTRMClient-SNAPSHOT/workspace/target/checkout/target/apidocs/net/ihe/gazelle/ws/client/GazelleTRMServiceStub.TrmTestStep.Factory.html...
[INFO] Generating /home/jenkins/.hudson/jobs/GazelleTRMClient-SNAPSHOT/workspace/target/checkout/target/apidocs/net/ihe/gazelle/ws/client/GazelleTRMServiceStub.TrmTestStepInstance.html...
[INFO] Generating /home/jenkins/.hudson/jobs/GazelleTRMClient-SNAPSHOT/workspace/target/checkout/target/apidocs/net/ihe/gazelle/ws/client/GazelleTRMServiceStub.TrmTestStepInstance.Factory.html...
[INFO] Generating /home/jenkins/.hudson/jobs/GazelleTRMClient-SNAPSHOT/workspace/target/checkout/target/apidocs/net/ihe/gazelle/ws/client/SOAPExceptionException.html...
[INFO] Generating /home/jenkins/.hudson/jobs/GazelleTRMClient-SNAPSHOT/workspace/target/checkout/target/apidocs/net/ihe/gazelle/ws/client/package-frame.html...
[INFO] Generating /home/jenkins/.hudson/jobs/GazelleTRMClient-SNAPSHOT/workspace/target/checkout/target/apidocs/net/ihe/gazelle/ws/client/package-summary.html...
[INFO] Generating /home/jenkins/.hudson/jobs/GazelleTRMClient-SNAPSHOT/workspace/target/checkout/target/apidocs/net/ihe/gazelle/ws/client/package-tree.html...
[INFO] Generating /home/jenkins/.hudson/jobs/GazelleTRMClient-SNAPSHOT/workspace/target/checkout/target/apidocs/constant-values.html...
[INFO] Generating /home/jenkins/.hudson/jobs/GazelleTRMClient-SNAPSHOT/workspace/target/checkout/target/apidocs/serialized-form.html...
[INFO] Generating /home/jenkins/.hudson/jobs/GazelleTRMClient-SNAPSHOT/workspace/target/checkout/target/apidocs/net/ihe/gazelle/ws/client/class-use/GazelleTRMServiceCallbackHandler.html...
[INFO] Generating /home/jenkins/.hudson/jobs/GazelleTRMClient-SNAPSHOT/workspace/target/checkout/target/apidocs/net/ihe/gazelle/ws/client/class-use/GazelleTRMServiceStub.html...
[INFO] Generating /home/jenkins/.hudson/jobs/GazelleTRMClient-SNAPSHOT/workspace/target/checkout/target/apidocs/net/ihe/gazelle/ws/client/class-use/GazelleTRMServiceStub.TrmTestInstances.html...
[INFO] Generating /home/jenkins/.hudson/jobs/GazelleTRMClient-SNAPSHOT/workspace/target/checkout/target/apidocs/net/ihe/gazelle/ws/client/class-use/GazelleTRMServiceStub.TrmTestInstances.Factory.html...
[INFO] Generating /home/jenkins/.hudson/jobs/GazelleTRMClient-SNAPSHOT/workspace/target/checkout/target/apidocs/net/ihe/gazelle/ws/client/class-use/GazelleTRMServiceStub.TrmTest.html...
[INFO] Generating /home/jenkins/.hudson/jobs/GazelleTRMClient-SNAPSHOT/workspace/target/checkout/target/apidocs/net/ihe/gazelle/ws/client/class-use/GazelleTRMServiceStub.TrmTest.Factory.html...
[INFO] Generating /home/jenkins/.hudson/jobs/GazelleTRMClient-SNAPSHOT/workspace/target/checkout/target/apidocs/net/ihe/gazelle/ws/client/class-use/GazelleTRMServiceStub.TrmConfiguration.html...
[INFO] Generating /home/jenkins/.hudson/jobs/GazelleTRMClient-SNAPSHOT/workspace/target/checkout/target/apidocs/net/ihe/gazelle/ws/client/class-use/GazelleTRMServiceStub.TrmConfiguration.Factory.html...
[INFO] Generating /home/jenkins/.hudson/jobs/GazelleTRMClient-SNAPSHOT/workspace/target/checkout/target/apidocs/net/ihe/gazelle/ws/client/class-use/GazelleTRMServiceStub.TrmTestInstance.html...
[INFO] Generating /home/jenkins/.hudson/jobs/GazelleTRMClient-SNAPSHOT/workspace/target/checkout/target/apidocs/net/ihe/gazelle/ws/client/class-use/GazelleTRMServiceStub.TrmTestInstance.Factory.html...
[INFO] Generating /home/jenkins/.hudson/jobs/GazelleTRMClient-SNAPSHOT/workspace/target/checkout/target/apidocs/net/ihe/gazelle/ws/client/class-use/GazelleTRMServiceStub.TrmTestRole.html...
[INFO] Generating /home/jenkins/.hudson/jobs/GazelleTRMClient-SNAPSHOT/workspace/target/checkout/target/apidocs/net/ihe/gazelle/ws/client/class-use/GazelleTRMServiceStub.TrmTestRole.Factory.html...
[INFO] Generating /home/jenkins/.hudson/jobs/GazelleTRMClient-SNAPSHOT/workspace/target/checkout/target/apidocs/net/ihe/gazelle/ws/client/class-use/GazelleTRMServiceStub.GetSystemIsATool.html...
[INFO] Generating /home/jenkins/.hudson/jobs/GazelleTRMClient-SNAPSHOT/workspace/target/checkout/target/apidocs/net/ihe/gazelle/ws/client/class-use/GazelleTRMServiceStub.GetSystemIsATool.Factory.html...
[INFO] Generating /home/jenkins/.hudson/jobs/GazelleTRMClient-SNAPSHOT/workspace/target/checkout/target/apidocs/net/ihe/gazelle/ws/client/class-use/GazelleTRMServiceStub.TrmShortTestInstance.html...
[INFO] Generating /home/jenkins/.hudson/jobs/GazelleTRMClient-SNAPSHOT/workspace/target/checkout/target/apidocs/net/ihe/gazelle/ws/client/class-use/GazelleTRMServiceStub.TrmShortTestInstance.Factory.html...
[INFO] Generating /home/jenkins/.hudson/jobs/GazelleTRMClient-SNAPSHOT/workspace/target/checkout/target/apidocs/net/ihe/gazelle/ws/client/class-use/GazelleTRMServiceStub.TrmTestDescription.html...
[INFO] Generating /home/jenkins/.hudson/jobs/GazelleTRMClient-SNAPSHOT/workspace/target/checkout/target/apidocs/net/ihe/gazelle/ws/client/class-use/GazelleTRMServiceStub.TrmTestDescription.Factory.html...
[INFO] Generating /home/jenkins/.hudson/jobs/GazelleTRMClient-SNAPSHOT/workspace/target/checkout/target/apidocs/net/ihe/gazelle/ws/client/class-use/GazelleTRMServiceStub.GetTestInstanceByIdResponseE.html...
[INFO] Generating /home/jenkins/.hudson/jobs/GazelleTRMClient-SNAPSHOT/workspace/target/checkout/target/apidocs/net/ihe/gazelle/ws/client/class-use/GazelleTRMServiceStub.GetTestInstanceByIdResponseE.Factory.html...
[INFO] Generating /home/jenkins/.hudson/jobs/GazelleTRMClient-SNAPSHOT/workspace/target/checkout/target/apidocs/net/ihe/gazelle/ws/client/class-use/GazelleTRMServiceStub.TrMaipo.html...
[INFO] Generating /home/jenkins/.hudson/jobs/GazelleTRMClient-SNAPSHOT/workspace/target/checkout/target/apidocs/net/ihe/gazelle/ws/client/class-use/GazelleTRMServiceStub.TrMaipo.Factory.html...
[INFO] Generating /home/jenkins/.hudson/jobs/GazelleTRMClient-SNAPSHOT/workspace/target/checkout/target/apidocs/net/ihe/gazelle/ws/client/class-use/GazelleTRMServiceStub.GetTestInstancesByTestingSessionResponse.html...
[INFO] Generating /home/jenkins/.hudson/jobs/GazelleTRMClient-SNAPSHOT/workspace/target/checkout/target/apidocs/net/ihe/gazelle/ws/client/class-use/GazelleTRMServiceStub.GetTestInstancesByTestingSessionResponse.Factory.html...
[INFO] Generating /home/jenkins/.hudson/jobs/GazelleTRMClient-SNAPSHOT/workspace/target/checkout/target/apidocs/net/ihe/gazelle/ws/client/class-use/GazelleTRMServiceStub.GetTestInstanceByIdResponse.html...
[INFO] Generating /home/jenkins/.hudson/jobs/GazelleTRMClient-SNAPSHOT/workspace/target/checkout/target/apidocs/net/ihe/gazelle/ws/client/class-use/GazelleTRMServiceStub.GetTestInstanceByIdResponse.Factory.html...
[INFO] Generating /home/jenkins/.hudson/jobs/GazelleTRMClient-SNAPSHOT/workspace/target/checkout/target/apidocs/net/ihe/gazelle/ws/client/class-use/GazelleTRMServiceStub.GetTestInstanceByIdE.html...
[INFO] Generating /home/jenkins/.hudson/jobs/GazelleTRMClient-SNAPSHOT/workspace/target/checkout/target/apidocs/net/ihe/gazelle/ws/client/class-use/GazelleTRMServiceStub.GetTestInstanceByIdE.Factory.html...
[INFO] Generating /home/jenkins/.hudson/jobs/GazelleTRMClient-SNAPSHOT/workspace/target/checkout/target/apidocs/net/ihe/gazelle/ws/client/class-use/GazelleTRMServiceStub.SOAPExceptionE.html...
[INFO] Generating /home/jenkins/.hudson/jobs/GazelleTRMClient-SNAPSHOT/workspace/target/checkout/target/apidocs/net/ihe/gazelle/ws/client/class-use/GazelleTRMServiceStub.SOAPExceptionE.Factory.html...
[INFO] Generating /home/jenkins/.hudson/jobs/GazelleTRMClient-SNAPSHOT/workspace/target/checkout/target/apidocs/net/ihe/gazelle/ws/client/class-use/GazelleTRMServiceStub.GetSystemIsAToolE.html...
[INFO] Generating /home/jenkins/.hudson/jobs/GazelleTRMClient-SNAPSHOT/workspace/target/checkout/target/apidocs/net/ihe/gazelle/ws/client/class-use/GazelleTRMServiceStub.GetSystemIsAToolE.Factory.html...
[INFO] Generating /home/jenkins/.hudson/jobs/GazelleTRMClient-SNAPSHOT/workspace/target/checkout/target/apidocs/net/ihe/gazelle/ws/client/class-use/GazelleTRMServiceStub.ExtensionMapper.html...
[INFO] Generating /home/jenkins/.hudson/jobs/GazelleTRMClient-SNAPSHOT/workspace/target/checkout/target/apidocs/net/ihe/gazelle/ws/client/class-use/GazelleTRMServiceStub.TrmRoleInTest.html...
[INFO] Generating /home/jenkins/.hudson/jobs/GazelleTRMClient-SNAPSHOT/workspace/target/checkout/target/apidocs/net/ihe/gazelle/ws/client/class-use/GazelleTRMServiceStub.TrmRoleInTest.Factory.html...
[INFO] Generating /home/jenkins/.hudson/jobs/GazelleTRMClient-SNAPSHOT/workspace/target/checkout/target/apidocs/net/ihe/gazelle/ws/client/class-use/GazelleTRMServiceStub.TrmTestStepInstance.html...
[INFO] Generating /home/jenkins/.hudson/jobs/GazelleTRMClient-SNAPSHOT/workspace/target/checkout/target/apidocs/net/ihe/gazelle/ws/client/class-use/GazelleTRMServiceStub.TrmTestStepInstance.Factory.html...
[INFO] Generating /home/jenkins/.hudson/jobs/GazelleTRMClient-SNAPSHOT/workspace/target/checkout/target/apidocs/net/ihe/gazelle/ws/client/class-use/GazelleTRMServiceStub.SOAPException.html...
[INFO] Generating /home/jenkins/.hudson/jobs/GazelleTRMClient-SNAPSHOT/workspace/target/checkout/target/apidocs/net/ihe/gazelle/ws/client/class-use/GazelleTRMServiceStub.SOAPException.Factory.html...
[INFO] Generating /home/jenkins/.hudson/jobs/GazelleTRMClient-SNAPSHOT/workspace/target/checkout/target/apidocs/net/ihe/gazelle/ws/client/class-use/GazelleTRMServiceStub.GetSystemIsAToolResponseE.html...
[INFO] Generating /home/jenkins/.hudson/jobs/GazelleTRMClient-SNAPSHOT/workspace/target/checkout/target/apidocs/net/ihe/gazelle/ws/client/class-use/GazelleTRMServiceStub.GetSystemIsAToolResponseE.Factory.html...
[INFO] Generating /home/jenkins/.hudson/jobs/GazelleTRMClient-SNAPSHOT/workspace/target/checkout/target/apidocs/net/ihe/gazelle/ws/client/class-use/GazelleTRMServiceStub.GetTestInstancesByTestingSessionE.html...
[INFO] Generating /home/jenkins/.hudson/jobs/GazelleTRMClient-SNAPSHOT/workspace/target/checkout/target/apidocs/net/ihe/gazelle/ws/client/class-use/GazelleTRMServiceStub.GetTestInstancesByTestingSessionE.Factory.html...
[INFO] Generating /home/jenkins/.hudson/jobs/GazelleTRMClient-SNAPSHOT/workspace/target/checkout/target/apidocs/net/ihe/gazelle/ws/client/class-use/GazelleTRMServiceStub.TrmTestStep.html...
[INFO] Generating /home/jenkins/.hudson/jobs/GazelleTRMClient-SNAPSHOT/workspace/target/checkout/target/apidocs/net/ihe/gazelle/ws/client/class-use/GazelleTRMServiceStub.TrmTestStep.Factory.html...
[INFO] Generating /home/jenkins/.hudson/jobs/GazelleTRMClient-SNAPSHOT/workspace/target/checkout/target/apidocs/net/ihe/gazelle/ws/client/class-use/GazelleTRMServiceStub.TrmChannelType.html...
[INFO] Generating /home/jenkins/.hudson/jobs/GazelleTRMClient-SNAPSHOT/workspace/target/checkout/target/apidocs/net/ihe/gazelle/ws/client/class-use/GazelleTRMServiceStub.TrmChannelType.Factory.html...
[INFO] Generating /home/jenkins/.hudson/jobs/GazelleTRMClient-SNAPSHOT/workspace/target/checkout/target/apidocs/net/ihe/gazelle/ws/client/class-use/GazelleTRMServiceStub.GetSystemIsAToolResponse.html...
[INFO] Generating /home/jenkins/.hudson/jobs/GazelleTRMClient-SNAPSHOT/workspace/target/checkout/target/apidocs/net/ihe/gazelle/ws/client/class-use/GazelleTRMServiceStub.GetSystemIsAToolResponse.Factory.html...
[INFO] Generating /home/jenkins/.hudson/jobs/GazelleTRMClient-SNAPSHOT/workspace/target/checkout/target/apidocs/net/ihe/gazelle/ws/client/class-use/GazelleTRMServiceStub.TrmParticipant.html...
[INFO] Generating /home/jenkins/.hudson/jobs/GazelleTRMClient-SNAPSHOT/workspace/target/checkout/target/apidocs/net/ihe/gazelle/ws/client/class-use/GazelleTRMServiceStub.TrmParticipant.Factory.html...
[INFO] Generating /home/jenkins/.hudson/jobs/GazelleTRMClient-SNAPSHOT/workspace/target/checkout/target/apidocs/net/ihe/gazelle/ws/client/class-use/GazelleTRMServiceStub.GetTestInstanceById.html...
[INFO] Generating /home/jenkins/.hudson/jobs/GazelleTRMClient-SNAPSHOT/workspace/target/checkout/target/apidocs/net/ihe/gazelle/ws/client/class-use/GazelleTRMServiceStub.GetTestInstanceById.Factory.html...
[INFO] Generating /home/jenkins/.hudson/jobs/GazelleTRMClient-SNAPSHOT/workspace/target/checkout/target/apidocs/net/ihe/gazelle/ws/client/class-use/GazelleTRMServiceStub.GetTestInstancesByTestingSession.html...
[INFO] Generating /home/jenkins/.hudson/jobs/GazelleTRMClient-SNAPSHOT/workspace/target/checkout/target/apidocs/net/ihe/gazelle/ws/client/class-use/GazelleTRMServiceStub.GetTestInstancesByTestingSession.Factory.html...
[INFO] Generating /home/jenkins/.hudson/jobs/GazelleTRMClient-SNAPSHOT/workspace/target/checkout/target/apidocs/net/ihe/gazelle/ws/client/class-use/GazelleTRMServiceStub.GetTestInstancesByTestingSessionResponseE.html...
[INFO] Generating /home/jenkins/.hudson/jobs/GazelleTRMClient-SNAPSHOT/workspace/target/checkout/target/apidocs/net/ihe/gazelle/ws/client/class-use/GazelleTRMServiceStub.GetTestInstancesByTestingSessionResponseE.Factory.html...
[INFO] Generating /home/jenkins/.hudson/jobs/GazelleTRMClient-SNAPSHOT/workspace/target/checkout/target/apidocs/net/ihe/gazelle/ws/client/class-use/SOAPExceptionException.html...
[INFO] Generating /home/jenkins/.hudson/jobs/GazelleTRMClient-SNAPSHOT/workspace/target/checkout/target/apidocs/net/ihe/gazelle/ws/client/class-use/GazelleTRMServiceClient.html...
[INFO] Generating /home/jenkins/.hudson/jobs/GazelleTRMClient-SNAPSHOT/workspace/target/checkout/target/apidocs/net/ihe/gazelle/ws/client/package-use.html...
[INFO] Building index for all the packages and classes...
[INFO] Generating /home/jenkins/.hudson/jobs/GazelleTRMClient-SNAPSHOT/workspace/target/checkout/target/apidocs/overview-tree.html...
[INFO] Generating /home/jenkins/.hudson/jobs/GazelleTRMClient-SNAPSHOT/workspace/target/checkout/target/apidocs/index-all.html...
[INFO] Generating /home/jenkins/.hudson/jobs/GazelleTRMClient-SNAPSHOT/workspace/target/checkout/target/apidocs/deprecated-list.html...
[INFO] Building index for all classes...
[INFO] Generating /home/jenkins/.hudson/jobs/GazelleTRMClient-SNAPSHOT/workspace/target/checkout/target/apidocs/allclasses-frame.html...
[INFO] Generating /home/jenkins/.hudson/jobs/GazelleTRMClient-SNAPSHOT/workspace/target/checkout/target/apidocs/allclasses-noframe.html...
[INFO] Generating /home/jenkins/.hudson/jobs/GazelleTRMClient-SNAPSHOT/workspace/target/checkout/target/apidocs/index.html...
[INFO] Generating /home/jenkins/.hudson/jobs/GazelleTRMClient-SNAPSHOT/workspace/target/checkout/target/apidocs/help-doc.html...
[INFO] 6 errors
[INFO] 100 warnings
[INFO] [INFO] ------------------------------------------------------------------------
[INFO] [INFO] BUILD FAILURE
[INFO] [INFO] ------------------------------------------------------------------------
[INFO] [INFO] Total time: 28.511 s
[INFO] [INFO] Finished at: 2018-04-12T15:22:35+02:00
[INFO] [INFO] Final Memory: 50M/644M
[INFO] [INFO] ------------------------------------------------------------------------
[INFO] [ERROR] Failed to execute goal org.apache.maven.plugins:maven-javadoc-plugin:3.0.0:jar (attach-javadocs) on project GazelleTRMClient: MavenReportException: Error while generating Javadoc: 
[INFO] [ERROR] Exit code: 1 - /home/jenkins/.hudson/jobs/GazelleTRMClient-SNAPSHOT/workspace/target/checkout/target/generated-sources/axis2/wsdl2code/src/net/ihe/gazelle/ws/client/GazelleTRMServiceCallbackHandler.java:37: warning: no @return
[INFO] [ERROR]     public Object getClientData() {
[INFO] [ERROR]                   ^
[INFO] [ERROR] /home/jenkins/.hudson/jobs/GazelleTRMClient-SNAPSHOT/workspace/target/checkout/target/generated-sources/axis2/wsdl2code/src/net/ihe/gazelle/ws/client/GazelleTRMServiceCallbackHandler.java:45: warning: no @param for result
[INFO] [ERROR]     public void receiveResultgetSystemIsATool(
[INFO] [ERROR]                 ^
[INFO] [ERROR] /home/jenkins/.hudson/jobs/GazelleTRMClient-SNAPSHOT/workspace/target/checkout/target/generated-sources/axis2/wsdl2code/src/net/ihe/gazelle/ws/client/GazelleTRMServiceCallbackHandler.java:53: warning: no @param for e
[INFO] [ERROR]     public void receiveErrorgetSystemIsATool(java.lang.Exception e) {
[INFO] [ERROR]                 ^
[INFO] [ERROR] /home/jenkins/.hudson/jobs/GazelleTRMClient-SNAPSHOT/workspace/target/checkout/target/generated-sources/axis2/wsdl2code/src/net/ihe/gazelle/ws/client/GazelleTRMServiceCallbackHandler.java:60: warning: no @param for result
[INFO] [ERROR]     public void receiveResultgetTestInstancesByTestingSession(
[INFO] [ERROR]                 ^
[INFO] [ERROR] /home/jenkins/.hudson/jobs/GazelleTRMClient-SNAPSHOT/workspace/target/checkout/target/generated-sources/axis2/wsdl2code/src/net/ihe/gazelle/ws/client/GazelleTRMServiceCallbackHandler.java:68: warning: no @param for e
[INFO] [ERROR]     public void receiveErrorgetTestInstancesByTestingSession(
[INFO] [ERROR]                 ^
[INFO] [ERROR] /home/jenkins/.hudson/jobs/GazelleTRMClient-SNAPSHOT/workspace/target/checkout/target/generated-sources/axis2/wsdl2code/src/net/ihe/gazelle/ws/client/GazelleTRMServiceCallbackHandler.java:76: warning: no @param for result
[INFO] [ERROR]     public void receiveResultgetTestInstanceById(
[INFO] [ERROR]                 ^
[INFO] [ERROR] /home/jenkins/.hudson/jobs/GazelleTRMClient-SNAPSHOT/workspace/target/checkout/target/generated-sources/axis2/wsdl2code/src/net/ihe/gazelle/ws/client/GazelleTRMServiceCallbackHandler.java:84: warning: no @param for e
[INFO] [ERROR]     public void receiveErrorgetTestInstanceById(java.lang.Exception e) {
[INFO] [ERROR]                 ^
[INFO] [ERROR] /home/jenkins/.hudson/jobs/GazelleTRMClient-SNAPSHOT/workspace/target/checkout/target/generated-sources/axis2/wsdl2code/src/net/ihe/gazelle/ws/client/GazelleTRMServiceStub.java:183: error: reference not found
[INFO] [ERROR]      * @see net.ihe.gazelle.ws.client.GazelleTRMService#getSystemIsATool
[INFO] [ERROR]             ^
[INFO] [ERROR] /home/jenkins/.hudson/jobs/GazelleTRMClient-SNAPSHOT/workspace/target/checkout/target/generated-sources/axis2/wsdl2code/src/net/ihe/gazelle/ws/client/GazelleTRMServiceStub.java:184: warning: no description for @param
[INFO] [ERROR]      * @param getSystemIsATool0
[INFO] [ERROR]        ^
[INFO] [ERROR] /home/jenkins/.hudson/jobs/GazelleTRMClient-SNAPSHOT/workspace/target/checkout/target/generated-sources/axis2/wsdl2code/src/net/ihe/gazelle/ws/client/GazelleTRMServiceStub.java:187: warning: no @return
[INFO] [ERROR]     public net.ihe.gazelle.ws.client.GazelleTRMServiceStub.GetSystemIsAToolResponseE getSystemIsATool(
[INFO] [ERROR]                                                                                      ^
[INFO] [ERROR] /home/jenkins/.hudson/jobs/GazelleTRMClient-SNAPSHOT/workspace/target/checkout/target/generated-sources/axis2/wsdl2code/src/net/ihe/gazelle/ws/client/GazelleTRMServiceStub.java:187: warning: no @throws for java.rmi.RemoteException
[INFO] [ERROR]     public net.ihe.gazelle.ws.client.GazelleTRMServiceStub.GetSystemIsAToolResponseE getSystemIsATool(
[INFO] [ERROR]                                                                                      ^
[INFO] [ERROR] /home/jenkins/.hudson/jobs/GazelleTRMClient-SNAPSHOT/workspace/target/checkout/target/generated-sources/axis2/wsdl2code/src/net/ihe/gazelle/ws/client/GazelleTRMServiceStub.java:302: error: reference not found
[INFO] [ERROR]      * @see net.ihe.gazelle.ws.client.GazelleTRMService#startgetSystemIsATool
[INFO] [ERROR]             ^
[INFO] [ERROR] /home/jenkins/.hudson/jobs/GazelleTRMClient-SNAPSHOT/workspace/target/checkout/target/generated-sources/axis2/wsdl2code/src/net/ihe/gazelle/ws/client/GazelleTRMServiceStub.java:303: warning: no description for @param
[INFO] [ERROR]      * @param getSystemIsATool0
[INFO] [ERROR]        ^
[INFO] [ERROR] /home/jenkins/.hudson/jobs/GazelleTRMClient-SNAPSHOT/workspace/target/checkout/target/generated-sources/axis2/wsdl2code/src/net/ihe/gazelle/ws/client/GazelleTRMServiceStub.java:305: warning: no @param for callback
[INFO] [ERROR]     public void startgetSystemIsATool(
[INFO] [ERROR]                 ^
[INFO] [ERROR] /home/jenkins/.hudson/jobs/GazelleTRMClient-SNAPSHOT/workspace/target/checkout/target/generated-sources/axis2/wsdl2code/src/net/ihe/gazelle/ws/client/GazelleTRMServiceStub.java:305: warning: no @throws for java.rmi.RemoteException
[INFO] [ERROR]     public void startgetSystemIsATool(
[INFO] [ERROR]                 ^
[INFO] [ERROR] /home/jenkins/.hudson/jobs/GazelleTRMClient-SNAPSHOT/workspace/target/checkout/target/generated-sources/axis2/wsdl2code/src/net/ihe/gazelle/ws/client/GazelleTRMServiceStub.java:460: error: reference not found
[INFO] [ERROR]      * @see net.ihe.gazelle.ws.client.GazelleTRMService#getTestInstancesByTestingSession
[INFO] [ERROR]             ^
[INFO] [ERROR] /home/jenkins/.hudson/jobs/GazelleTRMClient-SNAPSHOT/workspace/target/checkout/target/generated-sources/axis2/wsdl2code/src/net/ihe/gazelle/ws/client/GazelleTRMServiceStub.java:461: warning: no description for @param
[INFO] [ERROR]      * @param getTestInstancesByTestingSession2
[INFO] [ERROR]        ^
[INFO] [ERROR] /home/jenkins/.hudson/jobs/GazelleTRMClient-SNAPSHOT/workspace/target/checkout/target/generated-sources/axis2/wsdl2code/src/net/ihe/gazelle/ws/client/GazelleTRMServiceStub.java:464: warning: no @return
[INFO] [ERROR]     public net.ihe.gazelle.ws.client.GazelleTRMServiceStub.GetTestInstancesByTestingSessionResponseE getTestInstancesByTestingSession(
[INFO] [ERROR]                                                                                                      ^
[INFO] [ERROR] /home/jenkins/.hudson/jobs/GazelleTRMClient-SNAPSHOT/workspace/target/checkout/target/generated-sources/axis2/wsdl2code/src/net/ihe/gazelle/ws/client/GazelleTRMServiceStub.java:464: warning: no @throws for java.rmi.RemoteException
[INFO] [ERROR]     public net.ihe.gazelle.ws.client.GazelleTRMServiceStub.GetTestInstancesByTestingSessionResponseE getTestInstancesByTestingSession(
[INFO] [ERROR]                                                                                                      ^
[INFO] [ERROR] /home/jenkins/.hudson/jobs/GazelleTRMClient-SNAPSHOT/workspace/target/checkout/target/generated-sources/axis2/wsdl2code/src/net/ihe/gazelle/ws/client/GazelleTRMServiceStub.java:582: error: reference not found
[INFO] [ERROR]      * @see net.ihe.gazelle.ws.client.GazelleTRMService#startgetTestInstancesByTestingSession
[INFO] [ERROR]             ^
[INFO] [ERROR] /home/jenkins/.hudson/jobs/GazelleTRMClient-SNAPSHOT/workspace/target/checkout/target/generated-sources/axis2/wsdl2code/src/net/ihe/gazelle/ws/client/GazelleTRMServiceStub.java:583: warning: no description for @param
[INFO] [ERROR]      * @param getTestInstancesByTestingSession2
[INFO] [ERROR]        ^
[INFO] [ERROR] /home/jenkins/.hudson/jobs/GazelleTRMClient-SNAPSHOT/workspace/target/checkout/target/generated-sources/axis2/wsdl2code/src/net/ihe/gazelle/ws/client/GazelleTRMServiceStub.java:585: warning: no @param for callback
[INFO] [ERROR]     public void startgetTestInstancesByTestingSession(
[INFO] [ERROR]                 ^
[INFO] [ERROR] /home/jenkins/.hudson/jobs/GazelleTRMClient-SNAPSHOT/workspace/target/checkout/target/generated-sources/axis2/wsdl2code/src/net/ihe/gazelle/ws/client/GazelleTRMServiceStub.java:585: warning: no @throws for java.rmi.RemoteException
[INFO] [ERROR]     public void startgetTestInstancesByTestingSession(
[INFO] [ERROR]                 ^
[INFO] [ERROR] /home/jenkins/.hudson/jobs/GazelleTRMClient-SNAPSHOT/workspace/target/checkout/target/generated-sources/axis2/wsdl2code/src/net/ihe/gazelle/ws/client/GazelleTRMServiceStub.java:740: error: reference not found
[INFO] [ERROR]      * @see net.ihe.gazelle.ws.client.GazelleTRMService#getTestInstanceById
[INFO] [ERROR]             ^
[INFO] [ERROR] /home/jenkins/.hudson/jobs/GazelleTRMClient-SNAPSHOT/workspace/target/checkout/target/generated-sources/axis2/wsdl2code/src/net/ihe/gazelle/ws/client/GazelleTRMServiceStub.java:741: warning: no description for @param
[INFO] [ERROR]      * @param getTestInstanceById4
[INFO] [ERROR]        ^
[INFO] [ERROR] /home/jenkins/.hudson/jobs/GazelleTRMClient-SNAPSHOT/workspace/target/checkout/target/generated-sources/axis2/wsdl2code/src/net/ihe/gazelle/ws/client/GazelleTRMServiceStub.java:744: warning: no @return
[INFO] [ERROR]     public net.ihe.gazelle.ws.client.GazelleTRMServiceStub.GetTestInstanceByIdResponseE getTestInstanceById(
[INFO] [ERROR]                                                                                         ^
[INFO] [ERROR] /home/jenkins/.hudson/jobs/GazelleTRMClient-SNAPSHOT/workspace/target/checkout/target/generated-sources/axis2/wsdl2code/src/net/ihe/gazelle/ws/client/GazelleTRMServiceStub.java:744: warning: no @throws for java.rmi.RemoteException
[INFO] [ERROR]     public net.ihe.gazelle.ws.client.GazelleTRMServiceStub.GetTestInstanceByIdResponseE getTestInstanceById(
[INFO] [ERROR]                                                                                         ^
[INFO] [ERROR] /home/jenkins/.hudson/jobs/GazelleTRMClient-SNAPSHOT/workspace/target/checkout/target/generated-sources/axis2/wsdl2code/src/net/ihe/gazelle/ws/client/GazelleTRMServiceStub.java:859: error: reference not found
[INFO] [ERROR]      * @see net.ihe.gazelle.ws.client.GazelleTRMService#startgetTestInstanceById
[INFO] [ERROR]             ^
[INFO] [ERROR] /home/jenkins/.hudson/jobs/GazelleTRMClient-SNAPSHOT/workspace/target/checkout/target/generated-sources/axis2/wsdl2code/src/net/ihe/gazelle/ws/client/GazelleTRMServiceStub.java:860: warning: no description for @param
[INFO] [ERROR]      * @param getTestInstanceById4
[INFO] [ERROR]        ^
[INFO] [ERROR] /home/jenkins/.hudson/jobs/GazelleTRMClient-SNAPSHOT/workspace/target/checkout/target/generated-sources/axis2/wsdl2code/src/net/ihe/gazelle/ws/client/GazelleTRMServiceStub.java:862: warning: no @param for callback
[INFO] [ERROR]     public void startgetTestInstanceById(
[INFO] [ERROR]                 ^
[INFO] [ERROR] /home/jenkins/.hudson/jobs/GazelleTRMClient-SNAPSHOT/workspace/target/checkout/target/generated-sources/axis2/wsdl2code/src/net/ihe/gazelle/ws/client/GazelleTRMServiceStub.java:862: warning: no @throws for java.rmi.RemoteException
[INFO] [ERROR]     public void startgetTestInstanceById(
[INFO] [ERROR]                 ^
[INFO] [ERROR] /home/jenkins/.hudson/jobs/GazelleTRMClient-SNAPSHOT/workspace/target/checkout/target/generated-sources/axis2/wsdl2code/src/net/ihe/gazelle/ws/client/GazelleTRMServiceStub.java:65: warning: no @throws for org.apache.axis2.AxisFault
[INFO] [ERROR]     public GazelleTRMServiceStub() throws org.apache.axis2.AxisFault {
[INFO] [ERROR]            ^
[INFO] [ERROR] /home/jenkins/.hudson/jobs/GazelleTRMClient-SNAPSHOT/workspace/target/checkout/target/generated-sources/axis2/wsdl2code/src/net/ihe/gazelle/ws/client/GazelleTRMServiceStub.java:55: warning: no @param for configurationContext
[INFO] [ERROR]     public GazelleTRMServiceStub(
[INFO] [ERROR]            ^
[INFO] [ERROR] /home/jenkins/.hudson/jobs/GazelleTRMClient-SNAPSHOT/workspace/target/checkout/target/generated-sources/axis2/wsdl2code/src/net/ihe/gazelle/ws/client/GazelleTRMServiceStub.java:55: warning: no @throws for org.apache.axis2.AxisFault
[INFO] [ERROR]     public GazelleTRMServiceStub(
[INFO] [ERROR]            ^
[INFO] [ERROR] /home/jenkins/.hudson/jobs/GazelleTRMClient-SNAPSHOT/workspace/target/checkout/target/generated-sources/axis2/wsdl2code/src/net/ihe/gazelle/ws/client/GazelleTRMServiceStub.java:26: warning: no @param for configurationContext
[INFO] [ERROR]     public GazelleTRMServiceStub(
[INFO] [ERROR]            ^
[INFO] [ERROR] /home/jenkins/.hudson/jobs/GazelleTRMClient-SNAPSHOT/workspace/target/checkout/target/generated-sources/axis2/wsdl2code/src/net/ihe/gazelle/ws/client/GazelleTRMServiceStub.java:26: warning: no @param for targetEndpoint
[INFO] [ERROR]     public GazelleTRMServiceStub(
[INFO] [ERROR]            ^
[INFO] [ERROR] /home/jenkins/.hudson/jobs/GazelleTRMClient-SNAPSHOT/workspace/target/checkout/target/generated-sources/axis2/wsdl2code/src/net/ihe/gazelle/ws/client/GazelleTRMServiceStub.java:26: warning: no @throws for org.apache.axis2.AxisFault
[INFO] [ERROR]     public GazelleTRMServiceStub(
[INFO] [ERROR]            ^
[INFO] [ERROR] /home/jenkins/.hudson/jobs/GazelleTRMClient-SNAPSHOT/workspace/target/checkout/target/generated-sources/axis2/wsdl2code/src/net/ihe/gazelle/ws/client/GazelleTRMServiceStub.java:35: warning: no @param for configurationContext
[INFO] [ERROR]     public GazelleTRMServiceStub(
[INFO] [ERROR]            ^
[INFO] [ERROR] /home/jenkins/.hudson/jobs/GazelleTRMClient-SNAPSHOT/workspace/target/checkout/target/generated-sources/axis2/wsdl2code/src/net/ihe/gazelle/ws/client/GazelleTRMServiceStub.java:35: warning: no @param for targetEndpoint
[INFO] [ERROR]     public GazelleTRMServiceStub(
[INFO] [ERROR]            ^
[INFO] [ERROR] /home/jenkins/.hudson/jobs/GazelleTRMClient-SNAPSHOT/workspace/target/checkout/target/generated-sources/axis2/wsdl2code/src/net/ihe/gazelle/ws/client/GazelleTRMServiceStub.java:35: warning: no @param for useSeparateListener
[INFO] [ERROR]     public GazelleTRMServiceStub(
[INFO] [ERROR]            ^
[INFO] [ERROR] /home/jenkins/.hudson/jobs/GazelleTRMClient-SNAPSHOT/workspace/target/checkout/target/generated-sources/axis2/wsdl2code/src/net/ihe/gazelle/ws/client/GazelleTRMServiceStub.java:35: warning: no @throws for org.apache.axis2.AxisFault
[INFO] [ERROR]     public GazelleTRMServiceStub(
[INFO] [ERROR]            ^
[INFO] [ERROR] /home/jenkins/.hudson/jobs/GazelleTRMClient-SNAPSHOT/workspace/target/checkout/target/generated-sources/axis2/wsdl2code/src/net/ihe/gazelle/ws/client/GazelleTRMServiceStub.java:73: warning: no @param for targetEndpoint
[INFO] [ERROR]     public GazelleTRMServiceStub(java.lang.String targetEndpoint)
[INFO] [ERROR]            ^
[INFO] [ERROR] /home/jenkins/.hudson/jobs/GazelleTRMClient-SNAPSHOT/workspace/target/checkout/target/generated-sources/axis2/wsdl2code/src/net/ihe/gazelle/ws/client/GazelleTRMServiceStub.java:73: warning: no @throws for org.apache.axis2.AxisFault
[INFO] [ERROR]     public GazelleTRMServiceStub(java.lang.String targetEndpoint)
[INFO] [ERROR]            ^
[INFO] [ERROR] /home/jenkins/.hudson/jobs/GazelleTRMClient-SNAPSHOT/workspace/target/checkout/target/generated-sources/axis2/wsdl2code/src/net/ihe/gazelle/ws/client/GazelleTRMServiceStub.java:5961: warning: no description for @param
[INFO] [ERROR]          * @param parentQName
[INFO] [ERROR]            ^
[INFO] [ERROR] /home/jenkins/.hudson/jobs/GazelleTRMClient-SNAPSHOT/workspace/target/checkout/target/generated-sources/axis2/wsdl2code/src/net/ihe/gazelle/ws/client/GazelleTRMServiceStub.java:5962: warning: no description for @param
[INFO] [ERROR]          * @param factory
[INFO] [ERROR]            ^
[INFO] [ERROR] /home/jenkins/.hudson/jobs/GazelleTRMClient-SNAPSHOT/workspace/target/checkout/target/generated-sources/axis2/wsdl2code/src/net/ihe/gazelle/ws/client/GazelleTRMServiceStub.java:6259: warning: no @param for reader
[INFO] [ERROR]             public static GetSystemIsATool parse(
[INFO] [ERROR]                                            ^
[INFO] [ERROR] /home/jenkins/.hudson/jobs/GazelleTRMClient-SNAPSHOT/workspace/target/checkout/target/generated-sources/axis2/wsdl2code/src/net/ihe/gazelle/ws/client/GazelleTRMServiceStub.java:6259: warning: no @return
[INFO] [ERROR]             public static GetSystemIsATool parse(
[INFO] [ERROR]                                            ^
[INFO] [ERROR] /home/jenkins/.hudson/jobs/GazelleTRMClient-SNAPSHOT/workspace/target/checkout/target/generated-sources/axis2/wsdl2code/src/net/ihe/gazelle/ws/client/GazelleTRMServiceStub.java:6259: warning: no @throws for java.lang.Exception
[INFO] [ERROR]             public static GetSystemIsATool parse(
[INFO] [ERROR]                                            ^
[INFO] [ERROR] /home/jenkins/.hudson/jobs/GazelleTRMClient-SNAPSHOT/workspace/target/checkout/target/generated-sources/axis2/wsdl2code/src/net/ihe/gazelle/ws/client/GazelleTRMServiceStub.java:9905: warning: no description for @param
[INFO] [ERROR]          * @param parentQName
[INFO] [ERROR]            ^
[INFO] [ERROR] /home/jenkins/.hudson/jobs/GazelleTRMClient-SNAPSHOT/workspace/target/checkout/target/generated-sources/axis2/wsdl2code/src/net/ihe/gazelle/ws/client/GazelleTRMServiceStub.java:9906: warning: no description for @param
[INFO] [ERROR]          * @param factory
[INFO] [ERROR]            ^
[INFO] [ERROR] /home/jenkins/.hudson/jobs/GazelleTRMClient-SNAPSHOT/workspace/target/checkout/target/generated-sources/axis2/wsdl2code/src/net/ihe/gazelle/ws/client/GazelleTRMServiceStub.java:10157: warning: no @param for reader
[INFO] [ERROR]             public static GetSystemIsAToolE parse(
[INFO] [ERROR]                                             ^
[INFO] [ERROR] /home/jenkins/.hudson/jobs/GazelleTRMClient-SNAPSHOT/workspace/target/checkout/target/generated-sources/axis2/wsdl2code/src/net/ihe/gazelle/ws/client/GazelleTRMServiceStub.java:10157: warning: no @return
[INFO] [ERROR]             public static GetSystemIsAToolE parse(
[INFO] [ERROR]                                             ^
[INFO] [ERROR] /home/jenkins/.hudson/jobs/GazelleTRMClient-SNAPSHOT/workspace/target/checkout/target/generated-sources/axis2/wsdl2code/src/net/ihe/gazelle/ws/client/GazelleTRMServiceStub.java:10157: warning: no @throws for java.lang.Exception
[INFO] [ERROR]             public static GetSystemIsAToolE parse(
[INFO] [ERROR]                                             ^
[INFO] [ERROR] /home/jenkins/.hudson/jobs/GazelleTRMClient-SNAPSHOT/workspace/target/checkout/target/generated-sources/axis2/wsdl2code/src/net/ihe/gazelle/ws/client/GazelleTRMServiceStub.java:14802: warning: no description for @param
[INFO] [ERROR]          * @param parentQName
[INFO] [ERROR]            ^
[INFO] [ERROR] /home/jenkins/.hudson/jobs/GazelleTRMClient-SNAPSHOT/workspace/target/checkout/target/generated-sources/axis2/wsdl2code/src/net/ihe/gazelle/ws/client/GazelleTRMServiceStub.java:14803: warning: no description for @param
[INFO] [ERROR]          * @param factory
[INFO] [ERROR]            ^
[INFO] [ERROR] /home/jenkins/.hudson/jobs/GazelleTRMClient-SNAPSHOT/workspace/target/checkout/target/generated-sources/axis2/wsdl2code/src/net/ihe/gazelle/ws/client/GazelleTRMServiceStub.java:15085: warning: no @param for reader
[INFO] [ERROR]             public static GetSystemIsAToolResponse parse(
[INFO] [ERROR]                                                    ^
[INFO] [ERROR] /home/jenkins/.hudson/jobs/GazelleTRMClient-SNAPSHOT/workspace/target/checkout/target/generated-sources/axis2/wsdl2code/src/net/ihe/gazelle/ws/client/GazelleTRMServiceStub.java:15085: warning: no @return
[INFO] [ERROR]             public static GetSystemIsAToolResponse parse(
[INFO] [ERROR]                                                    ^
[INFO] [ERROR] /home/jenkins/.hudson/jobs/GazelleTRMClient-SNAPSHOT/workspace/target/checkout/target/generated-sources/axis2/wsdl2code/src/net/ihe/gazelle/ws/client/GazelleTRMServiceStub.java:15085: warning: no @throws for java.lang.Exception
[INFO] [ERROR]             public static GetSystemIsAToolResponse parse(
[INFO] [ERROR]                                                    ^
[INFO] [ERROR] /home/jenkins/.hudson/jobs/GazelleTRMClient-SNAPSHOT/workspace/target/checkout/target/generated-sources/axis2/wsdl2code/src/net/ihe/gazelle/ws/client/GazelleTRMServiceStub.java:12632: warning: no description for @param
[INFO] [ERROR]          * @param parentQName
[INFO] [ERROR]            ^
[INFO] [ERROR] /home/jenkins/.hudson/jobs/GazelleTRMClient-SNAPSHOT/workspace/target/checkout/target/generated-sources/axis2/wsdl2code/src/net/ihe/gazelle/ws/client/GazelleTRMServiceStub.java:12633: warning: no description for @param
[INFO] [ERROR]          * @param factory
[INFO] [ERROR]            ^
[INFO] [ERROR] /home/jenkins/.hudson/jobs/GazelleTRMClient-SNAPSHOT/workspace/target/checkout/target/generated-sources/axis2/wsdl2code/src/net/ihe/gazelle/ws/client/GazelleTRMServiceStub.java:12884: warning: no @param for reader
[INFO] [ERROR]             public static GetSystemIsAToolResponseE parse(
[INFO] [ERROR]                                                     ^
[INFO] [ERROR] /home/jenkins/.hudson/jobs/GazelleTRMClient-SNAPSHOT/workspace/target/checkout/target/generated-sources/axis2/wsdl2code/src/net/ihe/gazelle/ws/client/GazelleTRMServiceStub.java:12884: warning: no @return
[INFO] [ERROR]             public static GetSystemIsAToolResponseE parse(
[INFO] [ERROR]                                                     ^
[INFO] [ERROR] /home/jenkins/.hudson/jobs/GazelleTRMClient-SNAPSHOT/workspace/target/checkout/target/generated-sources/axis2/wsdl2code/src/net/ihe/gazelle/ws/client/GazelleTRMServiceStub.java:12884: warning: no @throws for java.lang.Exception
[INFO] [ERROR]             public static GetSystemIsAToolResponseE parse(
[INFO] [ERROR]                                                     ^
[INFO] [ERROR] /home/jenkins/.hudson/jobs/GazelleTRMClient-SNAPSHOT/workspace/target/checkout/target/generated-sources/axis2/wsdl2code/src/net/ihe/gazelle/ws/client/GazelleTRMServiceStub.java:15935: warning: no description for @param
[INFO] [ERROR]          * @param parentQName
[INFO] [ERROR]            ^
[INFO] [ERROR] /home/jenkins/.hudson/jobs/GazelleTRMClient-SNAPSHOT/workspace/target/checkout/target/generated-sources/axis2/wsdl2code/src/net/ihe/gazelle/ws/client/GazelleTRMServiceStub.java:15936: warning: no description for @param
[INFO] [ERROR]          * @param factory
[INFO] [ERROR]            ^
[INFO] [ERROR] /home/jenkins/.hudson/jobs/GazelleTRMClient-SNAPSHOT/workspace/target/checkout/target/generated-sources/axis2/wsdl2code/src/net/ihe/gazelle/ws/client/GazelleTRMServiceStub.java:16218: warning: no @param for reader
[INFO] [ERROR]             public static GetTestInstanceById parse(
[INFO] [ERROR]                                               ^
[INFO] [ERROR] /home/jenkins/.hudson/jobs/GazelleTRMClient-SNAPSHOT/workspace/target/checkout/target/generated-sources/axis2/wsdl2code/src/net/ihe/gazelle/ws/client/GazelleTRMServiceStub.java:16218: warning: no @return
[INFO] [ERROR]             public static GetTestInstanceById parse(
[INFO] [ERROR]                                               ^
[INFO] [ERROR] /home/jenkins/.hudson/jobs/GazelleTRMClient-SNAPSHOT/workspace/target/checkout/target/generated-sources/axis2/wsdl2code/src/net/ihe/gazelle/ws/client/GazelleTRMServiceStub.java:16218: warning: no @throws for java.lang.Exception
[INFO] [ERROR]             public static GetTestInstanceById parse(
[INFO] [ERROR]                                               ^
[INFO] [ERROR] /home/jenkins/.hudson/jobs/GazelleTRMClient-SNAPSHOT/workspace/target/checkout/target/generated-sources/axis2/wsdl2code/src/net/ihe/gazelle/ws/client/GazelleTRMServiceStub.java:9239: warning: no description for @param
[INFO] [ERROR]          * @param parentQName
[INFO] [ERROR]            ^
[INFO] [ERROR] /home/jenkins/.hudson/jobs/GazelleTRMClient-SNAPSHOT/workspace/target/checkout/target/generated-sources/axis2/wsdl2code/src/net/ihe/gazelle/ws/client/GazelleTRMServiceStub.java:9240: warning: no description for @param
[INFO] [ERROR]          * @param factory
[INFO] [ERROR]            ^
[INFO] [ERROR] /home/jenkins/.hudson/jobs/GazelleTRMClient-SNAPSHOT/workspace/target/checkout/target/generated-sources/axis2/wsdl2code/src/net/ihe/gazelle/ws/client/GazelleTRMServiceStub.java:9491: warning: no @param for reader
[INFO] [ERROR]             public static GetTestInstanceByIdE parse(
[INFO] [ERROR]                                                ^
[INFO] [ERROR] /home/jenkins/.hudson/jobs/GazelleTRMClient-SNAPSHOT/workspace/target/checkout/target/generated-sources/axis2/wsdl2code/src/net/ihe/gazelle/ws/client/GazelleTRMServiceStub.java:9491: warning: no @return
[INFO] [ERROR]             public static GetTestInstanceByIdE parse(
[INFO] [ERROR]                                                ^
[INFO] [ERROR] /home/jenkins/.hudson/jobs/GazelleTRMClient-SNAPSHOT/workspace/target/checkout/target/generated-sources/axis2/wsdl2code/src/net/ihe/gazelle/ws/client/GazelleTRMServiceStub.java:9491: warning: no @throws for java.lang.Exception
[INFO] [ERROR]             public static GetTestInstanceByIdE parse(
[INFO] [ERROR]                                                ^
[INFO] [ERROR] /home/jenkins/.hudson/jobs/GazelleTRMClient-SNAPSHOT/workspace/target/checkout/target/generated-sources/axis2/wsdl2code/src/net/ihe/gazelle/ws/client/GazelleTRMServiceStub.java:8844: warning: no description for @param
[INFO] [ERROR]          * @param parentQName
[INFO] [ERROR]            ^
[INFO] [ERROR] /home/jenkins/.hudson/jobs/GazelleTRMClient-SNAPSHOT/workspace/target/checkout/target/generated-sources/axis2/wsdl2code/src/net/ihe/gazelle/ws/client/GazelleTRMServiceStub.java:8845: warning: no description for @param
[INFO] [ERROR]          * @param factory
[INFO] [ERROR]            ^
[INFO] [ERROR] /home/jenkins/.hudson/jobs/GazelleTRMClient-SNAPSHOT/workspace/target/checkout/target/generated-sources/axis2/wsdl2code/src/net/ihe/gazelle/ws/client/GazelleTRMServiceStub.java:9125: warning: no @param for reader
[INFO] [ERROR]             public static GetTestInstanceByIdResponse parse(
[INFO] [ERROR]                                                       ^
[INFO] [ERROR] /home/jenkins/.hudson/jobs/GazelleTRMClient-SNAPSHOT/workspace/target/checkout/target/generated-sources/axis2/wsdl2code/src/net/ihe/gazelle/ws/client/GazelleTRMServiceStub.java:9125: warning: no @return
[INFO] [ERROR]             public static GetTestInstanceByIdResponse parse(
[INFO] [ERROR]                                                       ^
[INFO] [ERROR] /home/jenkins/.hudson/jobs/GazelleTRMClient-SNAPSHOT/workspace/target/checkout/target/generated-sources/axis2/wsdl2code/src/net/ihe/gazelle/ws/client/GazelleTRMServiceStub.java:9125: warning: no @throws for java.lang.Exception
[INFO] [ERROR]             public static GetTestInstanceByIdResponse parse(
[INFO] [ERROR]                                                       ^
[INFO] [ERROR] /home/jenkins/.hudson/jobs/GazelleTRMClient-SNAPSHOT/workspace/target/checkout/target/generated-sources/axis2/wsdl2code/src/net/ihe/gazelle/ws/client/GazelleTRMServiceStub.java:7425: warning: no description for @param
[INFO] [ERROR]          * @param parentQName
[INFO] [ERROR]            ^
[INFO] [ERROR] /home/jenkins/.hudson/jobs/GazelleTRMClient-SNAPSHOT/workspace/target/checkout/target/generated-sources/axis2/wsdl2code/src/net/ihe/gazelle/ws/client/GazelleTRMServiceStub.java:7426: warning: no description for @param
[INFO] [ERROR]          * @param factory
[INFO] [ERROR]            ^
[INFO] [ERROR] /home/jenkins/.hudson/jobs/GazelleTRMClient-SNAPSHOT/workspace/target/checkout/target/generated-sources/axis2/wsdl2code/src/net/ihe/gazelle/ws/client/GazelleTRMServiceStub.java:7677: warning: no @param for reader
[INFO] [ERROR]             public static GetTestInstanceByIdResponseE parse(
[INFO] [ERROR]                                                        ^
[INFO] [ERROR] /home/jenkins/.hudson/jobs/GazelleTRMClient-SNAPSHOT/workspace/target/checkout/target/generated-sources/axis2/wsdl2code/src/net/ihe/gazelle/ws/client/GazelleTRMServiceStub.java:7677: warning: no @return
[INFO] [ERROR]             public static GetTestInstanceByIdResponseE parse(
[INFO] [ERROR]                                                        ^
[INFO] [ERROR] /home/jenkins/.hudson/jobs/GazelleTRMClient-SNAPSHOT/workspace/target/checkout/target/generated-sources/axis2/wsdl2code/src/net/ihe/gazelle/ws/client/GazelleTRMServiceStub.java:7677: warning: no @throws for java.lang.Exception
[INFO] [ERROR]             public static GetTestInstanceByIdResponseE parse(
[INFO] [ERROR]                                                        ^
[INFO] [ERROR] /home/jenkins/.hudson/jobs/GazelleTRMClient-SNAPSHOT/workspace/target/checkout/target/generated-sources/axis2/wsdl2code/src/net/ihe/gazelle/ws/client/GazelleTRMServiceStub.java:16350: warning: no description for @param
[INFO] [ERROR]          * @param parentQName
[INFO] [ERROR]            ^
[INFO] [ERROR] /home/jenkins/.hudson/jobs/GazelleTRMClient-SNAPSHOT/workspace/target/checkout/target/generated-sources/axis2/wsdl2code/src/net/ihe/gazelle/ws/client/GazelleTRMServiceStub.java:16351: warning: no description for @param
[INFO] [ERROR]          * @param factory
[INFO] [ERROR]            ^
[INFO] [ERROR] /home/jenkins/.hudson/jobs/GazelleTRMClient-SNAPSHOT/workspace/target/checkout/target/generated-sources/axis2/wsdl2code/src/net/ihe/gazelle/ws/client/GazelleTRMServiceStub.java:16634: warning: no @param for reader
[INFO] [ERROR]             public static GetTestInstancesByTestingSession parse(
[INFO] [ERROR]                                                            ^
[INFO] [ERROR] /home/jenkins/.hudson/jobs/GazelleTRMClient-SNAPSHOT/workspace/target/checkout/target/generated-sources/axis2/wsdl2code/src/net/ihe/gazelle/ws/client/GazelleTRMServiceStub.java:16634: warning: no @return
[INFO] [ERROR]             public static GetTestInstancesByTestingSession parse(
[INFO] [ERROR]                                                            ^
[INFO] [ERROR] /home/jenkins/.hudson/jobs/GazelleTRMClient-SNAPSHOT/workspace/target/checkout/target/generated-sources/axis2/wsdl2code/src/net/ihe/gazelle/ws/client/GazelleTRMServiceStub.java:16634: warning: no @throws for java.lang.Exception
[INFO] [ERROR]             public static GetTestInstancesByTestingSession parse(
[INFO] [ERROR]                                                            ^
[INFO] [ERROR] /home/jenkins/.hudson/jobs/GazelleTRMClient-SNAPSHOT/workspace/target/checkout/target/generated-sources/axis2/wsdl2code/src/net/ihe/gazelle/ws/client/GazelleTRMServiceStub.java:12966: warning: no description for @param
[INFO] [ERROR]          * @param parentQName
[INFO] [ERROR]            ^
[INFO] [ERROR] /home/jenkins/.hudson/jobs/GazelleTRMClient-SNAPSHOT/workspace/target/checkout/target/generated-sources/axis2/wsdl2code/src/net/ihe/gazelle/ws/client/GazelleTRMServiceStub.java:12967: warning: no description for @param
[INFO] [ERROR]          * @param factory
[INFO] [ERROR]            ^
[INFO] [ERROR] /home/jenkins/.hudson/jobs/GazelleTRMClient-SNAPSHOT/workspace/target/checkout/target/generated-sources/axis2/wsdl2code/src/net/ihe/gazelle/ws/client/GazelleTRMServiceStub.java:13218: warning: no @param for reader
[INFO] [ERROR]             public static GetTestInstancesByTestingSessionE parse(
[INFO] [ERROR]                                                             ^
[INFO] [ERROR] /home/jenkins/.hudson/jobs/GazelleTRMClient-SNAPSHOT/workspace/target/checkout/target/generated-sources/axis2/wsdl2code/src/net/ihe/gazelle/ws/client/GazelleTRMServiceStub.java:13218: warning: no @return
[INFO] [ERROR]             public static GetTestInstancesByTestingSessionE parse(
[INFO] [ERROR]                                                             ^
[INFO] [ERROR] /home/jenkins/.hudson/jobs/GazelleTRMClient-SNAPSHOT/workspace/target/checkout/target/generated-sources/axis2/wsdl2code/src/net/ihe/gazelle/ws/client/GazelleTRMServiceStub.java:13218: warning: no @throws for java.lang.Exception
[INFO] [ERROR]             public static GetTestInstancesByTestingSessionE parse(
[INFO] [ERROR]                                                             ^
[INFO] [ERROR] /home/jenkins/.hudson/jobs/GazelleTRMClient-SNAPSHOT/workspace/target/checkout/target/generated-sources/axis2/wsdl2code/src/net/ihe/gazelle/ws/client/GazelleTRMServiceStub.java:8433: warning: no description for @param
[INFO] [ERROR]          * @param parentQName
[INFO] [ERROR]            ^
[INFO] [ERROR] /home/jenkins/.hudson/jobs/GazelleTRMClient-SNAPSHOT/workspace/target/checkout/target/generated-sources/axis2/wsdl2code/src/net/ihe/gazelle/ws/client/GazelleTRMServiceStub.java:8434: warning: no description for @param
[INFO] [ERROR]          * @param factory
[INFO] [ERROR]            ^
[INFO] [ERROR] /home/jenkins/.hudson/jobs/GazelleTRMClient-SNAPSHOT/workspace/target/checkout/target/generated-sources/axis2/wsdl2code/src/net/ihe/gazelle/ws/client/GazelleTRMServiceStub.java:8714: warning: no @param for reader
[INFO] [ERROR]             public static GetTestInstancesByTestingSessionResponse parse(
[INFO] [ERROR]                                                                    ^
[INFO] [ERROR] /home/jenkins/.hudson/jobs/GazelleTRMClient-SNAPSHOT/workspace/target/checkout/target/generated-sources/axis2/wsdl2code/src/net/ihe/gazelle/ws/client/GazelleTRMServiceStub.java:8714: warning: no @return
[INFO] [ERROR]             public static GetTestInstancesByTestingSessionResponse parse(
[INFO] [ERROR]                                                                    ^
[INFO] [ERROR] /home/jenkins/.hudson/jobs/GazelleTRMClient-SNAPSHOT/workspace/target/checkout/target/generated-sources/axis2/wsdl2code/src/net/ihe/gazelle/ws/client/GazelleTRMServiceStub.java:8714: warning: no @throws for java.lang.Exception
[INFO] [ERROR]             public static GetTestInstancesByTestingSessionResponse parse(
[INFO] [ERROR]                                                                    ^
[INFO] [ERROR] /home/jenkins/.hudson/jobs/GazelleTRMClient-SNAPSHOT/workspace/target/checkout/target/generated-sources/axis2/wsdl2code/src/net/ihe/gazelle/ws/client/GazelleTRMServiceStub.java:16764: warning: no description for @param
[INFO] [ERROR]          * @param parentQName
[INFO] [ERROR]            ^
[INFO] [ERROR] /home/jenkins/.hudson/jobs/GazelleTRMClient-SNAPSHOT/workspace/target/checkout/target/generated-sources/axis2/wsdl2code/src/net/ihe/gazelle/ws/client/GazelleTRMServiceStub.java:16765: warning: no description for @param
[INFO] [ERROR]          * @param factory
[INFO] [ERROR]            ^
[INFO] [ERROR] /home/jenkins/.hudson/jobs/GazelleTRMClient-SNAPSHOT/workspace/target/checkout/target/generated-sources/axis2/wsdl2code/src/net/ihe/gazelle/ws/client/GazelleTRMServiceStub.java:17017: warning: no @param for reader
[INFO] [ERROR]             public static GetTestInstancesByTestingSessionResponseE parse(
[INFO] [ERROR]                                                                     ^
[INFO] [ERROR] /home/jenkins/.hudson/jobs/GazelleTRMClient-SNAPSHOT/workspace/target/checkout/target/generated-sources/axis2/wsdl2code/src/net/ihe/gazelle/ws/client/GazelleTRMServiceStub.java:17017: warning: no @return
[INFO] [ERROR]             public static GetTestInstancesByTestingSessionResponseE parse(
[INFO] [ERROR]                                                                     ^
[INFO] [ERROR] /home/jenkins/.hudson/jobs/GazelleTRMClient-SNAPSHOT/workspace/target/checkout/target/generated-sources/axis2/wsdl2code/src/net/ihe/gazelle/ws/client/GazelleTRMServiceStub.java:17017: warning: no @throws for java.lang.Exception
[INFO] [ERROR]             public static GetTestInstancesByTestingSessionResponseE parse(
[INFO] [ERROR]                                                                     ^
[INFO] [ERROR] /home/jenkins/.hudson/jobs/GazelleTRMClient-SNAPSHOT/workspace/target/checkout/target/generated-sources/axis2/wsdl2code/src/net/ihe/gazelle/ws/client/GazelleTRMServiceStub.java:12221: warning: no description for @param
[INFO] [ERROR]          * @param parentQName
[INFO] [ERROR]            ^
[INFO] [ERROR] /home/jenkins/.hudson/jobs/GazelleTRMClient-SNAPSHOT/workspace/target/checkout/target/generated-sources/axis2/wsdl2code/src/net/ihe/gazelle/ws/client/GazelleTRMServiceStub.java:12222: warning: no description for @param
[INFO] [ERROR]          * @param factory
[INFO] [ERROR]            ^
[INFO] [ERROR] /home/jenkins/.hudson/jobs/GazelleTRMClient-SNAPSHOT/workspace/target/checkout/target/generated-sources/axis2/wsdl2code/src/net/ihe/gazelle/ws/client/GazelleTRMServiceStub.java:12505: warning: no @param for reader
[INFO] [ERROR]             public static SOAPException parse(
[INFO] [ERROR]                                         ^
[INFO] [ERROR] 
[INFO] [ERROR] Command line was: /usr/lib/jvm/java-8-oracle/jre/../bin/javadoc @options @packages
[INFO] [ERROR] 
[INFO] [ERROR] Refer to the generated Javadoc files in '/home/jenkins/.hudson/jobs/GazelleTRMClient-SNAPSHOT/workspace/target/checkout/target/apidocs' dir.
[INFO] [ERROR] -> [Help 1]
[INFO] [ERROR] 
[INFO] [ERROR] To see the full stack trace of the errors, re-run Maven with the -e switch.
[INFO] [ERROR] Re-run Maven using the -X switch to enable full debug logging.
[INFO] [ERROR] 
[INFO] [ERROR] For more information about the errors and possible solutions, please read the following articles:
[INFO] [ERROR] [Help 1] http://cwiki.apache.org/confluence/display/MAVEN/MojoExecutionException
[WARNING] Attempt to (de-)serialize anonymous class hudson.maven.reporters.MavenArtifactArchiver$2; see: https://jenkins.io/redirect/serialization-of-anonymous-classes/
[WARNING] Attempt to (de-)serialize anonymous class hudson.maven.reporters.MavenFingerprinter$1; see: https://jenkins.io/redirect/serialization-of-anonymous-classes/
[BFA] Scanning build for known causes...
[BFA] No failure causes found
[BFA] Done. 0s
Started calculate disk usage of build
Finished Calculation of disk usage of build in 0 seconds
Started calculate disk usage of workspace
Finished Calculation of disk usage of workspace in 0 seconds
[INFO] ------------------------------------------------------------------------
[INFO] BUILD FAILURE
[INFO] ------------------------------------------------------------------------
[INFO] Total time: 51.056 s
[INFO] Finished at: 2018-04-12T15:22:36+02:00
[INFO] Final Memory: 16M/397M
[INFO] ------------------------------------------------------------------------
[ERROR] Failed to execute goal org.apache.maven.plugins:maven-release-plugin:2.3.2:perform (default-cli) on project GazelleTRMClient: Maven execution failed, exit code: '1' -> [Help 1]
[ERROR] 
[ERROR] To see the full stack trace of the errors, re-run Maven with the -e switch.
[JENKINS] Archiving /home/jenkins/.hudson/jobs/GazelleTRMClient-SNAPSHOT/workspace/pom.xml to net.ihe.gazelle.maven/GazelleTRMClient/1.1.0-SNAPSHOT/GazelleTRMClient-1.1.0-SNAPSHOT.pom
[ERROR] Re-run Maven using the -X switch to enable full debug logging.
[ERROR] 
[ERROR] For more information about the errors and possible solutions, please read the following articles:
[ERROR] [Help 1] http://cwiki.apache.org/confluence/display/MAVEN/MojoExecutionException
channel stopped
WARN: Unable to locate 'report-task.txt' in the workspace. Did the SonarScanner succedeed?
[BFA] Scanning build for known causes...
[BFA] No failure causes found
[BFA] Done. 0s
Started calculate disk usage of build
Finished Calculation of disk usage of build in 0 seconds
Started calculate disk usage of workspace
Finished Calculation of disk usage of workspace in 0 seconds
Sending e-mails to: abderrazek.boufahja@ihe-europe.net anne-gaelle.berge@ihe-europe.net cel@kereval.com eric.poiseau@inria.fr guillaume.thomazon@ihe-europe.net hra@kereval.com mtc@kereval.com yct@kereval.com
Finished: FAILURE