SuccessConsole Output

Established TCP socket on 42058
Java HotSpot(TM) 64-Bit Server VM warning: ignoring option MaxPermSize=1024m; support was removed in 8.0
<===[JENKINS REMOTING CAPACITY]===>channel started
Executing Maven:  -B -f /home/jenkins/.hudson/jobs/GazelleTRMClient-SNAPSHOT/workspace/pom.xml clean install org.sonarsource.scanner.maven:sonar-maven-plugin:sonar
[INFO] Scanning for projects...
[INFO] 
[INFO] ------------------------------------------------------------------------
[INFO] Building GazelleTRMClient 1.1.1-SNAPSHOT
[INFO] ------------------------------------------------------------------------
[INFO] 
[INFO] --- maven-clean-plugin:2.5:clean (default-clean) @ GazelleTRMClient ---
[INFO] 
[INFO] --- axis2-wsdl2code-maven-plugin:1.7.6:wsdl2code (GazelleTRM) @ GazelleTRMClient ---
Retrieving document at '/home/jenkins/.hudson/jobs/GazelleTRMClient-SNAPSHOT/workspace/src/main/wsdl/gazelleTRM.wsdl'.
log4j:WARN No appenders could be found for logger (org.apache.axiom.locator.DefaultOMMetaFactoryLocator).
log4j:WARN Please initialize the log4j system properly.
[INFO] 
[INFO] --- maven-resources-plugin:2.6:resources (default-resources) @ GazelleTRMClient ---
[WARNING] Using platform encoding (UTF8 actually) to copy filtered resources, i.e. build is platform dependent!
[INFO] Copying 0 resource
[INFO] 
[INFO] --- maven-compiler-plugin:3.5.1:compile (default-compile) @ GazelleTRMClient ---
[INFO] Changes detected - recompiling the module!
[WARNING] File encoding has not been set, using platform encoding UTF8, i.e. build is platform dependent!
[INFO] Compiling 4 source files to /home/jenkins/.hudson/jobs/GazelleTRMClient-SNAPSHOT/workspace/target/classes
[INFO] 
[INFO] --- maven-resources-plugin:2.6:testResources (default-testResources) @ GazelleTRMClient ---
[WARNING] Using platform encoding (UTF8 actually) to copy filtered resources, i.e. build is platform dependent!
[INFO] skip non existing resourceDirectory /home/jenkins/.hudson/jobs/GazelleTRMClient-SNAPSHOT/workspace/src/test/resources
[INFO] 
[INFO] --- maven-compiler-plugin:3.5.1:testCompile (default-testCompile) @ GazelleTRMClient ---
[INFO] Changes detected - recompiling the module!
[WARNING] File encoding has not been set, using platform encoding UTF8, i.e. build is platform dependent!
[INFO] Compiling 1 source file to /home/jenkins/.hudson/jobs/GazelleTRMClient-SNAPSHOT/workspace/target/test-classes
[INFO] 
[INFO] --- maven-surefire-plugin:2.12.4:test (default-test) @ GazelleTRMClient ---
[INFO] Surefire report directory: /home/jenkins/.hudson/jobs/GazelleTRMClient-SNAPSHOT/workspace/target/surefire-reports

-------------------------------------------------------
 T E S T S
-------------------------------------------------------
Running net.ihe.gazelle.ws.client.GazelleTRMServiceStubTest
SLF4J: Failed to load class "org.slf4j.impl.StaticLoggerBinder".
SLF4J: Defaulting to no-operation (NOP) logger implementation
SLF4J: See http://www.slf4j.org/codes.html#StaticLoggerBinder for further details.
15:40:48,382 DEBUG [main] DefaultOMMetaFactoryLocator:77 - Starting class path based discovery
15:40:48,387 DEBUG [main] ImplementationFactory:79 - Loading jar:file:/home/jenkins/.m2/repository/org/apache/ws/commons/axiom/axiom-impl/1.2.19/axiom-impl-1.2.19.jar!/META-INF/axiom.xml
15:40:48,473 DEBUG [main] ImplementationFactory:125 - Discovered implementations: [llom(metaFactory=org.apache.axiom.om.impl.llom.factory.OMLinkedListMetaFactory,features=[default(priority=100)])]
15:40:48,474 DEBUG [main] ImplementationFactory:79 - Loading jar:file:/home/jenkins/.m2/repository/org/apache/ws/commons/axiom/axiom-dom/1.2.19/axiom-dom-1.2.19.jar!/META-INF/axiom.xml
15:40:48,532 DEBUG [main] ImplementationFactory:125 - Discovered implementations: [doom(metaFactory=org.apache.axiom.om.impl.dom.factory.OMDOMMetaFactory,features=[dom(priority=100)])]
15:40:48,533 DEBUG [main] PriorityBasedOMMetaFactoryLocator:59 - Meta factories:
  default: org.apache.axiom.om.impl.llom.factory.OMLinkedListMetaFactory
  dom: org.apache.axiom.om.impl.dom.factory.OMDOMMetaFactory
15:40:48,559 DEBUG [main] AxisOperation:485 - Entry: AxisOperation::getInputAction
15:40:48,560 DEBUG [main] AxisOperation:506 - Exit: AxisOperation::getInputAction null
15:40:48,560 DEBUG [main] AxisOperation:467 - Entry: AxisOperation::setSoapAction, previous soapAction: null updated soapAction: urn:anonRobustOp
15:40:48,561 DEBUG [main] AxisOperation:471 - Exit: AxisOperation::setSoapAction
15:40:48,562 DEBUG [main] AxisService:872 - mapActionToOperation: Mapping Action to Operation: action: anonRobustOp; operation: org.apache.axis2.description.RobustOutOnlyAxisOperation@8dbdac1named: {http://ws.apache.org/namespaces/axis2}anonRobustOp
15:40:48,593 DEBUG [main] AxisService:878 - DEBUG_FRAME = org.apache.axis2.util.JavaUtils.callStackToString(JavaUtils.java:564)
	DEBUG_FRAME = org.apache.axis2.description.AxisService.mapActionToOperation(AxisService.java:878)
	DEBUG_FRAME = org.apache.axis2.description.AxisService.addOperation(AxisService.java:724)
	DEBUG_FRAME = org.apache.axis2.client.Stub.addAnonymousOperations(Stub.java:234)
	DEBUG_FRAME = net.ihe.gazelle.ws.client.GazelleTRMServiceStub.populateAxisService(GazelleTRMServiceStub.java:94)
	DEBUG_FRAME = net.ihe.gazelle.ws.client.GazelleTRMServiceStub.<init>(GazelleTRMServiceStub.java:40)
	DEBUG_FRAME = net.ihe.gazelle.ws.client.GazelleTRMServiceStub.<init>(GazelleTRMServiceStub.java:29)
	DEBUG_FRAME = net.ihe.gazelle.ws.client.GazelleTRMServiceStub.<init>(GazelleTRMServiceStub.java:75)
	DEBUG_FRAME = net.ihe.gazelle.ws.client.GazelleTRMServiceClient.<init>(GazelleTRMServiceClient.java:11)
	DEBUG_FRAME = net.ihe.gazelle.ws.client.GazelleTRMServiceStubTest.getSystemIsAToolTest(GazelleTRMServiceStubTest.java:21)
	DEBUG_FRAME = sun.reflect.NativeMethodAccessorImpl.invoke0(Native Method)
	DEBUG_FRAME = sun.reflect.NativeMethodAccessorImpl.invoke(NativeMethodAccessorImpl.java:62)
	DEBUG_FRAME = sun.reflect.DelegatingMethodAccessorImpl.invoke(DelegatingMethodAccessorImpl.java:43)
	DEBUG_FRAME = java.lang.reflect.Method.invoke(Method.java:498)
	DEBUG_FRAME = org.junit.runners.model.FrameworkMethod$1.runReflectiveCall(FrameworkMethod.java:44)
	DEBUG_FRAME = org.junit.internal.runners.model.ReflectiveCallable.run(ReflectiveCallable.java:15)
	DEBUG_FRAME = org.junit.runners.model.FrameworkMethod.invokeExplosively(FrameworkMethod.java:41)
	DEBUG_FRAME = org.junit.internal.runners.statements.InvokeMethod.evaluate(InvokeMethod.java:20)
	DEBUG_FRAME = org.junit.runners.BlockJUnit4ClassRunner.runNotIgnored(BlockJUnit4ClassRunner.java:79)
	DEBUG_FRAME = org.junit.runners.BlockJUnit4ClassRunner.runChild(BlockJUnit4ClassRunner.java:71)
	DEBUG_FRAME = org.junit.runners.BlockJUnit4ClassRunner.runChild(BlockJUnit4ClassRunner.java:49)
	DEBUG_FRAME = org.junit.runners.ParentRunner$3.run(ParentRunner.java:193)
	DEBUG_FRAME = org.junit.runners.ParentRunner$1.schedule(ParentRunner.java:52)
	DEBUG_FRAME = org.junit.runners.ParentRunner.runChildren(ParentRunner.java:191)
	DEBUG_FRAME = org.junit.runners.ParentRunner.access$000(ParentRunner.java:42)
	DEBUG_FRAME = org.junit.runners.ParentRunner$2.evaluate(ParentRunner.java:184)
	DEBUG_FRAME = org.junit.runners.ParentRunner.run(ParentRunner.java:236)
	DEBUG_FRAME = org.apache.maven.surefire.junit4.JUnit4Provider.execute(JUnit4Provider.java:252)
	DEBUG_FRAME = org.apache.maven.surefire.junit4.JUnit4Provider.executeTestSet(JUnit4Provider.java:141)
	DEBUG_FRAME = org.apache.maven.surefire.junit4.JUnit4Provider.invoke(JUnit4Provider.java:112)
	DEBUG_FRAME = sun.reflect.NativeMethodAccessorImpl.invoke0(Native Method)
	DEBUG_FRAME = sun.reflect.NativeMethodAccessorImpl.invoke(NativeMethodAccessorImpl.java:62)
	DEBUG_FRAME = sun.reflect.DelegatingMethodAccessorImpl.invoke(DelegatingMethodAccessorImpl.java:43)
	DEBUG_FRAME = java.lang.reflect.Method.invoke(Method.java:498)
	DEBUG_FRAME = org.apache.maven.surefire.util.ReflectionUtils.invokeMethodWithArray(ReflectionUtils.java:189)
	DEBUG_FRAME = org.apache.maven.surefire.booter.ProviderFactory$ProviderProxy.invoke(ProviderFactory.java:165)
	DEBUG_FRAME = org.apache.maven.surefire.booter.ProviderFactory.invokeProvider(ProviderFactory.java:85)
	DEBUG_FRAME = org.apache.maven.surefire.booter.ForkedBooter.runSuitesInProcess(ForkedBooter.java:115)
	DEBUG_FRAME = org.apache.maven.surefire.booter.ForkedBooter.main(ForkedBooter.java:75)

15:40:48,594 DEBUG [main] AxisOperation:485 - Entry: AxisOperation::getInputAction
15:40:48,595 DEBUG [main] AxisOperation:490 - Debug: AxisOperation::getInputAction - using soapAction
15:40:48,595 DEBUG [main] AxisOperation:506 - Exit: AxisOperation::getInputAction urn:anonRobustOp
15:40:48,595 DEBUG [main] AxisService:872 - mapActionToOperation: Mapping Action to Operation: action: urn:anonRobustOp; operation: org.apache.axis2.description.RobustOutOnlyAxisOperation@8dbdac1named: {http://ws.apache.org/namespaces/axis2}anonRobustOp
15:40:48,596 DEBUG [main] AxisService:878 - DEBUG_FRAME = org.apache.axis2.util.JavaUtils.callStackToString(JavaUtils.java:564)
	DEBUG_FRAME = org.apache.axis2.description.AxisService.mapActionToOperation(AxisService.java:878)
	DEBUG_FRAME = org.apache.axis2.description.AxisService.addOperation(AxisService.java:728)
	DEBUG_FRAME = org.apache.axis2.client.Stub.addAnonymousOperations(Stub.java:234)
	DEBUG_FRAME = net.ihe.gazelle.ws.client.GazelleTRMServiceStub.populateAxisService(GazelleTRMServiceStub.java:94)
	DEBUG_FRAME = net.ihe.gazelle.ws.client.GazelleTRMServiceStub.<init>(GazelleTRMServiceStub.java:40)
	DEBUG_FRAME = net.ihe.gazelle.ws.client.GazelleTRMServiceStub.<init>(GazelleTRMServiceStub.java:29)
	DEBUG_FRAME = net.ihe.gazelle.ws.client.GazelleTRMServiceStub.<init>(GazelleTRMServiceStub.java:75)
	DEBUG_FRAME = net.ihe.gazelle.ws.client.GazelleTRMServiceClient.<init>(GazelleTRMServiceClient.java:11)
	DEBUG_FRAME = net.ihe.gazelle.ws.client.GazelleTRMServiceStubTest.getSystemIsAToolTest(GazelleTRMServiceStubTest.java:21)
	DEBUG_FRAME = sun.reflect.NativeMethodAccessorImpl.invoke0(Native Method)
	DEBUG_FRAME = sun.reflect.NativeMethodAccessorImpl.invoke(NativeMethodAccessorImpl.java:62)
	DEBUG_FRAME = sun.reflect.DelegatingMethodAccessorImpl.invoke(DelegatingMethodAccessorImpl.java:43)
	DEBUG_FRAME = java.lang.reflect.Method.invoke(Method.java:498)
	DEBUG_FRAME = org.junit.runners.model.FrameworkMethod$1.runReflectiveCall(FrameworkMethod.java:44)
	DEBUG_FRAME = org.junit.internal.runners.model.ReflectiveCallable.run(ReflectiveCallable.java:15)
	DEBUG_FRAME = org.junit.runners.model.FrameworkMethod.invokeExplosively(FrameworkMethod.java:41)
	DEBUG_FRAME = org.junit.internal.runners.statements.InvokeMethod.evaluate(InvokeMethod.java:20)
	DEBUG_FRAME = org.junit.runners.BlockJUnit4ClassRunner.runNotIgnored(BlockJUnit4ClassRunner.java:79)
	DEBUG_FRAME = org.junit.runners.BlockJUnit4ClassRunner.runChild(BlockJUnit4ClassRunner.java:71)
	DEBUG_FRAME = org.junit.runners.BlockJUnit4ClassRunner.runChild(BlockJUnit4ClassRunner.java:49)
	DEBUG_FRAME = org.junit.runners.ParentRunner$3.run(ParentRunner.java:193)
	DEBUG_FRAME = org.junit.runners.ParentRunner$1.schedule(ParentRunner.java:52)
	DEBUG_FRAME = org.junit.runners.ParentRunner.runChildren(ParentRunner.java:191)
	DEBUG_FRAME = org.junit.runners.ParentRunner.access$000(ParentRunner.java:42)
	DEBUG_FRAME = org.junit.runners.ParentRunner$2.evaluate(ParentRunner.java:184)
	DEBUG_FRAME = org.junit.runners.ParentRunner.run(ParentRunner.java:236)
	DEBUG_FRAME = org.apache.maven.surefire.junit4.JUnit4Provider.execute(JUnit4Provider.java:252)
	DEBUG_FRAME = org.apache.maven.surefire.junit4.JUnit4Provider.executeTestSet(JUnit4Provider.java:141)
	DEBUG_FRAME = org.apache.maven.surefire.junit4.JUnit4Provider.invoke(JUnit4Provider.java:112)
	DEBUG_FRAME = sun.reflect.NativeMethodAccessorImpl.invoke0(Native Method)
	DEBUG_FRAME = sun.reflect.NativeMethodAccessorImpl.invoke(NativeMethodAccessorImpl.java:62)
	DEBUG_FRAME = sun.reflect.DelegatingMethodAccessorImpl.invoke(DelegatingMethodAccessorImpl.java:43)
	DEBUG_FRAME = java.lang.reflect.Method.invoke(Method.java:498)
	DEBUG_FRAME = org.apache.maven.surefire.util.ReflectionUtils.invokeMethodWithArray(ReflectionUtils.java:189)
	DEBUG_FRAME = org.apache.maven.surefire.booter.ProviderFactory$ProviderProxy.invoke(ProviderFactory.java:165)
	DEBUG_FRAME = org.apache.maven.surefire.booter.ProviderFactory.invokeProvider(ProviderFactory.java:85)
	DEBUG_FRAME = org.apache.maven.surefire.booter.ForkedBooter.runSuitesInProcess(ForkedBooter.java:115)
	DEBUG_FRAME = org.apache.maven.surefire.booter.ForkedBooter.main(ForkedBooter.java:75)

15:40:48,597 DEBUG [main] AxisService:673 - Client-defined operation name matches default operation name. this may cause interoperability issues.  Name is: {http://ws.apache.org/namespaces/axis2}anonOutonlyOp
15:40:48,598 DEBUG [main] AxisOperation:485 - Entry: AxisOperation::getInputAction
15:40:48,598 DEBUG [main] AxisOperation:506 - Exit: AxisOperation::getInputAction null
15:40:48,598 DEBUG [main] AxisOperation:467 - Entry: AxisOperation::setSoapAction, previous soapAction: null updated soapAction: urn:anonOutonlyOp
15:40:48,599 DEBUG [main] AxisOperation:471 - Exit: AxisOperation::setSoapAction
15:40:48,599 DEBUG [main] AxisService:872 - mapActionToOperation: Mapping Action to Operation: action: anonOutonlyOp; operation: org.apache.axis2.description.OutOnlyAxisOperation@4f6ee6e4named: {http://ws.apache.org/namespaces/axis2}anonOutonlyOp
15:40:48,600 DEBUG [main] AxisService:878 - DEBUG_FRAME = org.apache.axis2.util.JavaUtils.callStackToString(JavaUtils.java:564)
	DEBUG_FRAME = org.apache.axis2.description.AxisService.mapActionToOperation(AxisService.java:878)
	DEBUG_FRAME = org.apache.axis2.description.AxisService.addOperation(AxisService.java:724)
	DEBUG_FRAME = org.apache.axis2.client.Stub.addAnonymousOperations(Stub.java:237)
	DEBUG_FRAME = net.ihe.gazelle.ws.client.GazelleTRMServiceStub.populateAxisService(GazelleTRMServiceStub.java:94)
	DEBUG_FRAME = net.ihe.gazelle.ws.client.GazelleTRMServiceStub.<init>(GazelleTRMServiceStub.java:40)
	DEBUG_FRAME = net.ihe.gazelle.ws.client.GazelleTRMServiceStub.<init>(GazelleTRMServiceStub.java:29)
	DEBUG_FRAME = net.ihe.gazelle.ws.client.GazelleTRMServiceStub.<init>(GazelleTRMServiceStub.java:75)
	DEBUG_FRAME = net.ihe.gazelle.ws.client.GazelleTRMServiceClient.<init>(GazelleTRMServiceClient.java:11)
	DEBUG_FRAME = net.ihe.gazelle.ws.client.GazelleTRMServiceStubTest.getSystemIsAToolTest(GazelleTRMServiceStubTest.java:21)
	DEBUG_FRAME = sun.reflect.NativeMethodAccessorImpl.invoke0(Native Method)
	DEBUG_FRAME = sun.reflect.NativeMethodAccessorImpl.invoke(NativeMethodAccessorImpl.java:62)
	DEBUG_FRAME = sun.reflect.DelegatingMethodAccessorImpl.invoke(DelegatingMethodAccessorImpl.java:43)
	DEBUG_FRAME = java.lang.reflect.Method.invoke(Method.java:498)
	DEBUG_FRAME = org.junit.runners.model.FrameworkMethod$1.runReflectiveCall(FrameworkMethod.java:44)
	DEBUG_FRAME = org.junit.internal.runners.model.ReflectiveCallable.run(ReflectiveCallable.java:15)
	DEBUG_FRAME = org.junit.runners.model.FrameworkMethod.invokeExplosively(FrameworkMethod.java:41)
	DEBUG_FRAME = org.junit.internal.runners.statements.InvokeMethod.evaluate(InvokeMethod.java:20)
	DEBUG_FRAME = org.junit.runners.BlockJUnit4ClassRunner.runNotIgnored(BlockJUnit4ClassRunner.java:79)
	DEBUG_FRAME = org.junit.runners.BlockJUnit4ClassRunner.runChild(BlockJUnit4ClassRunner.java:71)
	DEBUG_FRAME = org.junit.runners.BlockJUnit4ClassRunner.runChild(BlockJUnit4ClassRunner.java:49)
	DEBUG_FRAME = org.junit.runners.ParentRunner$3.run(ParentRunner.java:193)
	DEBUG_FRAME = org.junit.runners.ParentRunner$1.schedule(ParentRunner.java:52)
	DEBUG_FRAME = org.junit.runners.ParentRunner.runChildren(ParentRunner.java:191)
	DEBUG_FRAME = org.junit.runners.ParentRunner.access$000(ParentRunner.java:42)
	DEBUG_FRAME = org.junit.runners.ParentRunner$2.evaluate(ParentRunner.java:184)
	DEBUG_FRAME = org.junit.runners.ParentRunner.run(ParentRunner.java:236)
	DEBUG_FRAME = org.apache.maven.surefire.junit4.JUnit4Provider.execute(JUnit4Provider.java:252)
	DEBUG_FRAME = org.apache.maven.surefire.junit4.JUnit4Provider.executeTestSet(JUnit4Provider.java:141)
	DEBUG_FRAME = org.apache.maven.surefire.junit4.JUnit4Provider.invoke(JUnit4Provider.java:112)
	DEBUG_FRAME = sun.reflect.NativeMethodAccessorImpl.invoke0(Native Method)
	DEBUG_FRAME = sun.reflect.NativeMethodAccessorImpl.invoke(NativeMethodAccessorImpl.java:62)
	DEBUG_FRAME = sun.reflect.DelegatingMethodAccessorImpl.invoke(DelegatingMethodAccessorImpl.java:43)
	DEBUG_FRAME = java.lang.reflect.Method.invoke(Method.java:498)
	DEBUG_FRAME = org.apache.maven.surefire.util.ReflectionUtils.invokeMethodWithArray(ReflectionUtils.java:189)
	DEBUG_FRAME = org.apache.maven.surefire.booter.ProviderFactory$ProviderProxy.invoke(ProviderFactory.java:165)
	DEBUG_FRAME = org.apache.maven.surefire.booter.ProviderFactory.invokeProvider(ProviderFactory.java:85)
	DEBUG_FRAME = org.apache.maven.surefire.booter.ForkedBooter.runSuitesInProcess(ForkedBooter.java:115)
	DEBUG_FRAME = org.apache.maven.surefire.booter.ForkedBooter.main(ForkedBooter.java:75)

15:40:48,600 DEBUG [main] AxisOperation:485 - Entry: AxisOperation::getInputAction
15:40:48,600 DEBUG [main] AxisOperation:490 - Debug: AxisOperation::getInputAction - using soapAction
15:40:48,601 DEBUG [main] AxisOperation:506 - Exit: AxisOperation::getInputAction urn:anonOutonlyOp
15:40:48,601 DEBUG [main] AxisService:872 - mapActionToOperation: Mapping Action to Operation: action: urn:anonOutonlyOp; operation: org.apache.axis2.description.OutOnlyAxisOperation@4f6ee6e4named: {http://ws.apache.org/namespaces/axis2}anonOutonlyOp
15:40:48,601 DEBUG [main] AxisService:878 - DEBUG_FRAME = org.apache.axis2.util.JavaUtils.callStackToString(JavaUtils.java:564)
	DEBUG_FRAME = org.apache.axis2.description.AxisService.mapActionToOperation(AxisService.java:878)
	DEBUG_FRAME = org.apache.axis2.description.AxisService.addOperation(AxisService.java:728)
	DEBUG_FRAME = org.apache.axis2.client.Stub.addAnonymousOperations(Stub.java:237)
	DEBUG_FRAME = net.ihe.gazelle.ws.client.GazelleTRMServiceStub.populateAxisService(GazelleTRMServiceStub.java:94)
	DEBUG_FRAME = net.ihe.gazelle.ws.client.GazelleTRMServiceStub.<init>(GazelleTRMServiceStub.java:40)
	DEBUG_FRAME = net.ihe.gazelle.ws.client.GazelleTRMServiceStub.<init>(GazelleTRMServiceStub.java:29)
	DEBUG_FRAME = net.ihe.gazelle.ws.client.GazelleTRMServiceStub.<init>(GazelleTRMServiceStub.java:75)
	DEBUG_FRAME = net.ihe.gazelle.ws.client.GazelleTRMServiceClient.<init>(GazelleTRMServiceClient.java:11)
	DEBUG_FRAME = net.ihe.gazelle.ws.client.GazelleTRMServiceStubTest.getSystemIsAToolTest(GazelleTRMServiceStubTest.java:21)
	DEBUG_FRAME = sun.reflect.NativeMethodAccessorImpl.invoke0(Native Method)
	DEBUG_FRAME = sun.reflect.NativeMethodAccessorImpl.invoke(NativeMethodAccessorImpl.java:62)
	DEBUG_FRAME = sun.reflect.DelegatingMethodAccessorImpl.invoke(DelegatingMethodAccessorImpl.java:43)
	DEBUG_FRAME = java.lang.reflect.Method.invoke(Method.java:498)
	DEBUG_FRAME = org.junit.runners.model.FrameworkMethod$1.runReflectiveCall(FrameworkMethod.java:44)
	DEBUG_FRAME = org.junit.internal.runners.model.ReflectiveCallable.run(ReflectiveCallable.java:15)
	DEBUG_FRAME = org.junit.runners.model.FrameworkMethod.invokeExplosively(FrameworkMethod.java:41)
	DEBUG_FRAME = org.junit.internal.runners.statements.InvokeMethod.evaluate(InvokeMethod.java:20)
	DEBUG_FRAME = org.junit.runners.BlockJUnit4ClassRunner.runNotIgnored(BlockJUnit4ClassRunner.java:79)
	DEBUG_FRAME = org.junit.runners.BlockJUnit4ClassRunner.runChild(BlockJUnit4ClassRunner.java:71)
	DEBUG_FRAME = org.junit.runners.BlockJUnit4ClassRunner.runChild(BlockJUnit4ClassRunner.java:49)
	DEBUG_FRAME = org.junit.runners.ParentRunner$3.run(ParentRunner.java:193)
	DEBUG_FRAME = org.junit.runners.ParentRunner$1.schedule(ParentRunner.java:52)
	DEBUG_FRAME = org.junit.runners.ParentRunner.runChildren(ParentRunner.java:191)
	DEBUG_FRAME = org.junit.runners.ParentRunner.access$000(ParentRunner.java:42)
	DEBUG_FRAME = org.junit.runners.ParentRunner$2.evaluate(ParentRunner.java:184)
	DEBUG_FRAME = org.junit.runners.ParentRunner.run(ParentRunner.java:236)
	DEBUG_FRAME = org.apache.maven.surefire.junit4.JUnit4Provider.execute(JUnit4Provider.java:252)
	DEBUG_FRAME = org.apache.maven.surefire.junit4.JUnit4Provider.executeTestSet(JUnit4Provider.java:141)
	DEBUG_FRAME = org.apache.maven.surefire.junit4.JUnit4Provider.invoke(JUnit4Provider.java:112)
	DEBUG_FRAME = sun.reflect.NativeMethodAccessorImpl.invoke0(Native Method)
	DEBUG_FRAME = sun.reflect.NativeMethodAccessorImpl.invoke(NativeMethodAccessorImpl.java:62)
	DEBUG_FRAME = sun.reflect.DelegatingMethodAccessorImpl.invoke(DelegatingMethodAccessorImpl.java:43)
	DEBUG_FRAME = java.lang.reflect.Method.invoke(Method.java:498)
	DEBUG_FRAME = org.apache.maven.surefire.util.ReflectionUtils.invokeMethodWithArray(ReflectionUtils.java:189)
	DEBUG_FRAME = org.apache.maven.surefire.booter.ProviderFactory$ProviderProxy.invoke(ProviderFactory.java:165)
	DEBUG_FRAME = org.apache.maven.surefire.booter.ProviderFactory.invokeProvider(ProviderFactory.java:85)
	DEBUG_FRAME = org.apache.maven.surefire.booter.ForkedBooter.runSuitesInProcess(ForkedBooter.java:115)
	DEBUG_FRAME = org.apache.maven.surefire.booter.ForkedBooter.main(ForkedBooter.java:75)

15:40:48,602 DEBUG [main] AxisOperation:485 - Entry: AxisOperation::getInputAction
15:40:48,603 DEBUG [main] AxisOperation:506 - Exit: AxisOperation::getInputAction null
15:40:48,603 DEBUG [main] AxisOperation:467 - Entry: AxisOperation::setSoapAction, previous soapAction: null updated soapAction: urn:anonOutInOp
15:40:48,603 DEBUG [main] AxisOperation:471 - Exit: AxisOperation::setSoapAction
15:40:48,603 DEBUG [main] AxisService:872 - mapActionToOperation: Mapping Action to Operation: action: anonOutInOp; operation: org.apache.axis2.description.OutInAxisOperation@9f116ccnamed: {http://ws.apache.org/namespaces/axis2}anonOutInOp
15:40:48,604 DEBUG [main] AxisService:878 - DEBUG_FRAME = org.apache.axis2.util.JavaUtils.callStackToString(JavaUtils.java:564)
	DEBUG_FRAME = org.apache.axis2.description.AxisService.mapActionToOperation(AxisService.java:878)
	DEBUG_FRAME = org.apache.axis2.description.AxisService.addOperation(AxisService.java:724)
	DEBUG_FRAME = org.apache.axis2.client.Stub.addAnonymousOperations(Stub.java:240)
	DEBUG_FRAME = net.ihe.gazelle.ws.client.GazelleTRMServiceStub.populateAxisService(GazelleTRMServiceStub.java:94)
	DEBUG_FRAME = net.ihe.gazelle.ws.client.GazelleTRMServiceStub.<init>(GazelleTRMServiceStub.java:40)
	DEBUG_FRAME = net.ihe.gazelle.ws.client.GazelleTRMServiceStub.<init>(GazelleTRMServiceStub.java:29)
	DEBUG_FRAME = net.ihe.gazelle.ws.client.GazelleTRMServiceStub.<init>(GazelleTRMServiceStub.java:75)
	DEBUG_FRAME = net.ihe.gazelle.ws.client.GazelleTRMServiceClient.<init>(GazelleTRMServiceClient.java:11)
	DEBUG_FRAME = net.ihe.gazelle.ws.client.GazelleTRMServiceStubTest.getSystemIsAToolTest(GazelleTRMServiceStubTest.java:21)
	DEBUG_FRAME = sun.reflect.NativeMethodAccessorImpl.invoke0(Native Method)
	DEBUG_FRAME = sun.reflect.NativeMethodAccessorImpl.invoke(NativeMethodAccessorImpl.java:62)
	DEBUG_FRAME = sun.reflect.DelegatingMethodAccessorImpl.invoke(DelegatingMethodAccessorImpl.java:43)
	DEBUG_FRAME = java.lang.reflect.Method.invoke(Method.java:498)
	DEBUG_FRAME = org.junit.runners.model.FrameworkMethod$1.runReflectiveCall(FrameworkMethod.java:44)
	DEBUG_FRAME = org.junit.internal.runners.model.ReflectiveCallable.run(ReflectiveCallable.java:15)
	DEBUG_FRAME = org.junit.runners.model.FrameworkMethod.invokeExplosively(FrameworkMethod.java:41)
	DEBUG_FRAME = org.junit.internal.runners.statements.InvokeMethod.evaluate(InvokeMethod.java:20)
	DEBUG_FRAME = org.junit.runners.BlockJUnit4ClassRunner.runNotIgnored(BlockJUnit4ClassRunner.java:79)
	DEBUG_FRAME = org.junit.runners.BlockJUnit4ClassRunner.runChild(BlockJUnit4ClassRunner.java:71)
	DEBUG_FRAME = org.junit.runners.BlockJUnit4ClassRunner.runChild(BlockJUnit4ClassRunner.java:49)
	DEBUG_FRAME = org.junit.runners.ParentRunner$3.run(ParentRunner.java:193)
	DEBUG_FRAME = org.junit.runners.ParentRunner$1.schedule(ParentRunner.java:52)
	DEBUG_FRAME = org.junit.runners.ParentRunner.runChildren(ParentRunner.java:191)
	DEBUG_FRAME = org.junit.runners.ParentRunner.access$000(ParentRunner.java:42)
	DEBUG_FRAME = org.junit.runners.ParentRunner$2.evaluate(ParentRunner.java:184)
	DEBUG_FRAME = org.junit.runners.ParentRunner.run(ParentRunner.java:236)
	DEBUG_FRAME = org.apache.maven.surefire.junit4.JUnit4Provider.execute(JUnit4Provider.java:252)
	DEBUG_FRAME = org.apache.maven.surefire.junit4.JUnit4Provider.executeTestSet(JUnit4Provider.java:141)
	DEBUG_FRAME = org.apache.maven.surefire.junit4.JUnit4Provider.invoke(JUnit4Provider.java:112)
	DEBUG_FRAME = sun.reflect.NativeMethodAccessorImpl.invoke0(Native Method)
	DEBUG_FRAME = sun.reflect.NativeMethodAccessorImpl.invoke(NativeMethodAccessorImpl.java:62)
	DEBUG_FRAME = sun.reflect.DelegatingMethodAccessorImpl.invoke(DelegatingMethodAccessorImpl.java:43)
	DEBUG_FRAME = java.lang.reflect.Method.invoke(Method.java:498)
	DEBUG_FRAME = org.apache.maven.surefire.util.ReflectionUtils.invokeMethodWithArray(ReflectionUtils.java:189)
	DEBUG_FRAME = org.apache.maven.surefire.booter.ProviderFactory$ProviderProxy.invoke(ProviderFactory.java:165)
	DEBUG_FRAME = org.apache.maven.surefire.booter.ProviderFactory.invokeProvider(ProviderFactory.java:85)
	DEBUG_FRAME = org.apache.maven.surefire.booter.ForkedBooter.runSuitesInProcess(ForkedBooter.java:115)
	DEBUG_FRAME = org.apache.maven.surefire.booter.ForkedBooter.main(ForkedBooter.java:75)

15:40:48,605 DEBUG [main] AxisOperation:485 - Entry: AxisOperation::getInputAction
15:40:48,605 DEBUG [main] AxisOperation:490 - Debug: AxisOperation::getInputAction - using soapAction
15:40:48,605 DEBUG [main] AxisOperation:506 - Exit: AxisOperation::getInputAction urn:anonOutInOp
15:40:48,605 DEBUG [main] AxisService:872 - mapActionToOperation: Mapping Action to Operation: action: urn:anonOutInOp; operation: org.apache.axis2.description.OutInAxisOperation@9f116ccnamed: {http://ws.apache.org/namespaces/axis2}anonOutInOp
15:40:48,606 DEBUG [main] AxisService:878 - DEBUG_FRAME = org.apache.axis2.util.JavaUtils.callStackToString(JavaUtils.java:564)
	DEBUG_FRAME = org.apache.axis2.description.AxisService.mapActionToOperation(AxisService.java:878)
	DEBUG_FRAME = org.apache.axis2.description.AxisService.addOperation(AxisService.java:728)
	DEBUG_FRAME = org.apache.axis2.client.Stub.addAnonymousOperations(Stub.java:240)
	DEBUG_FRAME = net.ihe.gazelle.ws.client.GazelleTRMServiceStub.populateAxisService(GazelleTRMServiceStub.java:94)
	DEBUG_FRAME = net.ihe.gazelle.ws.client.GazelleTRMServiceStub.<init>(GazelleTRMServiceStub.java:40)
	DEBUG_FRAME = net.ihe.gazelle.ws.client.GazelleTRMServiceStub.<init>(GazelleTRMServiceStub.java:29)
	DEBUG_FRAME = net.ihe.gazelle.ws.client.GazelleTRMServiceStub.<init>(GazelleTRMServiceStub.java:75)
	DEBUG_FRAME = net.ihe.gazelle.ws.client.GazelleTRMServiceClient.<init>(GazelleTRMServiceClient.java:11)
	DEBUG_FRAME = net.ihe.gazelle.ws.client.GazelleTRMServiceStubTest.getSystemIsAToolTest(GazelleTRMServiceStubTest.java:21)
	DEBUG_FRAME = sun.reflect.NativeMethodAccessorImpl.invoke0(Native Method)
	DEBUG_FRAME = sun.reflect.NativeMethodAccessorImpl.invoke(NativeMethodAccessorImpl.java:62)
	DEBUG_FRAME = sun.reflect.DelegatingMethodAccessorImpl.invoke(DelegatingMethodAccessorImpl.java:43)
	DEBUG_FRAME = java.lang.reflect.Method.invoke(Method.java:498)
	DEBUG_FRAME = org.junit.runners.model.FrameworkMethod$1.runReflectiveCall(FrameworkMethod.java:44)
	DEBUG_FRAME = org.junit.internal.runners.model.ReflectiveCallable.run(ReflectiveCallable.java:15)
	DEBUG_FRAME = org.junit.runners.model.FrameworkMethod.invokeExplosively(FrameworkMethod.java:41)
	DEBUG_FRAME = org.junit.internal.runners.statements.InvokeMethod.evaluate(InvokeMethod.java:20)
	DEBUG_FRAME = org.junit.runners.BlockJUnit4ClassRunner.runNotIgnored(BlockJUnit4ClassRunner.java:79)
	DEBUG_FRAME = org.junit.runners.BlockJUnit4ClassRunner.runChild(BlockJUnit4ClassRunner.java:71)
	DEBUG_FRAME = org.junit.runners.BlockJUnit4ClassRunner.runChild(BlockJUnit4ClassRunner.java:49)
	DEBUG_FRAME = org.junit.runners.ParentRunner$3.run(ParentRunner.java:193)
	DEBUG_FRAME = org.junit.runners.ParentRunner$1.schedule(ParentRunner.java:52)
	DEBUG_FRAME = org.junit.runners.ParentRunner.runChildren(ParentRunner.java:191)
	DEBUG_FRAME = org.junit.runners.ParentRunner.access$000(ParentRunner.java:42)
	DEBUG_FRAME = org.junit.runners.ParentRunner$2.evaluate(ParentRunner.java:184)
	DEBUG_FRAME = org.junit.runners.ParentRunner.run(ParentRunner.java:236)
	DEBUG_FRAME = org.apache.maven.surefire.junit4.JUnit4Provider.execute(JUnit4Provider.java:252)
	DEBUG_FRAME = org.apache.maven.surefire.junit4.JUnit4Provider.executeTestSet(JUnit4Provider.java:141)
	DEBUG_FRAME = org.apache.maven.surefire.junit4.JUnit4Provider.invoke(JUnit4Provider.java:112)
	DEBUG_FRAME = sun.reflect.NativeMethodAccessorImpl.invoke0(Native Method)
	DEBUG_FRAME = sun.reflect.NativeMethodAccessorImpl.invoke(NativeMethodAccessorImpl.java:62)
	DEBUG_FRAME = sun.reflect.DelegatingMethodAccessorImpl.invoke(DelegatingMethodAccessorImpl.java:43)
	DEBUG_FRAME = java.lang.reflect.Method.invoke(Method.java:498)
	DEBUG_FRAME = org.apache.maven.surefire.util.ReflectionUtils.invokeMethodWithArray(ReflectionUtils.java:189)
	DEBUG_FRAME = org.apache.maven.surefire.booter.ProviderFactory$ProviderProxy.invoke(ProviderFactory.java:165)
	DEBUG_FRAME = org.apache.maven.surefire.booter.ProviderFactory.invokeProvider(ProviderFactory.java:85)
	DEBUG_FRAME = org.apache.maven.surefire.booter.ForkedBooter.runSuitesInProcess(ForkedBooter.java:115)
	DEBUG_FRAME = org.apache.maven.surefire.booter.ForkedBooter.main(ForkedBooter.java:75)

15:40:48,607 DEBUG [main] AxisOperation:485 - Entry: AxisOperation::getInputAction
15:40:48,607 DEBUG [main] AxisOperation:506 - Exit: AxisOperation::getInputAction null
15:40:48,607 DEBUG [main] AxisOperation:467 - Entry: AxisOperation::setSoapAction, previous soapAction: null updated soapAction: urn:getSystemIsATool
15:40:48,608 DEBUG [main] AxisOperation:471 - Exit: AxisOperation::setSoapAction
15:40:48,608 DEBUG [main] AxisService:872 - mapActionToOperation: Mapping Action to Operation: action: getSystemIsATool; operation: org.apache.axis2.description.OutInAxisOperation@dd8ba08named: {http://trm.ws.gazelletest.tm.gazelle.ihe.net/}getSystemIsATool
15:40:48,608 DEBUG [main] AxisService:878 - DEBUG_FRAME = org.apache.axis2.util.JavaUtils.callStackToString(JavaUtils.java:564)
	DEBUG_FRAME = org.apache.axis2.description.AxisService.mapActionToOperation(AxisService.java:878)
	DEBUG_FRAME = org.apache.axis2.description.AxisService.addOperation(AxisService.java:724)
	DEBUG_FRAME = net.ihe.gazelle.ws.client.GazelleTRMServiceStub.populateAxisService(GazelleTRMServiceStub.java:106)
	DEBUG_FRAME = net.ihe.gazelle.ws.client.GazelleTRMServiceStub.<init>(GazelleTRMServiceStub.java:40)
	DEBUG_FRAME = net.ihe.gazelle.ws.client.GazelleTRMServiceStub.<init>(GazelleTRMServiceStub.java:29)
	DEBUG_FRAME = net.ihe.gazelle.ws.client.GazelleTRMServiceStub.<init>(GazelleTRMServiceStub.java:75)
	DEBUG_FRAME = net.ihe.gazelle.ws.client.GazelleTRMServiceClient.<init>(GazelleTRMServiceClient.java:11)
	DEBUG_FRAME = net.ihe.gazelle.ws.client.GazelleTRMServiceStubTest.getSystemIsAToolTest(GazelleTRMServiceStubTest.java:21)
	DEBUG_FRAME = sun.reflect.NativeMethodAccessorImpl.invoke0(Native Method)
	DEBUG_FRAME = sun.reflect.NativeMethodAccessorImpl.invoke(NativeMethodAccessorImpl.java:62)
	DEBUG_FRAME = sun.reflect.DelegatingMethodAccessorImpl.invoke(DelegatingMethodAccessorImpl.java:43)
	DEBUG_FRAME = java.lang.reflect.Method.invoke(Method.java:498)
	DEBUG_FRAME = org.junit.runners.model.FrameworkMethod$1.runReflectiveCall(FrameworkMethod.java:44)
	DEBUG_FRAME = org.junit.internal.runners.model.ReflectiveCallable.run(ReflectiveCallable.java:15)
	DEBUG_FRAME = org.junit.runners.model.FrameworkMethod.invokeExplosively(FrameworkMethod.java:41)
	DEBUG_FRAME = org.junit.internal.runners.statements.InvokeMethod.evaluate(InvokeMethod.java:20)
	DEBUG_FRAME = org.junit.runners.BlockJUnit4ClassRunner.runNotIgnored(BlockJUnit4ClassRunner.java:79)
	DEBUG_FRAME = org.junit.runners.BlockJUnit4ClassRunner.runChild(BlockJUnit4ClassRunner.java:71)
	DEBUG_FRAME = org.junit.runners.BlockJUnit4ClassRunner.runChild(BlockJUnit4ClassRunner.java:49)
	DEBUG_FRAME = org.junit.runners.ParentRunner$3.run(ParentRunner.java:193)
	DEBUG_FRAME = org.junit.runners.ParentRunner$1.schedule(ParentRunner.java:52)
	DEBUG_FRAME = org.junit.runners.ParentRunner.runChildren(ParentRunner.java:191)
	DEBUG_FRAME = org.junit.runners.ParentRunner.access$000(ParentRunner.java:42)
	DEBUG_FRAME = org.junit.runners.ParentRunner$2.evaluate(ParentRunner.java:184)
	DEBUG_FRAME = org.junit.runners.ParentRunner.run(ParentRunner.java:236)
	DEBUG_FRAME = org.apache.maven.surefire.junit4.JUnit4Provider.execute(JUnit4Provider.java:252)
	DEBUG_FRAME = org.apache.maven.surefire.junit4.JUnit4Provider.executeTestSet(JUnit4Provider.java:141)
	DEBUG_FRAME = org.apache.maven.surefire.junit4.JUnit4Provider.invoke(JUnit4Provider.java:112)
	DEBUG_FRAME = sun.reflect.NativeMethodAccessorImpl.invoke0(Native Method)
	DEBUG_FRAME = sun.reflect.NativeMethodAccessorImpl.invoke(NativeMethodAccessorImpl.java:62)
	DEBUG_FRAME = sun.reflect.DelegatingMethodAccessorImpl.invoke(DelegatingMethodAccessorImpl.java:43)
	DEBUG_FRAME = java.lang.reflect.Method.invoke(Method.java:498)
	DEBUG_FRAME = org.apache.maven.surefire.util.ReflectionUtils.invokeMethodWithArray(ReflectionUtils.java:189)
	DEBUG_FRAME = org.apache.maven.surefire.booter.ProviderFactory$ProviderProxy.invoke(ProviderFactory.java:165)
	DEBUG_FRAME = org.apache.maven.surefire.booter.ProviderFactory.invokeProvider(ProviderFactory.java:85)
	DEBUG_FRAME = org.apache.maven.surefire.booter.ForkedBooter.runSuitesInProcess(ForkedBooter.java:115)
	DEBUG_FRAME = org.apache.maven.surefire.booter.ForkedBooter.main(ForkedBooter.java:75)

15:40:48,609 DEBUG [main] AxisOperation:485 - Entry: AxisOperation::getInputAction
15:40:48,609 DEBUG [main] AxisOperation:490 - Debug: AxisOperation::getInputAction - using soapAction
15:40:48,610 DEBUG [main] AxisOperation:506 - Exit: AxisOperation::getInputAction urn:getSystemIsATool
15:40:48,610 DEBUG [main] AxisService:872 - mapActionToOperation: Mapping Action to Operation: action: urn:getSystemIsATool; operation: org.apache.axis2.description.OutInAxisOperation@dd8ba08named: {http://trm.ws.gazelletest.tm.gazelle.ihe.net/}getSystemIsATool
15:40:48,611 DEBUG [main] AxisService:878 - DEBUG_FRAME = org.apache.axis2.util.JavaUtils.callStackToString(JavaUtils.java:564)
	DEBUG_FRAME = org.apache.axis2.description.AxisService.mapActionToOperation(AxisService.java:878)
	DEBUG_FRAME = org.apache.axis2.description.AxisService.addOperation(AxisService.java:728)
	DEBUG_FRAME = net.ihe.gazelle.ws.client.GazelleTRMServiceStub.populateAxisService(GazelleTRMServiceStub.java:106)
	DEBUG_FRAME = net.ihe.gazelle.ws.client.GazelleTRMServiceStub.<init>(GazelleTRMServiceStub.java:40)
	DEBUG_FRAME = net.ihe.gazelle.ws.client.GazelleTRMServiceStub.<init>(GazelleTRMServiceStub.java:29)
	DEBUG_FRAME = net.ihe.gazelle.ws.client.GazelleTRMServiceStub.<init>(GazelleTRMServiceStub.java:75)
	DEBUG_FRAME = net.ihe.gazelle.ws.client.GazelleTRMServiceClient.<init>(GazelleTRMServiceClient.java:11)
	DEBUG_FRAME = net.ihe.gazelle.ws.client.GazelleTRMServiceStubTest.getSystemIsAToolTest(GazelleTRMServiceStubTest.java:21)
	DEBUG_FRAME = sun.reflect.NativeMethodAccessorImpl.invoke0(Native Method)
	DEBUG_FRAME = sun.reflect.NativeMethodAccessorImpl.invoke(NativeMethodAccessorImpl.java:62)
	DEBUG_FRAME = sun.reflect.DelegatingMethodAccessorImpl.invoke(DelegatingMethodAccessorImpl.java:43)
	DEBUG_FRAME = java.lang.reflect.Method.invoke(Method.java:498)
	DEBUG_FRAME = org.junit.runners.model.FrameworkMethod$1.runReflectiveCall(FrameworkMethod.java:44)
	DEBUG_FRAME = org.junit.internal.runners.model.ReflectiveCallable.run(ReflectiveCallable.java:15)
	DEBUG_FRAME = org.junit.runners.model.FrameworkMethod.invokeExplosively(FrameworkMethod.java:41)
	DEBUG_FRAME = org.junit.internal.runners.statements.InvokeMethod.evaluate(InvokeMethod.java:20)
	DEBUG_FRAME = org.junit.runners.BlockJUnit4ClassRunner.runNotIgnored(BlockJUnit4ClassRunner.java:79)
	DEBUG_FRAME = org.junit.runners.BlockJUnit4ClassRunner.runChild(BlockJUnit4ClassRunner.java:71)
	DEBUG_FRAME = org.junit.runners.BlockJUnit4ClassRunner.runChild(BlockJUnit4ClassRunner.java:49)
	DEBUG_FRAME = org.junit.runners.ParentRunner$3.run(ParentRunner.java:193)
	DEBUG_FRAME = org.junit.runners.ParentRunner$1.schedule(ParentRunner.java:52)
	DEBUG_FRAME = org.junit.runners.ParentRunner.runChildren(ParentRunner.java:191)
	DEBUG_FRAME = org.junit.runners.ParentRunner.access$000(ParentRunner.java:42)
	DEBUG_FRAME = org.junit.runners.ParentRunner$2.evaluate(ParentRunner.java:184)
	DEBUG_FRAME = org.junit.runners.ParentRunner.run(ParentRunner.java:236)
	DEBUG_FRAME = org.apache.maven.surefire.junit4.JUnit4Provider.execute(JUnit4Provider.java:252)
	DEBUG_FRAME = org.apache.maven.surefire.junit4.JUnit4Provider.executeTestSet(JUnit4Provider.java:141)
	DEBUG_FRAME = org.apache.maven.surefire.junit4.JUnit4Provider.invoke(JUnit4Provider.java:112)
	DEBUG_FRAME = sun.reflect.NativeMethodAccessorImpl.invoke0(Native Method)
	DEBUG_FRAME = sun.reflect.NativeMethodAccessorImpl.invoke(NativeMethodAccessorImpl.java:62)
	DEBUG_FRAME = sun.reflect.DelegatingMethodAccessorImpl.invoke(DelegatingMethodAccessorImpl.java:43)
	DEBUG_FRAME = java.lang.reflect.Method.invoke(Method.java:498)
	DEBUG_FRAME = org.apache.maven.surefire.util.ReflectionUtils.invokeMethodWithArray(ReflectionUtils.java:189)
	DEBUG_FRAME = org.apache.maven.surefire.booter.ProviderFactory$ProviderProxy.invoke(ProviderFactory.java:165)
	DEBUG_FRAME = org.apache.maven.surefire.booter.ProviderFactory.invokeProvider(ProviderFactory.java:85)
	DEBUG_FRAME = org.apache.maven.surefire.booter.ForkedBooter.runSuitesInProcess(ForkedBooter.java:115)
	DEBUG_FRAME = org.apache.maven.surefire.booter.ForkedBooter.main(ForkedBooter.java:75)

15:40:48,611 DEBUG [main] AxisOperation:485 - Entry: AxisOperation::getInputAction
15:40:48,612 DEBUG [main] AxisOperation:506 - Exit: AxisOperation::getInputAction null
15:40:48,612 DEBUG [main] AxisOperation:467 - Entry: AxisOperation::setSoapAction, previous soapAction: null updated soapAction: urn:getTestInstancesByTestingSession
15:40:48,612 DEBUG [main] AxisOperation:471 - Exit: AxisOperation::setSoapAction
15:40:48,613 DEBUG [main] AxisService:872 - mapActionToOperation: Mapping Action to Operation: action: getTestInstancesByTestingSession; operation: org.apache.axis2.description.OutInAxisOperation@79e2c065named: {http://trm.ws.gazelletest.tm.gazelle.ihe.net/}getTestInstancesByTestingSession
15:40:48,613 DEBUG [main] AxisService:878 - DEBUG_FRAME = org.apache.axis2.util.JavaUtils.callStackToString(JavaUtils.java:564)
	DEBUG_FRAME = org.apache.axis2.description.AxisService.mapActionToOperation(AxisService.java:878)
	DEBUG_FRAME = org.apache.axis2.description.AxisService.addOperation(AxisService.java:724)
	DEBUG_FRAME = net.ihe.gazelle.ws.client.GazelleTRMServiceStub.populateAxisService(GazelleTRMServiceStub.java:115)
	DEBUG_FRAME = net.ihe.gazelle.ws.client.GazelleTRMServiceStub.<init>(GazelleTRMServiceStub.java:40)
	DEBUG_FRAME = net.ihe.gazelle.ws.client.GazelleTRMServiceStub.<init>(GazelleTRMServiceStub.java:29)
	DEBUG_FRAME = net.ihe.gazelle.ws.client.GazelleTRMServiceStub.<init>(GazelleTRMServiceStub.java:75)
	DEBUG_FRAME = net.ihe.gazelle.ws.client.GazelleTRMServiceClient.<init>(GazelleTRMServiceClient.java:11)
	DEBUG_FRAME = net.ihe.gazelle.ws.client.GazelleTRMServiceStubTest.getSystemIsAToolTest(GazelleTRMServiceStubTest.java:21)
	DEBUG_FRAME = sun.reflect.NativeMethodAccessorImpl.invoke0(Native Method)
	DEBUG_FRAME = sun.reflect.NativeMethodAccessorImpl.invoke(NativeMethodAccessorImpl.java:62)
	DEBUG_FRAME = sun.reflect.DelegatingMethodAccessorImpl.invoke(DelegatingMethodAccessorImpl.java:43)
	DEBUG_FRAME = java.lang.reflect.Method.invoke(Method.java:498)
	DEBUG_FRAME = org.junit.runners.model.FrameworkMethod$1.runReflectiveCall(FrameworkMethod.java:44)
	DEBUG_FRAME = org.junit.internal.runners.model.ReflectiveCallable.run(ReflectiveCallable.java:15)
	DEBUG_FRAME = org.junit.runners.model.FrameworkMethod.invokeExplosively(FrameworkMethod.java:41)
	DEBUG_FRAME = org.junit.internal.runners.statements.InvokeMethod.evaluate(InvokeMethod.java:20)
	DEBUG_FRAME = org.junit.runners.BlockJUnit4ClassRunner.runNotIgnored(BlockJUnit4ClassRunner.java:79)
	DEBUG_FRAME = org.junit.runners.BlockJUnit4ClassRunner.runChild(BlockJUnit4ClassRunner.java:71)
	DEBUG_FRAME = org.junit.runners.BlockJUnit4ClassRunner.runChild(BlockJUnit4ClassRunner.java:49)
	DEBUG_FRAME = org.junit.runners.ParentRunner$3.run(ParentRunner.java:193)
	DEBUG_FRAME = org.junit.runners.ParentRunner$1.schedule(ParentRunner.java:52)
	DEBUG_FRAME = org.junit.runners.ParentRunner.runChildren(ParentRunner.java:191)
	DEBUG_FRAME = org.junit.runners.ParentRunner.access$000(ParentRunner.java:42)
	DEBUG_FRAME = org.junit.runners.ParentRunner$2.evaluate(ParentRunner.java:184)
	DEBUG_FRAME = org.junit.runners.ParentRunner.run(ParentRunner.java:236)
	DEBUG_FRAME = org.apache.maven.surefire.junit4.JUnit4Provider.execute(JUnit4Provider.java:252)
	DEBUG_FRAME = org.apache.maven.surefire.junit4.JUnit4Provider.executeTestSet(JUnit4Provider.java:141)
	DEBUG_FRAME = org.apache.maven.surefire.junit4.JUnit4Provider.invoke(JUnit4Provider.java:112)
	DEBUG_FRAME = sun.reflect.NativeMethodAccessorImpl.invoke0(Native Method)
	DEBUG_FRAME = sun.reflect.NativeMethodAccessorImpl.invoke(NativeMethodAccessorImpl.java:62)
	DEBUG_FRAME = sun.reflect.DelegatingMethodAccessorImpl.invoke(DelegatingMethodAccessorImpl.java:43)
	DEBUG_FRAME = java.lang.reflect.Method.invoke(Method.java:498)
	DEBUG_FRAME = org.apache.maven.surefire.util.ReflectionUtils.invokeMethodWithArray(ReflectionUtils.java:189)
	DEBUG_FRAME = org.apache.maven.surefire.booter.ProviderFactory$ProviderProxy.invoke(ProviderFactory.java:165)
	DEBUG_FRAME = org.apache.maven.surefire.booter.ProviderFactory.invokeProvider(ProviderFactory.java:85)
	DEBUG_FRAME = org.apache.maven.surefire.booter.ForkedBooter.runSuitesInProcess(ForkedBooter.java:115)
	DEBUG_FRAME = org.apache.maven.surefire.booter.ForkedBooter.main(ForkedBooter.java:75)

15:40:48,614 DEBUG [main] AxisOperation:485 - Entry: AxisOperation::getInputAction
15:40:48,614 DEBUG [main] AxisOperation:490 - Debug: AxisOperation::getInputAction - using soapAction
15:40:48,614 DEBUG [main] AxisOperation:506 - Exit: AxisOperation::getInputAction urn:getTestInstancesByTestingSession
15:40:48,615 DEBUG [main] AxisService:872 - mapActionToOperation: Mapping Action to Operation: action: urn:getTestInstancesByTestingSession; operation: org.apache.axis2.description.OutInAxisOperation@79e2c065named: {http://trm.ws.gazelletest.tm.gazelle.ihe.net/}getTestInstancesByTestingSession
15:40:48,615 DEBUG [main] AxisService:878 - DEBUG_FRAME = org.apache.axis2.util.JavaUtils.callStackToString(JavaUtils.java:564)
	DEBUG_FRAME = org.apache.axis2.description.AxisService.mapActionToOperation(AxisService.java:878)
	DEBUG_FRAME = org.apache.axis2.description.AxisService.addOperation(AxisService.java:728)
	DEBUG_FRAME = net.ihe.gazelle.ws.client.GazelleTRMServiceStub.populateAxisService(GazelleTRMServiceStub.java:115)
	DEBUG_FRAME = net.ihe.gazelle.ws.client.GazelleTRMServiceStub.<init>(GazelleTRMServiceStub.java:40)
	DEBUG_FRAME = net.ihe.gazelle.ws.client.GazelleTRMServiceStub.<init>(GazelleTRMServiceStub.java:29)
	DEBUG_FRAME = net.ihe.gazelle.ws.client.GazelleTRMServiceStub.<init>(GazelleTRMServiceStub.java:75)
	DEBUG_FRAME = net.ihe.gazelle.ws.client.GazelleTRMServiceClient.<init>(GazelleTRMServiceClient.java:11)
	DEBUG_FRAME = net.ihe.gazelle.ws.client.GazelleTRMServiceStubTest.getSystemIsAToolTest(GazelleTRMServiceStubTest.java:21)
	DEBUG_FRAME = sun.reflect.NativeMethodAccessorImpl.invoke0(Native Method)
	DEBUG_FRAME = sun.reflect.NativeMethodAccessorImpl.invoke(NativeMethodAccessorImpl.java:62)
	DEBUG_FRAME = sun.reflect.DelegatingMethodAccessorImpl.invoke(DelegatingMethodAccessorImpl.java:43)
	DEBUG_FRAME = java.lang.reflect.Method.invoke(Method.java:498)
	DEBUG_FRAME = org.junit.runners.model.FrameworkMethod$1.runReflectiveCall(FrameworkMethod.java:44)
	DEBUG_FRAME = org.junit.internal.runners.model.ReflectiveCallable.run(ReflectiveCallable.java:15)
	DEBUG_FRAME = org.junit.runners.model.FrameworkMethod.invokeExplosively(FrameworkMethod.java:41)
	DEBUG_FRAME = org.junit.internal.runners.statements.InvokeMethod.evaluate(InvokeMethod.java:20)
	DEBUG_FRAME = org.junit.runners.BlockJUnit4ClassRunner.runNotIgnored(BlockJUnit4ClassRunner.java:79)
	DEBUG_FRAME = org.junit.runners.BlockJUnit4ClassRunner.runChild(BlockJUnit4ClassRunner.java:71)
	DEBUG_FRAME = org.junit.runners.BlockJUnit4ClassRunner.runChild(BlockJUnit4ClassRunner.java:49)
	DEBUG_FRAME = org.junit.runners.ParentRunner$3.run(ParentRunner.java:193)
	DEBUG_FRAME = org.junit.runners.ParentRunner$1.schedule(ParentRunner.java:52)
	DEBUG_FRAME = org.junit.runners.ParentRunner.runChildren(ParentRunner.java:191)
	DEBUG_FRAME = org.junit.runners.ParentRunner.access$000(ParentRunner.java:42)
	DEBUG_FRAME = org.junit.runners.ParentRunner$2.evaluate(ParentRunner.java:184)
	DEBUG_FRAME = org.junit.runners.ParentRunner.run(ParentRunner.java:236)
	DEBUG_FRAME = org.apache.maven.surefire.junit4.JUnit4Provider.execute(JUnit4Provider.java:252)
	DEBUG_FRAME = org.apache.maven.surefire.junit4.JUnit4Provider.executeTestSet(JUnit4Provider.java:141)
	DEBUG_FRAME = org.apache.maven.surefire.junit4.JUnit4Provider.invoke(JUnit4Provider.java:112)
	DEBUG_FRAME = sun.reflect.NativeMethodAccessorImpl.invoke0(Native Method)
	DEBUG_FRAME = sun.reflect.NativeMethodAccessorImpl.invoke(NativeMethodAccessorImpl.java:62)
	DEBUG_FRAME = sun.reflect.DelegatingMethodAccessorImpl.invoke(DelegatingMethodAccessorImpl.java:43)
	DEBUG_FRAME = java.lang.reflect.Method.invoke(Method.java:498)
	DEBUG_FRAME = org.apache.maven.surefire.util.ReflectionUtils.invokeMethodWithArray(ReflectionUtils.java:189)
	DEBUG_FRAME = org.apache.maven.surefire.booter.ProviderFactory$ProviderProxy.invoke(ProviderFactory.java:165)
	DEBUG_FRAME = org.apache.maven.surefire.booter.ProviderFactory.invokeProvider(ProviderFactory.java:85)
	DEBUG_FRAME = org.apache.maven.surefire.booter.ForkedBooter.runSuitesInProcess(ForkedBooter.java:115)
	DEBUG_FRAME = org.apache.maven.surefire.booter.ForkedBooter.main(ForkedBooter.java:75)

15:40:48,616 DEBUG [main] AxisOperation:485 - Entry: AxisOperation::getInputAction
15:40:48,616 DEBUG [main] AxisOperation:506 - Exit: AxisOperation::getInputAction null
15:40:48,616 DEBUG [main] AxisOperation:467 - Entry: AxisOperation::setSoapAction, previous soapAction: null updated soapAction: urn:getTestInstanceById
15:40:48,617 DEBUG [main] AxisOperation:471 - Exit: AxisOperation::setSoapAction
15:40:48,617 DEBUG [main] AxisService:872 - mapActionToOperation: Mapping Action to Operation: action: getTestInstanceById; operation: org.apache.axis2.description.OutInAxisOperation@74fe5c40named: {http://trm.ws.gazelletest.tm.gazelle.ihe.net/}getTestInstanceById
15:40:48,617 DEBUG [main] AxisService:878 - DEBUG_FRAME = org.apache.axis2.util.JavaUtils.callStackToString(JavaUtils.java:564)
	DEBUG_FRAME = org.apache.axis2.description.AxisService.mapActionToOperation(AxisService.java:878)
	DEBUG_FRAME = org.apache.axis2.description.AxisService.addOperation(AxisService.java:724)
	DEBUG_FRAME = net.ihe.gazelle.ws.client.GazelleTRMServiceStub.populateAxisService(GazelleTRMServiceStub.java:124)
	DEBUG_FRAME = net.ihe.gazelle.ws.client.GazelleTRMServiceStub.<init>(GazelleTRMServiceStub.java:40)
	DEBUG_FRAME = net.ihe.gazelle.ws.client.GazelleTRMServiceStub.<init>(GazelleTRMServiceStub.java:29)
	DEBUG_FRAME = net.ihe.gazelle.ws.client.GazelleTRMServiceStub.<init>(GazelleTRMServiceStub.java:75)
	DEBUG_FRAME = net.ihe.gazelle.ws.client.GazelleTRMServiceClient.<init>(GazelleTRMServiceClient.java:11)
	DEBUG_FRAME = net.ihe.gazelle.ws.client.GazelleTRMServiceStubTest.getSystemIsAToolTest(GazelleTRMServiceStubTest.java:21)
	DEBUG_FRAME = sun.reflect.NativeMethodAccessorImpl.invoke0(Native Method)
	DEBUG_FRAME = sun.reflect.NativeMethodAccessorImpl.invoke(NativeMethodAccessorImpl.java:62)
	DEBUG_FRAME = sun.reflect.DelegatingMethodAccessorImpl.invoke(DelegatingMethodAccessorImpl.java:43)
	DEBUG_FRAME = java.lang.reflect.Method.invoke(Method.java:498)
	DEBUG_FRAME = org.junit.runners.model.FrameworkMethod$1.runReflectiveCall(FrameworkMethod.java:44)
	DEBUG_FRAME = org.junit.internal.runners.model.ReflectiveCallable.run(ReflectiveCallable.java:15)
	DEBUG_FRAME = org.junit.runners.model.FrameworkMethod.invokeExplosively(FrameworkMethod.java:41)
	DEBUG_FRAME = org.junit.internal.runners.statements.InvokeMethod.evaluate(InvokeMethod.java:20)
	DEBUG_FRAME = org.junit.runners.BlockJUnit4ClassRunner.runNotIgnored(BlockJUnit4ClassRunner.java:79)
	DEBUG_FRAME = org.junit.runners.BlockJUnit4ClassRunner.runChild(BlockJUnit4ClassRunner.java:71)
	DEBUG_FRAME = org.junit.runners.BlockJUnit4ClassRunner.runChild(BlockJUnit4ClassRunner.java:49)
	DEBUG_FRAME = org.junit.runners.ParentRunner$3.run(ParentRunner.java:193)
	DEBUG_FRAME = org.junit.runners.ParentRunner$1.schedule(ParentRunner.java:52)
	DEBUG_FRAME = org.junit.runners.ParentRunner.runChildren(ParentRunner.java:191)
	DEBUG_FRAME = org.junit.runners.ParentRunner.access$000(ParentRunner.java:42)
	DEBUG_FRAME = org.junit.runners.ParentRunner$2.evaluate(ParentRunner.java:184)
	DEBUG_FRAME = org.junit.runners.ParentRunner.run(ParentRunner.java:236)
	DEBUG_FRAME = org.apache.maven.surefire.junit4.JUnit4Provider.execute(JUnit4Provider.java:252)
	DEBUG_FRAME = org.apache.maven.surefire.junit4.JUnit4Provider.executeTestSet(JUnit4Provider.java:141)
	DEBUG_FRAME = org.apache.maven.surefire.junit4.JUnit4Provider.invoke(JUnit4Provider.java:112)
	DEBUG_FRAME = sun.reflect.NativeMethodAccessorImpl.invoke0(Native Method)
	DEBUG_FRAME = sun.reflect.NativeMethodAccessorImpl.invoke(NativeMethodAccessorImpl.java:62)
	DEBUG_FRAME = sun.reflect.DelegatingMethodAccessorImpl.invoke(DelegatingMethodAccessorImpl.java:43)
	DEBUG_FRAME = java.lang.reflect.Method.invoke(Method.java:498)
	DEBUG_FRAME = org.apache.maven.surefire.util.ReflectionUtils.invokeMethodWithArray(ReflectionUtils.java:189)
	DEBUG_FRAME = org.apache.maven.surefire.booter.ProviderFactory$ProviderProxy.invoke(ProviderFactory.java:165)
	DEBUG_FRAME = org.apache.maven.surefire.booter.ProviderFactory.invokeProvider(ProviderFactory.java:85)
	DEBUG_FRAME = org.apache.maven.surefire.booter.ForkedBooter.runSuitesInProcess(ForkedBooter.java:115)
	DEBUG_FRAME = org.apache.maven.surefire.booter.ForkedBooter.main(ForkedBooter.java:75)

15:40:48,618 DEBUG [main] AxisOperation:485 - Entry: AxisOperation::getInputAction
15:40:48,618 DEBUG [main] AxisOperation:490 - Debug: AxisOperation::getInputAction - using soapAction
15:40:48,619 DEBUG [main] AxisOperation:506 - Exit: AxisOperation::getInputAction urn:getTestInstanceById
15:40:48,619 DEBUG [main] AxisService:872 - mapActionToOperation: Mapping Action to Operation: action: urn:getTestInstanceById; operation: org.apache.axis2.description.OutInAxisOperation@74fe5c40named: {http://trm.ws.gazelletest.tm.gazelle.ihe.net/}getTestInstanceById
15:40:48,619 DEBUG [main] AxisService:878 - DEBUG_FRAME = org.apache.axis2.util.JavaUtils.callStackToString(JavaUtils.java:564)
	DEBUG_FRAME = org.apache.axis2.description.AxisService.mapActionToOperation(AxisService.java:878)
	DEBUG_FRAME = org.apache.axis2.description.AxisService.addOperation(AxisService.java:728)
	DEBUG_FRAME = net.ihe.gazelle.ws.client.GazelleTRMServiceStub.populateAxisService(GazelleTRMServiceStub.java:124)
	DEBUG_FRAME = net.ihe.gazelle.ws.client.GazelleTRMServiceStub.<init>(GazelleTRMServiceStub.java:40)
	DEBUG_FRAME = net.ihe.gazelle.ws.client.GazelleTRMServiceStub.<init>(GazelleTRMServiceStub.java:29)
	DEBUG_FRAME = net.ihe.gazelle.ws.client.GazelleTRMServiceStub.<init>(GazelleTRMServiceStub.java:75)
	DEBUG_FRAME = net.ihe.gazelle.ws.client.GazelleTRMServiceClient.<init>(GazelleTRMServiceClient.java:11)
	DEBUG_FRAME = net.ihe.gazelle.ws.client.GazelleTRMServiceStubTest.getSystemIsAToolTest(GazelleTRMServiceStubTest.java:21)
	DEBUG_FRAME = sun.reflect.NativeMethodAccessorImpl.invoke0(Native Method)
	DEBUG_FRAME = sun.reflect.NativeMethodAccessorImpl.invoke(NativeMethodAccessorImpl.java:62)
	DEBUG_FRAME = sun.reflect.DelegatingMethodAccessorImpl.invoke(DelegatingMethodAccessorImpl.java:43)
	DEBUG_FRAME = java.lang.reflect.Method.invoke(Method.java:498)
	DEBUG_FRAME = org.junit.runners.model.FrameworkMethod$1.runReflectiveCall(FrameworkMethod.java:44)
	DEBUG_FRAME = org.junit.internal.runners.model.ReflectiveCallable.run(ReflectiveCallable.java:15)
	DEBUG_FRAME = org.junit.runners.model.FrameworkMethod.invokeExplosively(FrameworkMethod.java:41)
	DEBUG_FRAME = org.junit.internal.runners.statements.InvokeMethod.evaluate(InvokeMethod.java:20)
	DEBUG_FRAME = org.junit.runners.BlockJUnit4ClassRunner.runNotIgnored(BlockJUnit4ClassRunner.java:79)
	DEBUG_FRAME = org.junit.runners.BlockJUnit4ClassRunner.runChild(BlockJUnit4ClassRunner.java:71)
	DEBUG_FRAME = org.junit.runners.BlockJUnit4ClassRunner.runChild(BlockJUnit4ClassRunner.java:49)
	DEBUG_FRAME = org.junit.runners.ParentRunner$3.run(ParentRunner.java:193)
	DEBUG_FRAME = org.junit.runners.ParentRunner$1.schedule(ParentRunner.java:52)
	DEBUG_FRAME = org.junit.runners.ParentRunner.runChildren(ParentRunner.java:191)
	DEBUG_FRAME = org.junit.runners.ParentRunner.access$000(ParentRunner.java:42)
	DEBUG_FRAME = org.junit.runners.ParentRunner$2.evaluate(ParentRunner.java:184)
	DEBUG_FRAME = org.junit.runners.ParentRunner.run(ParentRunner.java:236)
	DEBUG_FRAME = org.apache.maven.surefire.junit4.JUnit4Provider.execute(JUnit4Provider.java:252)
	DEBUG_FRAME = org.apache.maven.surefire.junit4.JUnit4Provider.executeTestSet(JUnit4Provider.java:141)
	DEBUG_FRAME = org.apache.maven.surefire.junit4.JUnit4Provider.invoke(JUnit4Provider.java:112)
	DEBUG_FRAME = sun.reflect.NativeMethodAccessorImpl.invoke0(Native Method)
	DEBUG_FRAME = sun.reflect.NativeMethodAccessorImpl.invoke(NativeMethodAccessorImpl.java:62)
	DEBUG_FRAME = sun.reflect.DelegatingMethodAccessorImpl.invoke(DelegatingMethodAccessorImpl.java:43)
	DEBUG_FRAME = java.lang.reflect.Method.invoke(Method.java:498)
	DEBUG_FRAME = org.apache.maven.surefire.util.ReflectionUtils.invokeMethodWithArray(ReflectionUtils.java:189)
	DEBUG_FRAME = org.apache.maven.surefire.booter.ProviderFactory$ProviderProxy.invoke(ProviderFactory.java:165)
	DEBUG_FRAME = org.apache.maven.surefire.booter.ProviderFactory.invokeProvider(ProviderFactory.java:85)
	DEBUG_FRAME = org.apache.maven.surefire.booter.ForkedBooter.runSuitesInProcess(ForkedBooter.java:115)
	DEBUG_FRAME = org.apache.maven.surefire.booter.ForkedBooter.main(ForkedBooter.java:75)

15:40:48,637 DEBUG [main] AbstractContext:55 - OnDemandLogger initialized for class org.apache.axis2.context.AbstractContext is:org.apache.commons.logging.impl.Log4JLogger@6cf0e0ba
15:40:48,645 DEBUG [main] Loader:132 - Trying to find [org/apache/axis2/deployment/axis2_default.xml] using sun.misc.Launcher$AppClassLoader@232204a1 class loader.
15:40:48,663 DEBUG [main] StAXUtils:489 - About to create XMLInputFactory implementation with classloader=sun.misc.Launcher$AppClassLoader@232204a1
15:40:48,664 DEBUG [main] StAXUtils:491 - The classloader for javax.xml.stream.XMLInputFactory is: null
15:40:48,683 DEBUG [main] StAXDialectDetector:256 - StAX implementation at jar:file:/home/jenkins/.m2/repository/org/codehaus/woodstox/woodstox-core-asl/4.2.0/woodstox-core-asl-4.2.0.jar!/ is:
  Title:         Woodstox XML-processor
  Symbolic name: woodstox-core-asl
  Vendor:        http://woodstox.codehaus.org
  Version:       4.2.0
15:40:48,688 DEBUG [main] StAXDialectDetector:218 - Detected StAX dialect: Woodstox 4.x
15:40:48,689 DEBUG [main] StAXUtils:513 - Created XMLInputFactory = class org.apache.axiom.util.stax.wrapper.ImmutableXMLInputFactory with classloader=sun.misc.Launcher$AppClassLoader@232204a1
15:40:48,689 DEBUG [main] StAXUtils:515 - Configuration = DEFAULT
15:40:48,689 DEBUG [main] StAXUtils:516 - Size of XMLInputFactory map for this configuration = 1
15:40:48,690 DEBUG [main] StAXUtils:517 - Configurations for which factories have been cached = [DEFAULT]
15:40:48,730 DEBUG [main] StAXUtils:210 - XMLStreamReader is org.apache.axiom.util.stax.dialect.Woodstox4StreamReaderWrapper
15:40:48,782 DEBUG [main] AxiomContainerSupport:172 - Builder is already complete.
15:40:48,812 DEBUG [main] Phase:98 - Handler RequestURIBasedDispatcher added to Phase Transport
15:40:48,814 DEBUG [main] Phase:98 - Handler SOAPActionBasedDispatcher added to Phase Transport
15:40:48,815 DEBUG [main] Phase:98 - Handler AddressingBasedDispatcher added to Phase Addressing
15:40:48,817 DEBUG [main] Phase:98 - Handler RequestURIBasedDispatcher added to Phase Dispatch
15:40:48,818 DEBUG [main] Phase:98 - Handler SOAPActionBasedDispatcher added to Phase Dispatch
15:40:48,819 DEBUG [main] Phase:98 - Handler RequestURIOperationDispatcher added to Phase Dispatch
15:40:48,820 DEBUG [main] Phase:98 - Handler SOAPMessageBodyBasedDispatcher added to Phase Dispatch
15:40:48,821 DEBUG [main] Phase:98 - Handler HTTPLocationBasedDispatcher added to Phase Dispatch
15:40:48,822 DEBUG [main] Phase:98 - Handler RequestURIBasedDispatcher added to Phase Transport
15:40:48,822 DEBUG [main] Phase:98 - Handler SOAPActionBasedDispatcher added to Phase Transport
15:40:48,823 DEBUG [main] Phase:98 - Handler AddressingBasedDispatcher added to Phase Addressing
15:40:48,823 DEBUG [main] Phase:98 - Handler RequestURIBasedDispatcher added to Phase Dispatch
15:40:48,823 DEBUG [main] Phase:98 - Handler SOAPActionBasedDispatcher added to Phase Dispatch
15:40:48,824 DEBUG [main] Phase:98 - Handler RequestURIOperationDispatcher added to Phase Dispatch
15:40:48,824 DEBUG [main] Phase:98 - Handler SOAPMessageBodyBasedDispatcher added to Phase Dispatch
15:40:48,824 DEBUG [main] Phase:98 - Handler HTTPLocationBasedDispatcher added to Phase Dispatch
15:40:48,839 DEBUG [main] Loader:256 - java.lang.ClassNotFoundException: org.apache.axis2.jaxws.framework.JAXWSServiceBuilderExtension
15:40:48,839  WARN [main] AxisConfigBuilder:442 - Unable to instantiate deployer org.apache.axis2.deployment.ServiceDeployer; see debug logs for more details
15:40:48,841 DEBUG [main] AxisConfigBuilder:444 - org.apache.axis2.jaxws.framework.JAXWSServiceBuilderExtension
java.lang.ClassNotFoundException: org.apache.axis2.jaxws.framework.JAXWSServiceBuilderExtension
	at java.net.URLClassLoader.findClass(URLClassLoader.java:381)
	at java.lang.ClassLoader.loadClass(ClassLoader.java:424)
	at sun.misc.Launcher$AppClassLoader.loadClass(Launcher.java:338)
	at java.lang.ClassLoader.loadClass(ClassLoader.java:357)
	at java.lang.Class.forName0(Native Method)
	at java.lang.Class.forName(Class.java:264)
	at org.apache.axis2.util.Loader.loadClass(Loader.java:261)
	at org.apache.axis2.deployment.AxisConfigBuilder.processDeployers(AxisConfigBuilder.java:434)
	at org.apache.axis2.deployment.AxisConfigBuilder.populateConfig(AxisConfigBuilder.java:275)
	at org.apache.axis2.deployment.DeploymentEngine.populateAxisConfiguration(DeploymentEngine.java:629)
	at org.apache.axis2.deployment.FileSystemConfigurator.getAxisConfiguration(FileSystemConfigurator.java:116)
	at org.apache.axis2.context.ConfigurationContextFactory.createConfigurationContext(ConfigurationContextFactory.java:64)
	at org.apache.axis2.context.ConfigurationContextFactory.createConfigurationContextFromFileSystem(ConfigurationContextFactory.java:210)
	at org.apache.axis2.client.ServiceClient.configureServiceClient(ServiceClient.java:150)
	at org.apache.axis2.client.ServiceClient.<init>(ServiceClient.java:143)
	at net.ihe.gazelle.ws.client.GazelleTRMServiceStub.<init>(GazelleTRMServiceStub.java:43)
	at net.ihe.gazelle.ws.client.GazelleTRMServiceStub.<init>(GazelleTRMServiceStub.java:29)
	at net.ihe.gazelle.ws.client.GazelleTRMServiceStub.<init>(GazelleTRMServiceStub.java:75)
	at net.ihe.gazelle.ws.client.GazelleTRMServiceClient.<init>(GazelleTRMServiceClient.java:11)
	at net.ihe.gazelle.ws.client.GazelleTRMServiceStubTest.getSystemIsAToolTest(GazelleTRMServiceStubTest.java:21)
	at sun.reflect.NativeMethodAccessorImpl.invoke0(Native Method)
	at sun.reflect.NativeMethodAccessorImpl.invoke(NativeMethodAccessorImpl.java:62)
	at sun.reflect.DelegatingMethodAccessorImpl.invoke(DelegatingMethodAccessorImpl.java:43)
	at java.lang.reflect.Method.invoke(Method.java:498)
	at org.junit.runners.model.FrameworkMethod$1.runReflectiveCall(FrameworkMethod.java:44)
	at org.junit.internal.runners.model.ReflectiveCallable.run(ReflectiveCallable.java:15)
	at org.junit.runners.model.FrameworkMethod.invokeExplosively(FrameworkMethod.java:41)
	at org.junit.internal.runners.statements.InvokeMethod.evaluate(InvokeMethod.java:20)
	at org.junit.runners.BlockJUnit4ClassRunner.runNotIgnored(BlockJUnit4ClassRunner.java:79)
	at org.junit.runners.BlockJUnit4ClassRunner.runChild(BlockJUnit4ClassRunner.java:71)
	at org.junit.runners.BlockJUnit4ClassRunner.runChild(BlockJUnit4ClassRunner.java:49)
	at org.junit.runners.ParentRunner$3.run(ParentRunner.java:193)
	at org.junit.runners.ParentRunner$1.schedule(ParentRunner.java:52)
	at org.junit.runners.ParentRunner.runChildren(ParentRunner.java:191)
	at org.junit.runners.ParentRunner.access$000(ParentRunner.java:42)
	at org.junit.runners.ParentRunner$2.evaluate(ParentRunner.java:184)
	at org.junit.runners.ParentRunner.run(ParentRunner.java:236)
	at org.apache.maven.surefire.junit4.JUnit4Provider.execute(JUnit4Provider.java:252)
	at org.apache.maven.surefire.junit4.JUnit4Provider.executeTestSet(JUnit4Provider.java:141)
	at org.apache.maven.surefire.junit4.JUnit4Provider.invoke(JUnit4Provider.java:112)
	at sun.reflect.NativeMethodAccessorImpl.invoke0(Native Method)
	at sun.reflect.NativeMethodAccessorImpl.invoke(NativeMethodAccessorImpl.java:62)
	at sun.reflect.DelegatingMethodAccessorImpl.invoke(DelegatingMethodAccessorImpl.java:43)
	at java.lang.reflect.Method.invoke(Method.java:498)
	at org.apache.maven.surefire.util.ReflectionUtils.invokeMethodWithArray(ReflectionUtils.java:189)
	at org.apache.maven.surefire.booter.ProviderFactory$ProviderProxy.invoke(ProviderFactory.java:165)
	at org.apache.maven.surefire.booter.ProviderFactory.invokeProvider(ProviderFactory.java:85)
	at org.apache.maven.surefire.booter.ForkedBooter.runSuitesInProcess(ForkedBooter.java:115)
	at org.apache.maven.surefire.booter.ForkedBooter.main(ForkedBooter.java:75)
15:40:48,862 DEBUG [main] AxisConfiguration:486 - Adding service to allServices map: [GazelleTRMService1523540448379_1] 
15:40:48,865 DEBUG [main] AxisOperation:567 - AxisOperation::getSoapAction urn:anonRobustOp
15:40:48,867 DEBUG [main] AxisOperation:567 - AxisOperation::getSoapAction urn:anonOutonlyOp
15:40:48,867 DEBUG [main] AxisOperation:567 - AxisOperation::getSoapAction urn:getSystemIsATool
15:40:48,868 DEBUG [main] AxisOperation:567 - AxisOperation::getSoapAction urn:anonOutInOp
15:40:48,868 DEBUG [main] AxisOperation:567 - AxisOperation::getSoapAction urn:getTestInstancesByTestingSession
15:40:48,868 DEBUG [main] AxisOperation:567 - AxisOperation::getSoapAction urn:getTestInstanceById
15:40:48,874 DEBUG [main] AxisOperation:567 - AxisOperation::getSoapAction urn:anonRobustOp
15:40:48,874 DEBUG [main] AxisOperation:567 - AxisOperation::getSoapAction urn:anonOutonlyOp
15:40:48,874 DEBUG [main] AxisOperation:567 - AxisOperation::getSoapAction urn:getSystemIsATool
15:40:48,874 DEBUG [main] AxisOperation:567 - AxisOperation::getSoapAction urn:anonOutInOp
15:40:48,875 DEBUG [main] AxisOperation:567 - AxisOperation::getSoapAction urn:getTestInstancesByTestingSession
15:40:48,875 DEBUG [main] AxisOperation:567 - AxisOperation::getSoapAction urn:getTestInstanceById
15:40:48,877 DEBUG [main] AxisConfiguration:396 - Adding service to allEndpoints map: (GazelleTRMService1523540448379_1,GazelleTRMService1523540448379_1HttpSoap12Endpoint) 
15:40:48,877 DEBUG [main] AxisConfiguration:396 - Adding service to allEndpoints map: (GazelleTRMService1523540448379_1,GazelleTRMService1523540448379_1HttpSoap11Endpoint) 
15:40:48,877 DEBUG [main] AxisConfiguration:396 - Adding service to allEndpoints map: (GazelleTRMService1523540448379_1,GazelleTRMService1523540448379_1HttpEndpoint) 
15:40:48,878 DEBUG [main] AxisConfiguration:403 - After adding to allEndpoints map, size is 3
15:40:48,881 DEBUG [main] AxisService:1971 - Get operation for {http://trm.ws.gazelletest.tm.gazelle.ihe.net/}getSystemIsATool
15:40:48,881 DEBUG [main] AxisService:2014 - Found axis operation:  org.apache.axis2.description.OutInAxisOperation@dd8ba08
15:40:48,883 DEBUG [main] Options:589 - setAction Old action is (null)
15:40:48,883 DEBUG [main] Options:590 - setAction New action is (http://trm.ws.gazelletest.tm.gazelle.ihe.net/gazelleTRM/getSystemIsATool)
15:40:48,901 DEBUG [main] ConfigurationContext:55 - OnDemandLogger initialized for class org.apache.axis2.context.ConfigurationContext is:org.apache.commons.logging.impl.Log4JLogger@6bd61f98
15:40:48,901 DEBUG [main] ConfigurationContext:85 - registerOperationContext (false): org.apache.axis2.context.OperationContext@13fd2ccd with key: urn:uuid:5041e1ce-4a1d-43de-b321-0041046c0c5f
15:40:48,902 DEBUG [main] OutInAxisOperationClient:164 - Entry: OutInAxisOperationClient::execute, true
15:40:48,902 DEBUG [main] Options:246 - getAction (null) from org.apache.axis2.client.Options@7d4f9aae
15:40:48,902 DEBUG [main] MessageContext:1119 - SoapAction is (null)
15:40:48,903 DEBUG [main] Options:246 - getAction (http://trm.ws.gazelletest.tm.gazelle.ihe.net/gazelleTRM/getSystemIsATool) from org.apache.axis2.client.Options@53aac487
15:40:48,903 DEBUG [main] Options:246 - getAction (null) from org.apache.axis2.client.Options@7d4f9aae
15:40:48,903 DEBUG [main] MessageContext:1524 - Old SoapAction is (null)
15:40:48,904 DEBUG [main] MessageContext:1525 - New SoapAction is (http://trm.ws.gazelletest.tm.gazelle.ihe.net/gazelleTRM/getSystemIsATool)
15:40:48,904 DEBUG [main] Options:589 - setAction Old action is (null)
15:40:48,904 DEBUG [main] Options:590 - setAction New action is (http://trm.ws.gazelletest.tm.gazelle.ihe.net/gazelleTRM/getSystemIsATool)
15:40:48,905 DEBUG [main] OutInAxisOperationClient:194 - OutInAxisOperationClient: useAsyncOption null
15:40:48,906 DEBUG [main] ConfigurationContext:85 - registerOperationContext (false): org.apache.axis2.context.OperationContext@13fd2ccd with key: urn:uuid:5041e1ce-4a1d-43de-b321-0041046c0c5f
15:40:48,906 DEBUG [main] Options:246 - getAction (http://trm.ws.gazelletest.tm.gazelle.ihe.net/gazelleTRM/getSystemIsATool) from org.apache.axis2.client.Options@7d4f9aae
15:40:48,906 DEBUG [main] MessageContext:1154 - WASAction is (http://trm.ws.gazelletest.tm.gazelle.ihe.net/gazelleTRM/getSystemIsATool)
15:40:48,907 DEBUG [main] ConfigurationContext:85 - msgContext: [MessageContext: logID=3ca2a63f455693ddf120d8e0e53bb4fc67ebbd7001e845c7] action: http://trm.ws.gazelletest.tm.gazelle.ihe.net/gazelleTRM/getSystemIsATool
15:40:48,908 DEBUG [main] Phase:289 - [MessageContext: logID=3ca2a63f455693ddf120d8e0e53bb4fc67ebbd7001e845c7] Checking pre-condition for Phase "RMPhase"
15:40:48,908 DEBUG [main] Phase:300 - [MessageContext: logID=3ca2a63f455693ddf120d8e0e53bb4fc67ebbd7001e845c7] Invoking phase "RMPhase"
15:40:48,908 DEBUG [main] Phase:319 - [MessageContext: logID=3ca2a63f455693ddf120d8e0e53bb4fc67ebbd7001e845c7] Checking post-conditions for phase "RMPhase"
15:40:48,909 DEBUG [main] Phase:289 - [MessageContext: logID=3ca2a63f455693ddf120d8e0e53bb4fc67ebbd7001e845c7] Checking pre-condition for Phase "OpPhase"
15:40:48,909 DEBUG [main] Phase:300 - [MessageContext: logID=3ca2a63f455693ddf120d8e0e53bb4fc67ebbd7001e845c7] Invoking phase "OpPhase"
15:40:48,909 DEBUG [main] Phase:319 - [MessageContext: logID=3ca2a63f455693ddf120d8e0e53bb4fc67ebbd7001e845c7] Checking post-conditions for phase "OpPhase"
15:40:48,909 DEBUG [main] Phase:289 - [MessageContext: logID=3ca2a63f455693ddf120d8e0e53bb4fc67ebbd7001e845c7] Checking pre-condition for Phase "OperationOutPhase"
15:40:48,909 DEBUG [main] Phase:300 - [MessageContext: logID=3ca2a63f455693ddf120d8e0e53bb4fc67ebbd7001e845c7] Invoking phase "OperationOutPhase"
15:40:48,910 DEBUG [main] Phase:319 - [MessageContext: logID=3ca2a63f455693ddf120d8e0e53bb4fc67ebbd7001e845c7] Checking post-conditions for phase "OperationOutPhase"
15:40:48,910 DEBUG [main] Phase:289 - [MessageContext: logID=3ca2a63f455693ddf120d8e0e53bb4fc67ebbd7001e845c7] Checking pre-condition for Phase "PolicyDetermination"
15:40:48,910 DEBUG [main] Phase:300 - [MessageContext: logID=3ca2a63f455693ddf120d8e0e53bb4fc67ebbd7001e845c7] Invoking phase "PolicyDetermination"
15:40:48,910 DEBUG [main] Phase:319 - [MessageContext: logID=3ca2a63f455693ddf120d8e0e53bb4fc67ebbd7001e845c7] Checking post-conditions for phase "PolicyDetermination"
15:40:48,910 DEBUG [main] Phase:289 - [MessageContext: logID=3ca2a63f455693ddf120d8e0e53bb4fc67ebbd7001e845c7] Checking pre-condition for Phase "MessageOut"
15:40:48,910 DEBUG [main] Phase:300 - [MessageContext: logID=3ca2a63f455693ddf120d8e0e53bb4fc67ebbd7001e845c7] Invoking phase "MessageOut"
15:40:48,911 DEBUG [main] Phase:319 - [MessageContext: logID=3ca2a63f455693ddf120d8e0e53bb4fc67ebbd7001e845c7] Checking post-conditions for phase "MessageOut"
15:40:48,911 DEBUG [main] Phase:289 - [MessageContext: logID=3ca2a63f455693ddf120d8e0e53bb4fc67ebbd7001e845c7] Checking pre-condition for Phase "Security"
15:40:48,911 DEBUG [main] Phase:300 - [MessageContext: logID=3ca2a63f455693ddf120d8e0e53bb4fc67ebbd7001e845c7] Invoking phase "Security"
15:40:48,911 DEBUG [main] Phase:319 - [MessageContext: logID=3ca2a63f455693ddf120d8e0e53bb4fc67ebbd7001e845c7] Checking post-conditions for phase "Security"
15:40:48,923 DEBUG [main] DefaultHttpParams:151 - Set parameter http.useragent = Jakarta Commons-HttpClient/3.1
15:40:48,924 DEBUG [main] DefaultHttpParams:151 - Set parameter http.protocol.version = HTTP/1.1
15:40:48,924 DEBUG [main] DefaultHttpParams:151 - Set parameter http.connection-manager.class = class org.apache.commons.httpclient.SimpleHttpConnectionManager
15:40:48,925 DEBUG [main] DefaultHttpParams:151 - Set parameter http.protocol.cookie-policy = default
15:40:48,925 DEBUG [main] DefaultHttpParams:151 - Set parameter http.protocol.element-charset = US-ASCII
15:40:48,926 DEBUG [main] DefaultHttpParams:151 - Set parameter http.protocol.content-charset = ISO-8859-1
15:40:48,927 DEBUG [main] DefaultHttpParams:151 - Set parameter http.method.retry-handler = org.apache.commons.httpclient.DefaultHttpMethodRetryHandler@25ce9dc4
15:40:48,927 DEBUG [main] DefaultHttpParams:151 - Set parameter http.dateparser.patterns = [EEE, dd MMM yyyy HH:mm:ss zzz, EEEE, dd-MMM-yy HH:mm:ss zzz, EEE MMM d HH:mm:ss yyyy, EEE, dd-MMM-yyyy HH:mm:ss z, EEE, dd-MMM-yyyy HH-mm-ss z, EEE, dd MMM yy HH:mm:ss z, EEE dd-MMM-yyyy HH:mm:ss z, EEE dd MMM yyyy HH:mm:ss z, EEE dd-MMM-yyyy HH-mm-ss z, EEE dd-MMM-yy HH:mm:ss z, EEE dd MMM yy HH:mm:ss z, EEE,dd-MMM-yy HH:mm:ss z, EEE,dd-MMM-yyyy HH:mm:ss z, EEE, dd-MM-yyyy HH:mm:ss z]
15:40:48,930 DEBUG [main] HttpClient:72 - Java version: 1.8.0_161
15:40:48,931 DEBUG [main] HttpClient:73 - Java vendor: Oracle Corporation
15:40:48,931 DEBUG [main] HttpClient:74 - Java class path: /home/jenkins/.hudson/jobs/GazelleTRMClient-SNAPSHOT/workspace/target/test-classes:/home/jenkins/.hudson/jobs/GazelleTRMClient-SNAPSHOT/workspace/target/classes:/home/jenkins/.m2/repository/org/apache/axis2/axis2-adb/1.7.2/axis2-adb-1.7.2.jar:/home/jenkins/.m2/repository/org/apache/axis2/axis2-kernel/1.7.2/axis2-kernel-1.7.2.jar:/home/jenkins/.m2/repository/org/apache/ws/commons/axiom/axiom-api/1.2.19/axiom-api-1.2.19.jar:/home/jenkins/.m2/repository/jaxen/jaxen/1.1.6/jaxen-1.1.6.jar:/home/jenkins/.m2/repository/org/apache/geronimo/specs/geronimo-stax-api_1.0_spec/1.0.1/geronimo-stax-api_1.0_spec-1.0.1.jar:/home/jenkins/.m2/repository/org/apache/james/apache-mime4j-core/0.7.2/apache-mime4j-core-0.7.2.jar:/home/jenkins/.m2/repository/org/apache/ws/commons/axiom/axiom-impl/1.2.19/axiom-impl-1.2.19.jar:/home/jenkins/.m2/repository/org/apache/geronimo/specs/geronimo-ws-metadata_2.0_spec/1.1.2/geronimo-ws-metadata_2.0_spec-1.1.2.jar:/home/jenkins/.m2/repository/org/apache/geronimo/specs/geronimo-jta_1.1_spec/1.1/geronimo-jta_1.1_spec-1.1.jar:/home/jenkins/.m2/repository/javax/servlet/servlet-api/2.3/servlet-api-2.3.jar:/home/jenkins/.m2/repository/commons-fileupload/commons-fileupload/1.3.1/commons-fileupload-1.3.1.jar:/home/jenkins/.m2/repository/wsdl4j/wsdl4j/1.6.2/wsdl4j-1.6.2.jar:/home/jenkins/.m2/repository/org/apache/ws/xmlschema/xmlschema-core/2.2.1/xmlschema-core-2.2.1.jar:/home/jenkins/.m2/repository/org/apache/neethi/neethi/3.0.3/neethi-3.0.3.jar:/home/jenkins/.m2/repository/org/apache/woden/woden-core/1.0M10/woden-core-1.0M10.jar:/home/jenkins/.m2/repository/javax/ws/rs/jsr311-api/1.1.1/jsr311-api-1.1.1.jar:/home/jenkins/.m2/repository/org/apache/ws/commons/axiom/axiom-dom/1.2.19/axiom-dom-1.2.19.jar:/home/jenkins/.m2/repository/org/codehaus/woodstox/woodstox-core-asl/4.2.0/woodstox-core-asl-4.2.0.jar:/home/jenkins/.m2/repository/org/codehaus/woodstox/stax2-api/3.1.1/stax2-api-3.1.1.jar:/home/jenkins/.m2/repository/org/apache/geronimo/specs/geronimo-activation_1.1_spec/1.0.2/geronimo-activation_1.1_spec-1.0.2.jar:/home/jenkins/.m2/repository/org/apache/woden/woden-impl-dom/1.0M8.IHE/woden-impl-dom-1.0M8.IHE.jar:/home/jenkins/.m2/repository/org/apache/axis2/axis2-transport-local/1.7.2/axis2-transport-local-1.7.2.jar:/home/jenkins/.m2/repository/org/apache/axis2/axis2-transport-http/1.7.2/axis2-transport-http-1.7.2.jar:/home/jenkins/.m2/repository/org/apache/httpcomponents/httpcore/4.2.5/httpcore-4.2.5.jar:/home/jenkins/.m2/repository/commons-httpclient/commons-httpclient/3.1/commons-httpclient-3.1.jar:/home/jenkins/.m2/repository/org/apache/ant/ant-launcher/1.7.0/ant-launcher-1.7.0.jar:/home/jenkins/.m2/repository/ca/uhn/hapi/hapi-base/2.2/hapi-base-2.2.jar:/home/jenkins/.m2/repository/org/slf4j/slf4j-api/1.6.6/slf4j-api-1.6.6.jar:/home/jenkins/.m2/repository/javax/ws/rs/javax.ws.rs-api/2.0/javax.ws.rs-api-2.0.jar:/home/jenkins/.m2/repository/org/codehaus/mojo/gazelle-plugins/1.60/gazelle-plugins-1.60.jar:/home/jenkins/.m2/repository/org/apache/maven/plugins/maven-dependency-plugin/2.8/maven-dependency-plugin-2.8.jar:/home/jenkins/.m2/repository/org/apache/maven/maven-artifact/2.0.9/maven-artifact-2.0.9.jar:/home/jenkins/.m2/repository/org/apache/maven/maven-plugin-api/2.0.9/maven-plugin-api-2.0.9.jar:/home/jenkins/.m2/repository/org/apache/maven/maven-project/2.0.9/maven-project-2.0.9.jar:/home/jenkins/.m2/repository/org/apache/maven/maven-profile/2.0.9/maven-profile-2.0.9.jar:/home/jenkins/.m2/repository/org/apache/maven/maven-plugin-registry/2.0.9/maven-plugin-registry-2.0.9.jar:/home/jenkins/.m2/repository/org/apache/maven/maven-model/2.0.9/maven-model-2.0.9.jar:/home/jenkins/.m2/repository/org/apache/maven/maven-core/2.0.9/maven-core-2.0.9.jar:/home/jenkins/.m2/repository/org/apache/maven/wagon/wagon-file/1.0-beta-2/wagon-file-1.0-beta-2.jar:/home/jenkins/.m2/repository/org/apache/maven/maven-plugin-parameter-documenter/2.0.9/maven-plugin-parameter-documenter-2.0.9.jar:/home/jenkins/.m2/repository/org/apache/maven/wagon/wagon-webdav/1.0-beta-2/wagon-webdav-1.0-beta-2.jar:/home/jenkins/.m2/repository/slide/slide-webdavlib/2.1/slide-webdavlib-2.1.jar:/home/jenkins/.m2/repository/de/zeigermann/xml/xml-im-exporter/1.1/xml-im-exporter-1.1.jar:/home/jenkins/.m2/repository/org/apache/maven/wagon/wagon-http-lightweight/1.0-beta-2/wagon-http-lightweight-1.0-beta-2.jar:/home/jenkins/.m2/repository/org/apache/maven/wagon/wagon-http-shared/1.0-beta-2/wagon-http-shared-1.0-beta-2.jar:/home/jenkins/.m2/repository/jtidy/jtidy/4aug2000r7-dev/jtidy-4aug2000r7-dev.jar:/home/jenkins/.m2/repository/org/apache/maven/wagon/wagon-provider-api/1.0-beta-2/wagon-provider-api-1.0-beta-2.jar:/home/jenkins/.m2/repository/org/apache/maven/maven-error-diagnostics/2.0.9/maven-error-diagnostics-2.0.9.jar:/home/jenkins/.m2/repository/commons-cli/commons-cli/1.0/commons-cli-1.0.jar:/home/jenkins/.m2/repository/org/apache/maven/wagon/wagon-ssh-external/1.0-beta-2/wagon-ssh-external-1.0-beta-2.jar:/home/jenkins/.m2/repository/org/apache/maven/wagon/wagon-ssh-common/1.0-beta-2/wagon-ssh-common-1.0-beta-2.jar:/home/jenkins/.m2/repository/org/apache/maven/maven-plugin-descriptor/2.0.9/maven-plugin-descriptor-2.0.9.jar:/home/jenkins/.m2/repository/org/codehaus/plexus/plexus-interactivity-api/1.0-alpha-4/plexus-interactivity-api-1.0-alpha-4.jar:/home/jenkins/.m2/repository/org/apache/maven/wagon/wagon-ssh/1.0-beta-2/wagon-ssh-1.0-beta-2.jar:/home/jenkins/.m2/repository/com/jcraft/jsch/0.1.27/jsch-0.1.27.jar:/home/jenkins/.m2/repository/org/apache/maven/maven-artifact-manager/2.0.9/maven-artifact-manager-2.0.9.jar:/home/jenkins/.m2/repository/org/apache/maven/maven-repository-metadata/2.0.9/maven-repository-metadata-2.0.9.jar:/home/jenkins/.m2/repository/org/apache/maven/reporting/maven-reporting-api/3.0/maven-reporting-api-3.0.jar:/home/jenkins/.m2/repository/org/apache/maven/reporting/maven-reporting-impl/2.0.5/maven-reporting-impl-2.0.5.jar:/home/jenkins/.m2/repository/org/apache/maven/doxia/doxia-core/1.0/doxia-core-1.0.jar:/home/jenkins/.m2/repository/org/apache/maven/shared/maven-doxia-tools/1.0.2/maven-doxia-tools-1.0.2.jar:/home/jenkins/.m2/repository/commons-validator/commons-validator/1.2.0/commons-validator-1.2.0.jar:/home/jenkins/.m2/repository/org/apache/maven/doxia/doxia-sink-api/1.0/doxia-sink-api-1.0.jar:/home/jenkins/.m2/repository/org/apache/maven/doxia/doxia-site-renderer/1.0/doxia-site-renderer-1.0.jar:/home/jenkins/.m2/repository/org/codehaus/plexus/plexus-i18n/1.0-beta-7/plexus-i18n-1.0-beta-7.jar:/home/jenkins/.m2/repository/org/codehaus/plexus/plexus-velocity/1.1.7/plexus-velocity-1.1.7.jar:/home/jenkins/.m2/repository/org/apache/maven/doxia/doxia-decoration-model/1.0/doxia-decoration-model-1.0.jar:/home/jenkins/.m2/repository/org/apache/maven/doxia/doxia-module-apt/1.0/doxia-module-apt-1.0.jar:/home/jenkins/.m2/repository/org/apache/maven/doxia/doxia-module-fml/1.0/doxia-module-fml-1.0.jar:/home/jenkins/.m2/repository/org/apache/maven/doxia/doxia-module-xdoc/1.0/doxia-module-xdoc-1.0.jar:/home/jenkins/.m2/repository/org/apache/maven/doxia/doxia-module-xhtml/1.0/doxia-module-xhtml-1.0.jar:/home/jenkins/.m2/repository/org/codehaus/plexus/plexus-archiver/2.3/plexus-archiver-2.3.jar:/home/jenkins/.m2/repository/org/codehaus/plexus/plexus-utils/3.0.9/plexus-utils-3.0.9.jar:/home/jenkins/.m2/repository/org/apache/maven/shared/file-management/1.2.1/file-management-1.2.1.jar:/home/jenkins/.m2/repository/org/apache/maven/shared/maven-shared-io/1.1/maven-shared-io-1.1.jar:/home/jenkins/.m2/repository/org/codehaus/plexus/plexus-container-default/1.0-alpha-9-stable-1/plexus-container-default-1.0-alpha-9-stable-1.jar:/home/jenkins/.m2/repository/org/codehaus/plexus/plexus-io/2.0.6/plexus-io-2.0.6.jar:/home/jenkins/.m2/repository/org/apache/maven/shared/maven-dependency-analyzer/1.4/maven-dependency-analyzer-1.4.jar:/home/jenkins/.m2/repository/asm/asm/3.3.1/asm-3.3.1.jar:/home/jenkins/.m2/repository/org/codehaus/plexus/plexus-component-annotations/1.5.5/plexus-component-annotations-1.5.5.jar:/home/jenkins/.m2/repository/org/apache/maven/shared/maven-dependency-tree/2.1/maven-dependency-tree-2.1.jar:/home/jenkins/.m2/repository/org/eclipse/aether/aether-util/0.9.0.M2/aether-util-0.9.0.M2.jar:/home/jenkins/.m2/repository/org/apache/maven/shared/maven-common-artifact-filters/1.4/maven-common-artifact-filters-1.4.jar:/home/jenkins/.m2/repository/org/apache/maven/shared/maven-invoker/2.0.11/maven-invoker-2.0.11.jar:/home/jenkins/.m2/repository/commons-lang/commons-lang/2.6/commons-lang-2.6.jar:/home/jenkins/.m2/repository/commons-collections/commons-collections/3.2.1/commons-collections-3.2.1.jar:/home/jenkins/.m2/repository/classworlds/classworlds/1.1/classworlds-1.1.jar:/home/jenkins/.m2/repository/org/apache/maven/plugins/maven-resources-plugin/2.7/maven-resources-plugin-2.7.jar:/home/jenkins/.m2/repository/org/apache/maven/maven-settings/2.2.1/maven-settings-2.2.1.jar:/home/jenkins/.m2/repository/org/apache/maven/maven-monitor/2.2.1/maven-monitor-2.2.1.jar:/home/jenkins/.m2/repository/org/apache/maven/shared/maven-filtering/1.2/maven-filtering-1.2.jar:/home/jenkins/.m2/repository/org/apache/maven/shared/maven-shared-utils/0.3/maven-shared-utils-0.3.jar:/home/jenkins/.m2/repository/com/google/code/findbugs/jsr305/2.0.1/jsr305-2.0.1.jar:/home/jenkins/.m2/repository/org/sonatype/plexus/plexus-build-api/0.0.4/plexus-build-api-0.0.4.jar:/home/jenkins/.m2/repository/org/codehaus/plexus/plexus-interpolation/1.19/plexus-interpolation-1.19.jar:/home/jenkins/.m2/repository/net/sourceforge/collections/collections-generic/4.01/collections-generic-4.01.jar:/home/jenkins/.m2/repository/org/jdom/jdom/1.1/jdom-1.1.jar:/home/jenkins/.m2/repository/com/googlecode/crowdin-maven/crowdin-plugin/1.5/crowdin-plugin-1.5.jar:/home/jenkins/.m2/repository/commons-io/commons-io/1.4/commons-io-1.4.jar:/home/jenkins/.m2/repository/ca/uhn/hapi/hapi-sourcegen/2.2/hapi-sourcegen-2.2.jar:/home/jenkins/.m2/repository/mysql/mysql-connector-java/5.1.6/mysql-connector-java-5.1.6.jar:/home/jenkins/.m2/repository/org/apache/velocity/velocity/1.7/velocity-1.7.jar:/home/jenkins/.m2/repository/org/apache/velocity/velocity-tools/2.0/velocity-tools-2.0.jar:/home/jenkins/.m2/repository/commons-beanutils/commons-beanutils/1.7.0/commons-beanutils-1.7.0.jar:/home/jenkins/.m2/repository/commons-digester/commons-digester/1.8/commons-digester-1.8.jar:/home/jenkins/.m2/repository/commons-chain/commons-chain/1.1/commons-chain-1.1.jar:/home/jenkins/.m2/repository/dom4j/dom4j/1.1/dom4j-1.1.jar:/home/jenkins/.m2/repository/oro/oro/2.0.8/oro-2.0.8.jar:/home/jenkins/.m2/repository/sslext/sslext/1.2-0/sslext-1.2-0.jar:/home/jenkins/.m2/repository/org/apache/struts/struts-core/1.3.8/struts-core-1.3.8.jar:/home/jenkins/.m2/repository/antlr/antlr/2.7.2/antlr-2.7.2.jar:/home/jenkins/.m2/repository/org/apache/struts/struts-taglib/1.3.8/struts-taglib-1.3.8.jar:/home/jenkins/.m2/repository/org/apache/struts/struts-tiles/1.3.8/struts-tiles-1.3.8.jar:/home/jenkins/.m2/repository/org/springframework/spring/2.5.6/spring-2.5.6.jar:/home/jenkins/.m2/repository/org/apache/xmlbeans/xmlbeans/2.6.0/xmlbeans-2.6.0.jar:/home/jenkins/.m2/repository/stax/stax-api/1.0.1/stax-api-1.0.1.jar:/home/jenkins/.m2/repository/apache-log4j/log4j/1.2.14/log4j-1.2.14.jar:/home/jenkins/.m2/repository/fife/rsyntaxtextarea/1.3.4/rsyntaxtextarea-1.3.4.jar:/home/jenkins/.m2/repository/org/apache/httpcomponents/httpclient/4.2.3/httpclient-4.2.3.jar:/home/jenkins/.m2/repository/commons-logging/commons-logging/1.1.1/commons-logging-1.1.1.jar:/home/jenkins/.m2/repository/commons-codec/commons-codec/1.6/commons-codec-1.6.jar:/home/jenkins/.m2/repository/amf/flex-messaging-core/1.0/flex-messaging-core-1.0.jar:/home/jenkins/.m2/repository/bouncycastle/bcprov-jdk16/140/bcprov-jdk16-140.jar:/home/jenkins/.m2/repository/org/jboss/javaee/jboss-javaee/5.0.1.GA/jboss-javaee-5.0.1.GA.jar:/home/jenkins/.m2/repository/xerces/xercesImpl/2.9.1/xercesImpl-2.9.1.jar:/home/jenkins/.m2/repository/xml-apis/xml-apis/1.3.04/xml-apis-1.3.04.jar:/home/jenkins/.m2/repository/junit/junit/4.8.2/junit-4.8.2.jar:
15:40:48,932 DEBUG [main] HttpClient:75 - Operating system name: Linux
15:40:48,932 DEBUG [main] HttpClient:76 - Operating system architecture: amd64
15:40:48,932 DEBUG [main] HttpClient:77 - Operating system version: 3.16.0-4-amd64
15:40:49,003 DEBUG [main] HttpClient:82 - SUN 1.8: SUN (DSA key/parameter generation; DSA signing; SHA-1, MD5 digests; SecureRandom; X.509 certificates; JKS & DKS keystores; PKIX CertPathValidator; PKIX CertPathBuilder; LDAP, Collection CertStores, JavaPolicy Policy; JavaLoginConfig Configuration)
15:40:49,003 DEBUG [main] HttpClient:82 - SunRsaSign 1.8: Sun RSA signature provider
15:40:49,004 DEBUG [main] HttpClient:82 - SunEC 1.8: Sun Elliptic Curve provider (EC, ECDSA, ECDH)
15:40:49,004 DEBUG [main] HttpClient:82 - SunJSSE 1.8: Sun JSSE provider(PKCS12, SunX509/PKIX key/trust factories, SSLv3/TLSv1/TLSv1.1/TLSv1.2)
15:40:49,004 DEBUG [main] HttpClient:82 - SunJCE 1.8: SunJCE Provider (implements RSA, DES, Triple DES, AES, Blowfish, ARCFOUR, RC2, PBE, Diffie-Hellman, HMAC)
15:40:49,005 DEBUG [main] HttpClient:82 - SunJGSS 1.8: Sun (Kerberos v5, SPNEGO)
15:40:49,005 DEBUG [main] HttpClient:82 - SunSASL 1.8: Sun SASL provider(implements client mechanisms for: DIGEST-MD5, GSSAPI, EXTERNAL, PLAIN, CRAM-MD5, NTLM; server mechanisms for: DIGEST-MD5, GSSAPI, CRAM-MD5, NTLM)
15:40:49,005 DEBUG [main] HttpClient:82 - XMLDSig 1.8: XMLDSig (DOM XMLSignatureFactory; DOM KeyInfoFactory; C14N 1.0, C14N 1.1, Exclusive C14N, Base64, Enveloped, XPath, XPath2, XSLT TransformServices)
15:40:49,006 DEBUG [main] HttpClient:82 - SunPCSC 1.8: Sun PC/SC provider
15:40:49,009 DEBUG [main] DefaultHttpParams:151 - Set parameter http.connection-manager.timeout = 30000
15:40:49,014 DEBUG [main] DefaultHttpParams:151 - Set parameter http.connection.timeout = 60000
15:40:49,015 DEBUG [main] DefaultHttpParams:151 - Set parameter http.socket.timeout = 60000
15:40:49,015 DEBUG [main] DefaultHttpParams:151 - Set parameter http.socket.timeout = 60000
15:40:49,028 DEBUG [main] OMOutputFormat:196 - Start getContentType: OMOutputFormat [ mimeBoundary =null rootContentId=null doOptimize=false doingSWA=false isSOAP11=true charSetEncoding=UTF-8 xmlVersion=null contentType=null ignoreXmlDeclaration=false autoCloseWriter=false actionProperty=null optimizedThreshold=0]
15:40:49,029 DEBUG [main] OMOutputFormat:215 - getContentType= {text/xml}   OMOutputFormat [ mimeBoundary =null rootContentId=null doOptimize=false doingSWA=false isSOAP11=true charSetEncoding=UTF-8 xmlVersion=null contentType=text/xml ignoreXmlDeclaration=false autoCloseWriter=false actionProperty=null optimizedThreshold=0]
15:40:49,029 DEBUG [main] SOAPMessageFormatter:123 - contentType from the OMOutputFormat =text/xml
15:40:49,029 DEBUG [main] SOAPMessageFormatter:148 - contentType returned =text/xml; charset=UTF-8
15:40:49,035 DEBUG [main] DefaultHttpParams:151 - Set parameter http.connection.timeout = 60000
15:40:49,035 DEBUG [main] DefaultHttpParams:151 - Set parameter http.socket.timeout = 60000
15:40:49,046 DEBUG [main] MultiThreadedHttpConnectionManager:412 - HttpConnectionManager.getConnection:  config = HostConfiguration[host=https://gazelle.ihe.net], timeout = 30000
15:40:49,047 DEBUG [main] MultiThreadedHttpConnectionManager:760 - Allocating new connection, hostConfig=HostConfiguration[host=https://gazelle.ihe.net]
15:40:49,049 DEBUG [main] HttpConnection:692 - Open connection to gazelle.ihe.net:443
15:40:49,327 DEBUG [main] header:70 - >> "POST /gazelle-tm-ejb/GazelleTRMService/gazelleTRM HTTP/1.1[\r][\n]"
15:40:49,328 DEBUG [main] HttpMethodBase:1352 - Adding Host request header
15:40:49,334 DEBUG [main] header:70 - >> "Content-Type: text/xml; charset=UTF-8[\r][\n]"
15:40:49,334 DEBUG [main] header:70 - >> "SOAPAction: ""[\r][\n]"
15:40:49,334 DEBUG [main] header:70 - >> "User-Agent: Axis2[\r][\n]"
15:40:49,335 DEBUG [main] header:70 - >> "Host: gazelle.ihe.net[\r][\n]"
15:40:49,335 DEBUG [main] header:70 - >> "Transfer-Encoding: chunked[\r][\n]"
15:40:49,335 DEBUG [main] header:70 - >> "[\r][\n]"
15:40:49,335 DEBUG [main] SOAPMessageFormatter:51 - start writeTo()
15:40:49,336 DEBUG [main] SOAPMessageFormatter:52 -   preserve=false
15:40:49,336 DEBUG [main] SOAPMessageFormatter:53 -   isOptimized=false
15:40:49,336 DEBUG [main] SOAPMessageFormatter:54 -   isDoingSWA=false
15:40:49,338 DEBUG [main] MTOMXMLStreamWriter:130 - Creating MTOMXMLStreamWriter
15:40:49,338 DEBUG [main] MTOMXMLStreamWriter:131 - OutputStream =class org.apache.commons.httpclient.ChunkedOutputStream
15:40:49,338 DEBUG [main] MTOMXMLStreamWriter:132 - OMFormat = OMOutputFormat [ mimeBoundary =null rootContentId=null doOptimize=false doingSWA=false isSOAP11=true charSetEncoding=UTF-8 xmlVersion=null contentType=text/xml ignoreXmlDeclaration=false autoCloseWriter=false actionProperty=null optimizedThreshold=0]
15:40:49,338 DEBUG [main] MTOMXMLStreamWriter:133 - preserveAttachments = false
15:40:49,339 DEBUG [main] StAXUtils:609 - About to create XMLOutputFactory implementation with classloader=sun.misc.Launcher$AppClassLoader@232204a1
15:40:49,340 DEBUG [main] StAXUtils:611 - The classloader for javax.xml.stream.XMLOutputFactory is: null
15:40:49,347 DEBUG [main] StAXUtils:630 - Created XMLOutputFactory = class org.apache.axiom.util.stax.wrapper.ImmutableXMLOutputFactory for classloader=sun.misc.Launcher$AppClassLoader@232204a1
15:40:49,347 DEBUG [main] StAXUtils:632 - Configuration = DEFAULT
15:40:49,347 DEBUG [main] StAXUtils:633 - Size of XMLOutFactory map for this configuration = 1
15:40:49,348 DEBUG [main] StAXUtils:634 - Configurations for which factories have been cached = [DEFAULT]
15:40:49,358 DEBUG [main] StAXUtils:344 - XMLStreamWriter is org.apache.axiom.util.stax.dialect.Woodstox4StreamWriterWrapper
15:40:49,365 DEBUG [main] MTOMXMLStreamWriter:230 - Calling MTOMXMLStreamWriter.flush
15:40:49,435 DEBUG [main] SOAPEnvelopeImpl:180 - Could not close builder or parser due to:
15:40:49,435 DEBUG [main] SOAPEnvelopeImpl:182 - builder is null
15:40:49,435 DEBUG [main] MTOMXMLStreamWriter:219 - close
15:40:49,436 DEBUG [main] MTOMXMLStreamWriter:230 - Calling MTOMXMLStreamWriter.flush
15:40:49,436 DEBUG [main] SOAPMessageFormatter:81 - end writeTo()
15:40:49,436 DEBUG [main] content:70 - >> "173[\r][\n]"
15:40:49,436 DEBUG [main] content:84 - >> "<?xml version='1.0' encoding='UTF-8'?><soapenv:Envelope xmlns:soapenv="http://schemas.xmlsoap.org/soap/envelope/"><soapenv:Header/><soapenv:Body><ns1:getSystemIsATool xmlns:ns1="http://trm.ws.gazelletest.tm.gazelle.ihe.net/"><systemKeyword>OTHER_NIST_RED_2017</systemKeyword><testingSessionId>38</testingSessionId></ns1:getSystemIsATool></soapenv:Body></soapenv:Envelope>"
15:40:49,437 DEBUG [main] content:70 - >> "[\r][\n]"
15:40:49,437 DEBUG [main] content:84 - >> "0"
15:40:49,437 DEBUG [main] content:70 - >> "[\r][\n]"
15:40:49,437 DEBUG [main] content:70 - >> "[\r][\n]"
15:40:49,438 DEBUG [main] EntityEnclosingMethod:508 - Request body sent
15:40:49,455 DEBUG [main] header:70 - << "HTTP/1.1 200 OK[\r][\n]"
15:40:49,455 DEBUG [main] header:70 - << "HTTP/1.1 200 OK[\r][\n]"
15:40:49,456 DEBUG [main] header:70 - << "Date: Thu, 12 Apr 2018 13:40:49 GMT[\r][\n]"
15:40:49,456 DEBUG [main] header:70 - << "Server: Apache[\r][\n]"
15:40:49,457 DEBUG [main] header:70 - << "Strict-Transport-Security: max-age=63072000; includeSubdomains;[\r][\n]"
15:40:49,457 DEBUG [main] header:70 - << "Content-Type: text/xml;charset=UTF-8[\r][\n]"
15:40:49,457 DEBUG [main] header:70 - << "Content-Length: 251[\r][\n]"
15:40:49,457 DEBUG [main] header:70 - << "Vary: Accept-Encoding[\r][\n]"
15:40:49,458 DEBUG [main] header:70 - << "X-Frame-Options: sameorigin[\r][\n]"
15:40:49,458 DEBUG [main] header:70 - << "[\r][\n]"
15:40:49,462 DEBUG [main] Phase:340 - [MessageContext: logID=3ca2a63f455693ddf120d8e0e53bb4fc67ebbd7001e845c7] Invoking flowComplete() in Phase "Security"
15:40:49,462 DEBUG [main] Phase:340 - [MessageContext: logID=3ca2a63f455693ddf120d8e0e53bb4fc67ebbd7001e845c7] Invoking flowComplete() in Phase "MessageOut"
15:40:49,462 DEBUG [main] Phase:340 - [MessageContext: logID=3ca2a63f455693ddf120d8e0e53bb4fc67ebbd7001e845c7] Invoking flowComplete() in Phase "PolicyDetermination"
15:40:49,463 DEBUG [main] Phase:340 - [MessageContext: logID=3ca2a63f455693ddf120d8e0e53bb4fc67ebbd7001e845c7] Invoking flowComplete() in Phase "OperationOutPhase"
15:40:49,463 DEBUG [main] Phase:340 - [MessageContext: logID=3ca2a63f455693ddf120d8e0e53bb4fc67ebbd7001e845c7] Invoking flowComplete() in Phase "OpPhase"
15:40:49,463 DEBUG [main] Phase:340 - [MessageContext: logID=3ca2a63f455693ddf120d8e0e53bb4fc67ebbd7001e845c7] Invoking flowComplete() in Phase "RMPhase"
15:40:49,463 DEBUG [main] Options:246 - getAction (http://trm.ws.gazelletest.tm.gazelle.ihe.net/gazelleTRM/getSystemIsATool) from org.apache.axis2.client.Options@53aac487
15:40:49,463 DEBUG [main] MessageContext:1524 - Old SoapAction is (http://trm.ws.gazelletest.tm.gazelle.ihe.net/gazelleTRM/getSystemIsATool)
15:40:49,464 DEBUG [main] MessageContext:1525 - New SoapAction is (null)
15:40:49,464 DEBUG [main] Options:589 - setAction Old action is (null)
15:40:49,464 DEBUG [main] Options:590 - setAction New action is (null)
15:40:49,465 DEBUG [main] Options:246 - getAction (http://trm.ws.gazelletest.tm.gazelle.ihe.net/gazelleTRM/getSystemIsATool) from org.apache.axis2.client.Options@53aac487
15:40:49,465 DEBUG [main] MessageContext:1119 - SoapAction is (http://trm.ws.gazelletest.tm.gazelle.ihe.net/gazelleTRM/getSystemIsATool)
15:40:49,465 DEBUG [main] TransportUtils:200 - createSOAPEnvelope using Builder (class org.apache.axis2.builder.SOAPBuilder) selected from type (text/xml)
15:40:49,467 DEBUG [main] StAXUtils:489 - About to create XMLInputFactory implementation with classloader=sun.misc.Launcher$AppClassLoader@232204a1
15:40:49,467 DEBUG [main] StAXUtils:491 - The classloader for javax.xml.stream.XMLInputFactory is: null
15:40:49,469 DEBUG [main] StAXUtils:513 - Created XMLInputFactory = class org.apache.axiom.util.stax.wrapper.ImmutableXMLInputFactory with classloader=sun.misc.Launcher$AppClassLoader@232204a1
15:40:49,469 DEBUG [main] StAXUtils:515 - Configuration = SOAP
15:40:49,469 DEBUG [main] StAXUtils:516 - Size of XMLInputFactory map for this configuration = 1
15:40:49,470 DEBUG [main] StAXUtils:517 - Configurations for which factories have been cached = [SOAP, DEFAULT]
15:40:49,473 DEBUG [main] content:84 - << "<soap:Envelope xmlns:soap="http://schemas.xmlsoap.org/soap/envelope/"><soap:Body><ns2:getSystemIsAToolResponse xmlns:ns2="http://trm.ws.gazelletest.tm.gazelle.ihe.net/"><isAtool>true</isAtool></ns2:getSystemIsAToolResponse></soap:Body></soap:Envelope>"
15:40:49,473 DEBUG [main] StAXUtils:194 - XMLStreamReader is org.apache.axiom.util.stax.dialect.Woodstox4StreamReaderWrapper
15:40:49,475 DEBUG [main] StAXSOAPModelBuilder:210 - Starting to process SOAP 1.1 message
15:40:49,478 DEBUG [main] StAXOMBuilder:696 - Performing look-ahead; START_ELEMENT found
15:40:49,478 DEBUG [main] Phase:289 - [MessageContext: logID=2ca2a63f455693ddf120d8e0e53bb4fc67ebbd7001e845c7] Checking pre-condition for Phase "Transport"
15:40:49,478 DEBUG [main] Phase:300 - [MessageContext: logID=2ca2a63f455693ddf120d8e0e53bb4fc67ebbd7001e845c7] Invoking phase "Transport"
15:40:49,478 DEBUG [main] Phase:331 - [MessageContext: logID=2ca2a63f455693ddf120d8e0e53bb4fc67ebbd7001e845c7] Invoking Handler 'RequestURIBasedDispatcher' in Phase 'Transport'
15:40:49,478 DEBUG [main] Phase:331 - [MessageContext: logID=2ca2a63f455693ddf120d8e0e53bb4fc67ebbd7001e845c7] Invoking Handler 'SOAPActionBasedDispatcher' in Phase 'Transport'
15:40:49,479 DEBUG [main] Phase:319 - [MessageContext: logID=2ca2a63f455693ddf120d8e0e53bb4fc67ebbd7001e845c7] Checking post-conditions for phase "Transport"
15:40:49,479 DEBUG [main] Phase:289 - [MessageContext: logID=2ca2a63f455693ddf120d8e0e53bb4fc67ebbd7001e845c7] Checking pre-condition for Phase "Addressing"
15:40:49,479 DEBUG [main] Phase:300 - [MessageContext: logID=2ca2a63f455693ddf120d8e0e53bb4fc67ebbd7001e845c7] Invoking phase "Addressing"
15:40:49,479 DEBUG [main] Phase:331 - [MessageContext: logID=2ca2a63f455693ddf120d8e0e53bb4fc67ebbd7001e845c7] Invoking Handler 'AddressingBasedDispatcher' in Phase 'Addressing'
15:40:49,479 DEBUG [main] Phase:319 - [MessageContext: logID=2ca2a63f455693ddf120d8e0e53bb4fc67ebbd7001e845c7] Checking post-conditions for phase "Addressing"
15:40:49,479 DEBUG [main] Phase:289 - [MessageContext: logID=2ca2a63f455693ddf120d8e0e53bb4fc67ebbd7001e845c7] Checking pre-condition for Phase "Security"
15:40:49,479 DEBUG [main] Phase:300 - [MessageContext: logID=2ca2a63f455693ddf120d8e0e53bb4fc67ebbd7001e845c7] Invoking phase "Security"
15:40:49,480 DEBUG [main] Phase:319 - [MessageContext: logID=2ca2a63f455693ddf120d8e0e53bb4fc67ebbd7001e845c7] Checking post-conditions for phase "Security"
15:40:49,480 DEBUG [main] Phase:289 - [MessageContext: logID=2ca2a63f455693ddf120d8e0e53bb4fc67ebbd7001e845c7] Checking pre-condition for Phase "PreDispatch"
15:40:49,480 DEBUG [main] Phase:300 - [MessageContext: logID=2ca2a63f455693ddf120d8e0e53bb4fc67ebbd7001e845c7] Invoking phase "PreDispatch"
15:40:49,480 DEBUG [main] Phase:319 - [MessageContext: logID=2ca2a63f455693ddf120d8e0e53bb4fc67ebbd7001e845c7] Checking post-conditions for phase "PreDispatch"
15:40:49,480 DEBUG [main] Phase:289 - [MessageContext: logID=2ca2a63f455693ddf120d8e0e53bb4fc67ebbd7001e845c7] Checking pre-condition for Phase "Dispatch"
15:40:49,480 DEBUG [main] Phase:300 - [MessageContext: logID=2ca2a63f455693ddf120d8e0e53bb4fc67ebbd7001e845c7] Invoking phase "Dispatch"
15:40:49,480 DEBUG [main] Phase:331 - [MessageContext: logID=2ca2a63f455693ddf120d8e0e53bb4fc67ebbd7001e845c7] Invoking Handler 'RequestURIBasedDispatcher' in Phase 'Dispatch'
15:40:49,480 DEBUG [main] Phase:331 - [MessageContext: logID=2ca2a63f455693ddf120d8e0e53bb4fc67ebbd7001e845c7] Invoking Handler 'SOAPActionBasedDispatcher' in Phase 'Dispatch'
15:40:49,481 DEBUG [main] Phase:331 - [MessageContext: logID=2ca2a63f455693ddf120d8e0e53bb4fc67ebbd7001e845c7] Invoking Handler 'RequestURIOperationDispatcher' in Phase 'Dispatch'
15:40:49,481 DEBUG [main] Phase:331 - [MessageContext: logID=2ca2a63f455693ddf120d8e0e53bb4fc67ebbd7001e845c7] Invoking Handler 'SOAPMessageBodyBasedDispatcher' in Phase 'Dispatch'
15:40:49,481 DEBUG [main] Phase:331 - [MessageContext: logID=2ca2a63f455693ddf120d8e0e53bb4fc67ebbd7001e845c7] Invoking Handler 'HTTPLocationBasedDispatcher' in Phase 'Dispatch'
15:40:49,481 DEBUG [main] Phase:319 - [MessageContext: logID=2ca2a63f455693ddf120d8e0e53bb4fc67ebbd7001e845c7] Checking post-conditions for phase "Dispatch"
15:40:49,482 DEBUG [main] AddressingHelper:102 - [MessageContext: logID=2ca2a63f455693ddf120d8e0e53bb4fc67ebbd7001e845c7] isReplyRedirected: ReplyTo is null. Returning false
15:40:49,482 DEBUG [main] Phase:289 - [MessageContext: logID=2ca2a63f455693ddf120d8e0e53bb4fc67ebbd7001e845c7] Checking pre-condition for Phase "RMPhase"
15:40:49,482 DEBUG [main] Phase:300 - [MessageContext: logID=2ca2a63f455693ddf120d8e0e53bb4fc67ebbd7001e845c7] Invoking phase "RMPhase"
15:40:49,482 DEBUG [main] Phase:319 - [MessageContext: logID=2ca2a63f455693ddf120d8e0e53bb4fc67ebbd7001e845c7] Checking post-conditions for phase "RMPhase"
15:40:49,483 DEBUG [main] Phase:289 - [MessageContext: logID=2ca2a63f455693ddf120d8e0e53bb4fc67ebbd7001e845c7] Checking pre-condition for Phase "OpPhase"
15:40:49,483 DEBUG [main] Phase:300 - [MessageContext: logID=2ca2a63f455693ddf120d8e0e53bb4fc67ebbd7001e845c7] Invoking phase "OpPhase"
15:40:49,483 DEBUG [main] Phase:319 - [MessageContext: logID=2ca2a63f455693ddf120d8e0e53bb4fc67ebbd7001e845c7] Checking post-conditions for phase "OpPhase"
15:40:49,483 DEBUG [main] Phase:289 - [MessageContext: logID=2ca2a63f455693ddf120d8e0e53bb4fc67ebbd7001e845c7] Checking pre-condition for Phase "OperationInPhase"
15:40:49,483 DEBUG [main] Phase:300 - [MessageContext: logID=2ca2a63f455693ddf120d8e0e53bb4fc67ebbd7001e845c7] Invoking phase "OperationInPhase"
15:40:49,483 DEBUG [main] Phase:319 - [MessageContext: logID=2ca2a63f455693ddf120d8e0e53bb4fc67ebbd7001e845c7] Checking post-conditions for phase "OperationInPhase"
15:40:49,483 DEBUG [main] Phase:340 - [MessageContext: logID=2ca2a63f455693ddf120d8e0e53bb4fc67ebbd7001e845c7] Invoking flowComplete() in Phase "OperationInPhase"
15:40:49,484 DEBUG [main] Phase:340 - [MessageContext: logID=2ca2a63f455693ddf120d8e0e53bb4fc67ebbd7001e845c7] Invoking flowComplete() in Phase "OpPhase"
15:40:49,484 DEBUG [main] Phase:340 - [MessageContext: logID=2ca2a63f455693ddf120d8e0e53bb4fc67ebbd7001e845c7] Invoking flowComplete() in Phase "RMPhase"
15:40:49,484 DEBUG [main] Phase:340 - [MessageContext: logID=2ca2a63f455693ddf120d8e0e53bb4fc67ebbd7001e845c7] Invoking flowComplete() in Phase "Dispatch"
15:40:49,484 DEBUG [main] Phase:359 - [MessageContext: logID=2ca2a63f455693ddf120d8e0e53bb4fc67ebbd7001e845c7] Invoking flowComplete() for Handler 'HTTPLocationBasedDispatcher' in Phase 'Dispatch'
15:40:49,484 DEBUG [main] Phase:359 - [MessageContext: logID=2ca2a63f455693ddf120d8e0e53bb4fc67ebbd7001e845c7] Invoking flowComplete() for Handler 'SOAPMessageBodyBasedDispatcher' in Phase 'Dispatch'
15:40:49,484 DEBUG [main] Phase:359 - [MessageContext: logID=2ca2a63f455693ddf120d8e0e53bb4fc67ebbd7001e845c7] Invoking flowComplete() for Handler 'RequestURIOperationDispatcher' in Phase 'Dispatch'
15:40:49,484 DEBUG [main] Phase:359 - [MessageContext: logID=2ca2a63f455693ddf120d8e0e53bb4fc67ebbd7001e845c7] Invoking flowComplete() for Handler 'SOAPActionBasedDispatcher' in Phase 'Dispatch'
15:40:49,484 DEBUG [main] Phase:359 - [MessageContext: logID=2ca2a63f455693ddf120d8e0e53bb4fc67ebbd7001e845c7] Invoking flowComplete() for Handler 'RequestURIBasedDispatcher' in Phase 'Dispatch'
15:40:49,485 DEBUG [main] Phase:340 - [MessageContext: logID=2ca2a63f455693ddf120d8e0e53bb4fc67ebbd7001e845c7] Invoking flowComplete() in Phase "PreDispatch"
15:40:49,485 DEBUG [main] Phase:340 - [MessageContext: logID=2ca2a63f455693ddf120d8e0e53bb4fc67ebbd7001e845c7] Invoking flowComplete() in Phase "Security"
15:40:49,485 DEBUG [main] Phase:340 - [MessageContext: logID=2ca2a63f455693ddf120d8e0e53bb4fc67ebbd7001e845c7] Invoking flowComplete() in Phase "Addressing"
15:40:49,485 DEBUG [main] Phase:359 - [MessageContext: logID=2ca2a63f455693ddf120d8e0e53bb4fc67ebbd7001e845c7] Invoking flowComplete() for Handler 'AddressingBasedDispatcher' in Phase 'Addressing'
15:40:49,485 DEBUG [main] Phase:340 - [MessageContext: logID=2ca2a63f455693ddf120d8e0e53bb4fc67ebbd7001e845c7] Invoking flowComplete() in Phase "Transport"
15:40:49,485 DEBUG [main] Phase:359 - [MessageContext: logID=2ca2a63f455693ddf120d8e0e53bb4fc67ebbd7001e845c7] Invoking flowComplete() for Handler 'SOAPActionBasedDispatcher' in Phase 'Transport'
15:40:49,485 DEBUG [main] Phase:359 - [MessageContext: logID=2ca2a63f455693ddf120d8e0e53bb4fc67ebbd7001e845c7] Invoking flowComplete() for Handler 'RequestURIBasedDispatcher' in Phase 'Transport'
15:40:49,486 DEBUG [main] StAXOMBuilder:648 - Consuming look-ahead token START_ELEMENT
15:40:49,490 DEBUG [main] PullSerializer:66 - Pull serializer created; initial state is org.apache.axiom.om.impl.common.serializer.pull.Navigator@3e7dd664[cache=false,document=false]
15:40:49,493 DEBUG [main] StAXBuilder:575 - Caching disabled; current element level is 3
15:40:49,493 DEBUG [main] Navigator:661 - Switching to pull-through mode; first event is START_ELEMENT; depth is 1
15:40:49,493 DEBUG [main] PullSerializer:109 - Switching to state org.apache.axiom.om.impl.common.serializer.pull.PullThroughWrapper@6e950bcf[reader=org.apache.axiom.util.stax.dialect.Woodstox4StreamReaderWrapper@16414e40]
15:40:49,494 DEBUG [main] HttpMethodBase:1024 - Resorting to protocol version default close connection policy
15:40:49,494 DEBUG [main] HttpMethodBase:1028 - Should NOT close connection, using HTTP/1.1
15:40:49,494 DEBUG [main] HttpConnection:1178 - Releasing connection back to connection manager.
15:40:49,494 DEBUG [main] MultiThreadedHttpConnectionManager:979 - Freeing connection, hostConfig=HostConfiguration[host=https://gazelle.ihe.net]
15:40:49,495 DEBUG [main] IdleConnectionHandler:76 - Adding connection at: 1523540449495
15:40:49,495 DEBUG [main] MultiThreadedHttpConnectionManager:961 - Notifying no-one, there are no waiting threads
15:40:49,496 DEBUG [main] AxisOperation:485 - Entry: AxisOperation::getInputAction
15:40:49,497 DEBUG [main] AxisOperation:506 - Exit: AxisOperation::getInputAction null
15:40:49,497 DEBUG [main] AxisOperation:467 - Entry: AxisOperation::setSoapAction, previous soapAction: null updated soapAction: urn:anonRobustOp
15:40:49,497 DEBUG [main] AxisOperation:471 - Exit: AxisOperation::setSoapAction
15:40:49,497 DEBUG [main] AxisService:872 - mapActionToOperation: Mapping Action to Operation: action: anonRobustOp; operation: org.apache.axis2.description.RobustOutOnlyAxisOperation@6dee4f1bnamed: {http://ws.apache.org/namespaces/axis2}anonRobustOp
15:40:49,497 DEBUG [main] AxisService:878 - DEBUG_FRAME = org.apache.axis2.util.JavaUtils.callStackToString(JavaUtils.java:564)
	DEBUG_FRAME = org.apache.axis2.description.AxisService.mapActionToOperation(AxisService.java:878)
	DEBUG_FRAME = org.apache.axis2.description.AxisService.addOperation(AxisService.java:724)
	DEBUG_FRAME = org.apache.axis2.client.Stub.addAnonymousOperations(Stub.java:234)
	DEBUG_FRAME = net.ihe.gazelle.ws.client.GazelleTRMServiceStub.populateAxisService(GazelleTRMServiceStub.java:94)
	DEBUG_FRAME = net.ihe.gazelle.ws.client.GazelleTRMServiceStub.<init>(GazelleTRMServiceStub.java:40)
	DEBUG_FRAME = net.ihe.gazelle.ws.client.GazelleTRMServiceStub.<init>(GazelleTRMServiceStub.java:29)
	DEBUG_FRAME = net.ihe.gazelle.ws.client.GazelleTRMServiceStub.<init>(GazelleTRMServiceStub.java:75)
	DEBUG_FRAME = net.ihe.gazelle.ws.client.GazelleTRMServiceClient.<init>(GazelleTRMServiceClient.java:11)
	DEBUG_FRAME = net.ihe.gazelle.ws.client.GazelleTRMServiceStubTest.getTestInstanceById(GazelleTRMServiceStubTest.java:41)
	DEBUG_FRAME = sun.reflect.NativeMethodAccessorImpl.invoke0(Native Method)
	DEBUG_FRAME = sun.reflect.NativeMethodAccessorImpl.invoke(NativeMethodAccessorImpl.java:62)
	DEBUG_FRAME = sun.reflect.DelegatingMethodAccessorImpl.invoke(DelegatingMethodAccessorImpl.java:43)
	DEBUG_FRAME = java.lang.reflect.Method.invoke(Method.java:498)
	DEBUG_FRAME = org.junit.runners.model.FrameworkMethod$1.runReflectiveCall(FrameworkMethod.java:44)
	DEBUG_FRAME = org.junit.internal.runners.model.ReflectiveCallable.run(ReflectiveCallable.java:15)
	DEBUG_FRAME = org.junit.runners.model.FrameworkMethod.invokeExplosively(FrameworkMethod.java:41)
	DEBUG_FRAME = org.junit.internal.runners.statements.InvokeMethod.evaluate(InvokeMethod.java:20)
	DEBUG_FRAME = org.junit.runners.BlockJUnit4ClassRunner.runNotIgnored(BlockJUnit4ClassRunner.java:79)
	DEBUG_FRAME = org.junit.runners.BlockJUnit4ClassRunner.runChild(BlockJUnit4ClassRunner.java:71)
	DEBUG_FRAME = org.junit.runners.BlockJUnit4ClassRunner.runChild(BlockJUnit4ClassRunner.java:49)
	DEBUG_FRAME = org.junit.runners.ParentRunner$3.run(ParentRunner.java:193)
	DEBUG_FRAME = org.junit.runners.ParentRunner$1.schedule(ParentRunner.java:52)
	DEBUG_FRAME = org.junit.runners.ParentRunner.runChildren(ParentRunner.java:191)
	DEBUG_FRAME = org.junit.runners.ParentRunner.access$000(ParentRunner.java:42)
	DEBUG_FRAME = org.junit.runners.ParentRunner$2.evaluate(ParentRunner.java:184)
	DEBUG_FRAME = org.junit.runners.ParentRunner.run(ParentRunner.java:236)
	DEBUG_FRAME = org.apache.maven.surefire.junit4.JUnit4Provider.execute(JUnit4Provider.java:252)
	DEBUG_FRAME = org.apache.maven.surefire.junit4.JUnit4Provider.executeTestSet(JUnit4Provider.java:141)
	DEBUG_FRAME = org.apache.maven.surefire.junit4.JUnit4Provider.invoke(JUnit4Provider.java:112)
	DEBUG_FRAME = sun.reflect.NativeMethodAccessorImpl.invoke0(Native Method)
	DEBUG_FRAME = sun.reflect.NativeMethodAccessorImpl.invoke(NativeMethodAccessorImpl.java:62)
	DEBUG_FRAME = sun.reflect.DelegatingMethodAccessorImpl.invoke(DelegatingMethodAccessorImpl.java:43)
	DEBUG_FRAME = java.lang.reflect.Method.invoke(Method.java:498)
	DEBUG_FRAME = org.apache.maven.surefire.util.ReflectionUtils.invokeMethodWithArray(ReflectionUtils.java:189)
	DEBUG_FRAME = org.apache.maven.surefire.booter.ProviderFactory$ProviderProxy.invoke(ProviderFactory.java:165)
	DEBUG_FRAME = org.apache.maven.surefire.booter.ProviderFactory.invokeProvider(ProviderFactory.java:85)
	DEBUG_FRAME = org.apache.maven.surefire.booter.ForkedBooter.runSuitesInProcess(ForkedBooter.java:115)
	DEBUG_FRAME = org.apache.maven.surefire.booter.ForkedBooter.main(ForkedBooter.java:75)

15:40:49,497 DEBUG [main] AxisOperation:485 - Entry: AxisOperation::getInputAction
15:40:49,497 DEBUG [main] AxisOperation:490 - Debug: AxisOperation::getInputAction - using soapAction
15:40:49,498 DEBUG [main] AxisOperation:506 - Exit: AxisOperation::getInputAction urn:anonRobustOp
15:40:49,498 DEBUG [main] AxisService:872 - mapActionToOperation: Mapping Action to Operation: action: urn:anonRobustOp; operation: org.apache.axis2.description.RobustOutOnlyAxisOperation@6dee4f1bnamed: {http://ws.apache.org/namespaces/axis2}anonRobustOp
15:40:49,498 DEBUG [main] AxisService:878 - DEBUG_FRAME = org.apache.axis2.util.JavaUtils.callStackToString(JavaUtils.java:564)
	DEBUG_FRAME = org.apache.axis2.description.AxisService.mapActionToOperation(AxisService.java:878)
	DEBUG_FRAME = org.apache.axis2.description.AxisService.addOperation(AxisService.java:728)
	DEBUG_FRAME = org.apache.axis2.client.Stub.addAnonymousOperations(Stub.java:234)
	DEBUG_FRAME = net.ihe.gazelle.ws.client.GazelleTRMServiceStub.populateAxisService(GazelleTRMServiceStub.java:94)
	DEBUG_FRAME = net.ihe.gazelle.ws.client.GazelleTRMServiceStub.<init>(GazelleTRMServiceStub.java:40)
	DEBUG_FRAME = net.ihe.gazelle.ws.client.GazelleTRMServiceStub.<init>(GazelleTRMServiceStub.java:29)
	DEBUG_FRAME = net.ihe.gazelle.ws.client.GazelleTRMServiceStub.<init>(GazelleTRMServiceStub.java:75)
	DEBUG_FRAME = net.ihe.gazelle.ws.client.GazelleTRMServiceClient.<init>(GazelleTRMServiceClient.java:11)
	DEBUG_FRAME = net.ihe.gazelle.ws.client.GazelleTRMServiceStubTest.getTestInstanceById(GazelleTRMServiceStubTest.java:41)
	DEBUG_FRAME = sun.reflect.NativeMethodAccessorImpl.invoke0(Native Method)
	DEBUG_FRAME = sun.reflect.NativeMethodAccessorImpl.invoke(NativeMethodAccessorImpl.java:62)
	DEBUG_FRAME = sun.reflect.DelegatingMethodAccessorImpl.invoke(DelegatingMethodAccessorImpl.java:43)
	DEBUG_FRAME = java.lang.reflect.Method.invoke(Method.java:498)
	DEBUG_FRAME = org.junit.runners.model.FrameworkMethod$1.runReflectiveCall(FrameworkMethod.java:44)
	DEBUG_FRAME = org.junit.internal.runners.model.ReflectiveCallable.run(ReflectiveCallable.java:15)
	DEBUG_FRAME = org.junit.runners.model.FrameworkMethod.invokeExplosively(FrameworkMethod.java:41)
	DEBUG_FRAME = org.junit.internal.runners.statements.InvokeMethod.evaluate(InvokeMethod.java:20)
	DEBUG_FRAME = org.junit.runners.BlockJUnit4ClassRunner.runNotIgnored(BlockJUnit4ClassRunner.java:79)
	DEBUG_FRAME = org.junit.runners.BlockJUnit4ClassRunner.runChild(BlockJUnit4ClassRunner.java:71)
	DEBUG_FRAME = org.junit.runners.BlockJUnit4ClassRunner.runChild(BlockJUnit4ClassRunner.java:49)
	DEBUG_FRAME = org.junit.runners.ParentRunner$3.run(ParentRunner.java:193)
	DEBUG_FRAME = org.junit.runners.ParentRunner$1.schedule(ParentRunner.java:52)
	DEBUG_FRAME = org.junit.runners.ParentRunner.runChildren(ParentRunner.java:191)
	DEBUG_FRAME = org.junit.runners.ParentRunner.access$000(ParentRunner.java:42)
	DEBUG_FRAME = org.junit.runners.ParentRunner$2.evaluate(ParentRunner.java:184)
	DEBUG_FRAME = org.junit.runners.ParentRunner.run(ParentRunner.java:236)
	DEBUG_FRAME = org.apache.maven.surefire.junit4.JUnit4Provider.execute(JUnit4Provider.java:252)
	DEBUG_FRAME = org.apache.maven.surefire.junit4.JUnit4Provider.executeTestSet(JUnit4Provider.java:141)
	DEBUG_FRAME = org.apache.maven.surefire.junit4.JUnit4Provider.invoke(JUnit4Provider.java:112)
	DEBUG_FRAME = sun.reflect.NativeMethodAccessorImpl.invoke0(Native Method)
	DEBUG_FRAME = sun.reflect.NativeMethodAccessorImpl.invoke(NativeMethodAccessorImpl.java:62)
	DEBUG_FRAME = sun.reflect.DelegatingMethodAccessorImpl.invoke(DelegatingMethodAccessorImpl.java:43)
	DEBUG_FRAME = java.lang.reflect.Method.invoke(Method.java:498)
	DEBUG_FRAME = org.apache.maven.surefire.util.ReflectionUtils.invokeMethodWithArray(ReflectionUtils.java:189)
	DEBUG_FRAME = org.apache.maven.surefire.booter.ProviderFactory$ProviderProxy.invoke(ProviderFactory.java:165)
	DEBUG_FRAME = org.apache.maven.surefire.booter.ProviderFactory.invokeProvider(ProviderFactory.java:85)
	DEBUG_FRAME = org.apache.maven.surefire.booter.ForkedBooter.runSuitesInProcess(ForkedBooter.java:115)
	DEBUG_FRAME = org.apache.maven.surefire.booter.ForkedBooter.main(ForkedBooter.java:75)

15:40:49,498 DEBUG [main] AxisService:673 - Client-defined operation name matches default operation name. this may cause interoperability issues.  Name is: {http://ws.apache.org/namespaces/axis2}anonOutonlyOp
15:40:49,499 DEBUG [main] AxisOperation:485 - Entry: AxisOperation::getInputAction
15:40:49,499 DEBUG [main] AxisOperation:506 - Exit: AxisOperation::getInputAction null
15:40:49,499 DEBUG [main] AxisOperation:467 - Entry: AxisOperation::setSoapAction, previous soapAction: null updated soapAction: urn:anonOutonlyOp
15:40:49,499 DEBUG [main] AxisOperation:471 - Exit: AxisOperation::setSoapAction
15:40:49,499 DEBUG [main] AxisService:872 - mapActionToOperation: Mapping Action to Operation: action: anonOutonlyOp; operation: org.apache.axis2.description.OutOnlyAxisOperation@22d7b4f8named: {http://ws.apache.org/namespaces/axis2}anonOutonlyOp
15:40:49,500 DEBUG [main] AxisService:878 - DEBUG_FRAME = org.apache.axis2.util.JavaUtils.callStackToString(JavaUtils.java:564)
	DEBUG_FRAME = org.apache.axis2.description.AxisService.mapActionToOperation(AxisService.java:878)
	DEBUG_FRAME = org.apache.axis2.description.AxisService.addOperation(AxisService.java:724)
	DEBUG_FRAME = org.apache.axis2.client.Stub.addAnonymousOperations(Stub.java:237)
	DEBUG_FRAME = net.ihe.gazelle.ws.client.GazelleTRMServiceStub.populateAxisService(GazelleTRMServiceStub.java:94)
	DEBUG_FRAME = net.ihe.gazelle.ws.client.GazelleTRMServiceStub.<init>(GazelleTRMServiceStub.java:40)
	DEBUG_FRAME = net.ihe.gazelle.ws.client.GazelleTRMServiceStub.<init>(GazelleTRMServiceStub.java:29)
	DEBUG_FRAME = net.ihe.gazelle.ws.client.GazelleTRMServiceStub.<init>(GazelleTRMServiceStub.java:75)
	DEBUG_FRAME = net.ihe.gazelle.ws.client.GazelleTRMServiceClient.<init>(GazelleTRMServiceClient.java:11)
	DEBUG_FRAME = net.ihe.gazelle.ws.client.GazelleTRMServiceStubTest.getTestInstanceById(GazelleTRMServiceStubTest.java:41)
	DEBUG_FRAME = sun.reflect.NativeMethodAccessorImpl.invoke0(Native Method)
	DEBUG_FRAME = sun.reflect.NativeMethodAccessorImpl.invoke(NativeMethodAccessorImpl.java:62)
	DEBUG_FRAME = sun.reflect.DelegatingMethodAccessorImpl.invoke(DelegatingMethodAccessorImpl.java:43)
	DEBUG_FRAME = java.lang.reflect.Method.invoke(Method.java:498)
	DEBUG_FRAME = org.junit.runners.model.FrameworkMethod$1.runReflectiveCall(FrameworkMethod.java:44)
	DEBUG_FRAME = org.junit.internal.runners.model.ReflectiveCallable.run(ReflectiveCallable.java:15)
	DEBUG_FRAME = org.junit.runners.model.FrameworkMethod.invokeExplosively(FrameworkMethod.java:41)
	DEBUG_FRAME = org.junit.internal.runners.statements.InvokeMethod.evaluate(InvokeMethod.java:20)
	DEBUG_FRAME = org.junit.runners.BlockJUnit4ClassRunner.runNotIgnored(BlockJUnit4ClassRunner.java:79)
	DEBUG_FRAME = org.junit.runners.BlockJUnit4ClassRunner.runChild(BlockJUnit4ClassRunner.java:71)
	DEBUG_FRAME = org.junit.runners.BlockJUnit4ClassRunner.runChild(BlockJUnit4ClassRunner.java:49)
	DEBUG_FRAME = org.junit.runners.ParentRunner$3.run(ParentRunner.java:193)
	DEBUG_FRAME = org.junit.runners.ParentRunner$1.schedule(ParentRunner.java:52)
	DEBUG_FRAME = org.junit.runners.ParentRunner.runChildren(ParentRunner.java:191)
	DEBUG_FRAME = org.junit.runners.ParentRunner.access$000(ParentRunner.java:42)
	DEBUG_FRAME = org.junit.runners.ParentRunner$2.evaluate(ParentRunner.java:184)
	DEBUG_FRAME = org.junit.runners.ParentRunner.run(ParentRunner.java:236)
	DEBUG_FRAME = org.apache.maven.surefire.junit4.JUnit4Provider.execute(JUnit4Provider.java:252)
	DEBUG_FRAME = org.apache.maven.surefire.junit4.JUnit4Provider.executeTestSet(JUnit4Provider.java:141)
	DEBUG_FRAME = org.apache.maven.surefire.junit4.JUnit4Provider.invoke(JUnit4Provider.java:112)
	DEBUG_FRAME = sun.reflect.NativeMethodAccessorImpl.invoke0(Native Method)
	DEBUG_FRAME = sun.reflect.NativeMethodAccessorImpl.invoke(NativeMethodAccessorImpl.java:62)
	DEBUG_FRAME = sun.reflect.DelegatingMethodAccessorImpl.invoke(DelegatingMethodAccessorImpl.java:43)
	DEBUG_FRAME = java.lang.reflect.Method.invoke(Method.java:498)
	DEBUG_FRAME = org.apache.maven.surefire.util.ReflectionUtils.invokeMethodWithArray(ReflectionUtils.java:189)
	DEBUG_FRAME = org.apache.maven.surefire.booter.ProviderFactory$ProviderProxy.invoke(ProviderFactory.java:165)
	DEBUG_FRAME = org.apache.maven.surefire.booter.ProviderFactory.invokeProvider(ProviderFactory.java:85)
	DEBUG_FRAME = org.apache.maven.surefire.booter.ForkedBooter.runSuitesInProcess(ForkedBooter.java:115)
	DEBUG_FRAME = org.apache.maven.surefire.booter.ForkedBooter.main(ForkedBooter.java:75)

15:40:49,500 DEBUG [main] AxisOperation:485 - Entry: AxisOperation::getInputAction
15:40:49,500 DEBUG [main] AxisOperation:490 - Debug: AxisOperation::getInputAction - using soapAction
15:40:49,500 DEBUG [main] AxisOperation:506 - Exit: AxisOperation::getInputAction urn:anonOutonlyOp
15:40:49,501 DEBUG [main] AxisService:872 - mapActionToOperation: Mapping Action to Operation: action: urn:anonOutonlyOp; operation: org.apache.axis2.description.OutOnlyAxisOperation@22d7b4f8named: {http://ws.apache.org/namespaces/axis2}anonOutonlyOp
15:40:49,501 DEBUG [main] AxisService:878 - DEBUG_FRAME = org.apache.axis2.util.JavaUtils.callStackToString(JavaUtils.java:564)
	DEBUG_FRAME = org.apache.axis2.description.AxisService.mapActionToOperation(AxisService.java:878)
	DEBUG_FRAME = org.apache.axis2.description.AxisService.addOperation(AxisService.java:728)
	DEBUG_FRAME = org.apache.axis2.client.Stub.addAnonymousOperations(Stub.java:237)
	DEBUG_FRAME = net.ihe.gazelle.ws.client.GazelleTRMServiceStub.populateAxisService(GazelleTRMServiceStub.java:94)
	DEBUG_FRAME = net.ihe.gazelle.ws.client.GazelleTRMServiceStub.<init>(GazelleTRMServiceStub.java:40)
	DEBUG_FRAME = net.ihe.gazelle.ws.client.GazelleTRMServiceStub.<init>(GazelleTRMServiceStub.java:29)
	DEBUG_FRAME = net.ihe.gazelle.ws.client.GazelleTRMServiceStub.<init>(GazelleTRMServiceStub.java:75)
	DEBUG_FRAME = net.ihe.gazelle.ws.client.GazelleTRMServiceClient.<init>(GazelleTRMServiceClient.java:11)
	DEBUG_FRAME = net.ihe.gazelle.ws.client.GazelleTRMServiceStubTest.getTestInstanceById(GazelleTRMServiceStubTest.java:41)
	DEBUG_FRAME = sun.reflect.NativeMethodAccessorImpl.invoke0(Native Method)
	DEBUG_FRAME = sun.reflect.NativeMethodAccessorImpl.invoke(NativeMethodAccessorImpl.java:62)
	DEBUG_FRAME = sun.reflect.DelegatingMethodAccessorImpl.invoke(DelegatingMethodAccessorImpl.java:43)
	DEBUG_FRAME = java.lang.reflect.Method.invoke(Method.java:498)
	DEBUG_FRAME = org.junit.runners.model.FrameworkMethod$1.runReflectiveCall(FrameworkMethod.java:44)
	DEBUG_FRAME = org.junit.internal.runners.model.ReflectiveCallable.run(ReflectiveCallable.java:15)
	DEBUG_FRAME = org.junit.runners.model.FrameworkMethod.invokeExplosively(FrameworkMethod.java:41)
	DEBUG_FRAME = org.junit.internal.runners.statements.InvokeMethod.evaluate(InvokeMethod.java:20)
	DEBUG_FRAME = org.junit.runners.BlockJUnit4ClassRunner.runNotIgnored(BlockJUnit4ClassRunner.java:79)
	DEBUG_FRAME = org.junit.runners.BlockJUnit4ClassRunner.runChild(BlockJUnit4ClassRunner.java:71)
	DEBUG_FRAME = org.junit.runners.BlockJUnit4ClassRunner.runChild(BlockJUnit4ClassRunner.java:49)
	DEBUG_FRAME = org.junit.runners.ParentRunner$3.run(ParentRunner.java:193)
	DEBUG_FRAME = org.junit.runners.ParentRunner$1.schedule(ParentRunner.java:52)
	DEBUG_FRAME = org.junit.runners.ParentRunner.runChildren(ParentRunner.java:191)
	DEBUG_FRAME = org.junit.runners.ParentRunner.access$000(ParentRunner.java:42)
	DEBUG_FRAME = org.junit.runners.ParentRunner$2.evaluate(ParentRunner.java:184)
	DEBUG_FRAME = org.junit.runners.ParentRunner.run(ParentRunner.java:236)
	DEBUG_FRAME = org.apache.maven.surefire.junit4.JUnit4Provider.execute(JUnit4Provider.java:252)
	DEBUG_FRAME = org.apache.maven.surefire.junit4.JUnit4Provider.executeTestSet(JUnit4Provider.java:141)
	DEBUG_FRAME = org.apache.maven.surefire.junit4.JUnit4Provider.invoke(JUnit4Provider.java:112)
	DEBUG_FRAME = sun.reflect.NativeMethodAccessorImpl.invoke0(Native Method)
	DEBUG_FRAME = sun.reflect.NativeMethodAccessorImpl.invoke(NativeMethodAccessorImpl.java:62)
	DEBUG_FRAME = sun.reflect.DelegatingMethodAccessorImpl.invoke(DelegatingMethodAccessorImpl.java:43)
	DEBUG_FRAME = java.lang.reflect.Method.invoke(Method.java:498)
	DEBUG_FRAME = org.apache.maven.surefire.util.ReflectionUtils.invokeMethodWithArray(ReflectionUtils.java:189)
	DEBUG_FRAME = org.apache.maven.surefire.booter.ProviderFactory$ProviderProxy.invoke(ProviderFactory.java:165)
	DEBUG_FRAME = org.apache.maven.surefire.booter.ProviderFactory.invokeProvider(ProviderFactory.java:85)
	DEBUG_FRAME = org.apache.maven.surefire.booter.ForkedBooter.runSuitesInProcess(ForkedBooter.java:115)
	DEBUG_FRAME = org.apache.maven.surefire.booter.ForkedBooter.main(ForkedBooter.java:75)

15:40:49,501 DEBUG [main] AxisOperation:485 - Entry: AxisOperation::getInputAction
15:40:49,502 DEBUG [main] AxisOperation:506 - Exit: AxisOperation::getInputAction null
15:40:49,502 DEBUG [main] AxisOperation:467 - Entry: AxisOperation::setSoapAction, previous soapAction: null updated soapAction: urn:anonOutInOp
15:40:49,502 DEBUG [main] AxisOperation:471 - Exit: AxisOperation::setSoapAction
15:40:49,502 DEBUG [main] AxisService:872 - mapActionToOperation: Mapping Action to Operation: action: anonOutInOp; operation: org.apache.axis2.description.OutInAxisOperation@3f270e0anamed: {http://ws.apache.org/namespaces/axis2}anonOutInOp
15:40:49,503 DEBUG [main] AxisService:878 - DEBUG_FRAME = org.apache.axis2.util.JavaUtils.callStackToString(JavaUtils.java:564)
	DEBUG_FRAME = org.apache.axis2.description.AxisService.mapActionToOperation(AxisService.java:878)
	DEBUG_FRAME = org.apache.axis2.description.AxisService.addOperation(AxisService.java:724)
	DEBUG_FRAME = org.apache.axis2.client.Stub.addAnonymousOperations(Stub.java:240)
	DEBUG_FRAME = net.ihe.gazelle.ws.client.GazelleTRMServiceStub.populateAxisService(GazelleTRMServiceStub.java:94)
	DEBUG_FRAME = net.ihe.gazelle.ws.client.GazelleTRMServiceStub.<init>(GazelleTRMServiceStub.java:40)
	DEBUG_FRAME = net.ihe.gazelle.ws.client.GazelleTRMServiceStub.<init>(GazelleTRMServiceStub.java:29)
	DEBUG_FRAME = net.ihe.gazelle.ws.client.GazelleTRMServiceStub.<init>(GazelleTRMServiceStub.java:75)
	DEBUG_FRAME = net.ihe.gazelle.ws.client.GazelleTRMServiceClient.<init>(GazelleTRMServiceClient.java:11)
	DEBUG_FRAME = net.ihe.gazelle.ws.client.GazelleTRMServiceStubTest.getTestInstanceById(GazelleTRMServiceStubTest.java:41)
	DEBUG_FRAME = sun.reflect.NativeMethodAccessorImpl.invoke0(Native Method)
	DEBUG_FRAME = sun.reflect.NativeMethodAccessorImpl.invoke(NativeMethodAccessorImpl.java:62)
	DEBUG_FRAME = sun.reflect.DelegatingMethodAccessorImpl.invoke(DelegatingMethodAccessorImpl.java:43)
	DEBUG_FRAME = java.lang.reflect.Method.invoke(Method.java:498)
	DEBUG_FRAME = org.junit.runners.model.FrameworkMethod$1.runReflectiveCall(FrameworkMethod.java:44)
	DEBUG_FRAME = org.junit.internal.runners.model.ReflectiveCallable.run(ReflectiveCallable.java:15)
	DEBUG_FRAME = org.junit.runners.model.FrameworkMethod.invokeExplosively(FrameworkMethod.java:41)
	DEBUG_FRAME = org.junit.internal.runners.statements.InvokeMethod.evaluate(InvokeMethod.java:20)
	DEBUG_FRAME = org.junit.runners.BlockJUnit4ClassRunner.runNotIgnored(BlockJUnit4ClassRunner.java:79)
	DEBUG_FRAME = org.junit.runners.BlockJUnit4ClassRunner.runChild(BlockJUnit4ClassRunner.java:71)
	DEBUG_FRAME = org.junit.runners.BlockJUnit4ClassRunner.runChild(BlockJUnit4ClassRunner.java:49)
	DEBUG_FRAME = org.junit.runners.ParentRunner$3.run(ParentRunner.java:193)
	DEBUG_FRAME = org.junit.runners.ParentRunner$1.schedule(ParentRunner.java:52)
	DEBUG_FRAME = org.junit.runners.ParentRunner.runChildren(ParentRunner.java:191)
	DEBUG_FRAME = org.junit.runners.ParentRunner.access$000(ParentRunner.java:42)
	DEBUG_FRAME = org.junit.runners.ParentRunner$2.evaluate(ParentRunner.java:184)
	DEBUG_FRAME = org.junit.runners.ParentRunner.run(ParentRunner.java:236)
	DEBUG_FRAME = org.apache.maven.surefire.junit4.JUnit4Provider.execute(JUnit4Provider.java:252)
	DEBUG_FRAME = org.apache.maven.surefire.junit4.JUnit4Provider.executeTestSet(JUnit4Provider.java:141)
	DEBUG_FRAME = org.apache.maven.surefire.junit4.JUnit4Provider.invoke(JUnit4Provider.java:112)
	DEBUG_FRAME = sun.reflect.NativeMethodAccessorImpl.invoke0(Native Method)
	DEBUG_FRAME = sun.reflect.NativeMethodAccessorImpl.invoke(NativeMethodAccessorImpl.java:62)
	DEBUG_FRAME = sun.reflect.DelegatingMethodAccessorImpl.invoke(DelegatingMethodAccessorImpl.java:43)
	DEBUG_FRAME = java.lang.reflect.Method.invoke(Method.java:498)
	DEBUG_FRAME = org.apache.maven.surefire.util.ReflectionUtils.invokeMethodWithArray(ReflectionUtils.java:189)
	DEBUG_FRAME = org.apache.maven.surefire.booter.ProviderFactory$ProviderProxy.invoke(ProviderFactory.java:165)
	DEBUG_FRAME = org.apache.maven.surefire.booter.ProviderFactory.invokeProvider(ProviderFactory.java:85)
	DEBUG_FRAME = org.apache.maven.surefire.booter.ForkedBooter.runSuitesInProcess(ForkedBooter.java:115)
	DEBUG_FRAME = org.apache.maven.surefire.booter.ForkedBooter.main(ForkedBooter.java:75)

15:40:49,503 DEBUG [main] AxisOperation:485 - Entry: AxisOperation::getInputAction
15:40:49,503 DEBUG [main] AxisOperation:490 - Debug: AxisOperation::getInputAction - using soapAction
15:40:49,503 DEBUG [main] AxisOperation:506 - Exit: AxisOperation::getInputAction urn:anonOutInOp
15:40:49,503 DEBUG [main] AxisService:872 - mapActionToOperation: Mapping Action to Operation: action: urn:anonOutInOp; operation: org.apache.axis2.description.OutInAxisOperation@3f270e0anamed: {http://ws.apache.org/namespaces/axis2}anonOutInOp
15:40:49,504 DEBUG [main] AxisService:878 - DEBUG_FRAME = org.apache.axis2.util.JavaUtils.callStackToString(JavaUtils.java:564)
	DEBUG_FRAME = org.apache.axis2.description.AxisService.mapActionToOperation(AxisService.java:878)
	DEBUG_FRAME = org.apache.axis2.description.AxisService.addOperation(AxisService.java:728)
	DEBUG_FRAME = org.apache.axis2.client.Stub.addAnonymousOperations(Stub.java:240)
	DEBUG_FRAME = net.ihe.gazelle.ws.client.GazelleTRMServiceStub.populateAxisService(GazelleTRMServiceStub.java:94)
	DEBUG_FRAME = net.ihe.gazelle.ws.client.GazelleTRMServiceStub.<init>(GazelleTRMServiceStub.java:40)
	DEBUG_FRAME = net.ihe.gazelle.ws.client.GazelleTRMServiceStub.<init>(GazelleTRMServiceStub.java:29)
	DEBUG_FRAME = net.ihe.gazelle.ws.client.GazelleTRMServiceStub.<init>(GazelleTRMServiceStub.java:75)
	DEBUG_FRAME = net.ihe.gazelle.ws.client.GazelleTRMServiceClient.<init>(GazelleTRMServiceClient.java:11)
	DEBUG_FRAME = net.ihe.gazelle.ws.client.GazelleTRMServiceStubTest.getTestInstanceById(GazelleTRMServiceStubTest.java:41)
	DEBUG_FRAME = sun.reflect.NativeMethodAccessorImpl.invoke0(Native Method)
	DEBUG_FRAME = sun.reflect.NativeMethodAccessorImpl.invoke(NativeMethodAccessorImpl.java:62)
	DEBUG_FRAME = sun.reflect.DelegatingMethodAccessorImpl.invoke(DelegatingMethodAccessorImpl.java:43)
	DEBUG_FRAME = java.lang.reflect.Method.invoke(Method.java:498)
	DEBUG_FRAME = org.junit.runners.model.FrameworkMethod$1.runReflectiveCall(FrameworkMethod.java:44)
	DEBUG_FRAME = org.junit.internal.runners.model.ReflectiveCallable.run(ReflectiveCallable.java:15)
	DEBUG_FRAME = org.junit.runners.model.FrameworkMethod.invokeExplosively(FrameworkMethod.java:41)
	DEBUG_FRAME = org.junit.internal.runners.statements.InvokeMethod.evaluate(InvokeMethod.java:20)
	DEBUG_FRAME = org.junit.runners.BlockJUnit4ClassRunner.runNotIgnored(BlockJUnit4ClassRunner.java:79)
	DEBUG_FRAME = org.junit.runners.BlockJUnit4ClassRunner.runChild(BlockJUnit4ClassRunner.java:71)
	DEBUG_FRAME = org.junit.runners.BlockJUnit4ClassRunner.runChild(BlockJUnit4ClassRunner.java:49)
	DEBUG_FRAME = org.junit.runners.ParentRunner$3.run(ParentRunner.java:193)
	DEBUG_FRAME = org.junit.runners.ParentRunner$1.schedule(ParentRunner.java:52)
	DEBUG_FRAME = org.junit.runners.ParentRunner.runChildren(ParentRunner.java:191)
	DEBUG_FRAME = org.junit.runners.ParentRunner.access$000(ParentRunner.java:42)
	DEBUG_FRAME = org.junit.runners.ParentRunner$2.evaluate(ParentRunner.java:184)
	DEBUG_FRAME = org.junit.runners.ParentRunner.run(ParentRunner.java:236)
	DEBUG_FRAME = org.apache.maven.surefire.junit4.JUnit4Provider.execute(JUnit4Provider.java:252)
	DEBUG_FRAME = org.apache.maven.surefire.junit4.JUnit4Provider.executeTestSet(JUnit4Provider.java:141)
	DEBUG_FRAME = org.apache.maven.surefire.junit4.JUnit4Provider.invoke(JUnit4Provider.java:112)
	DEBUG_FRAME = sun.reflect.NativeMethodAccessorImpl.invoke0(Native Method)
	DEBUG_FRAME = sun.reflect.NativeMethodAccessorImpl.invoke(NativeMethodAccessorImpl.java:62)
	DEBUG_FRAME = sun.reflect.DelegatingMethodAccessorImpl.invoke(DelegatingMethodAccessorImpl.java:43)
	DEBUG_FRAME = java.lang.reflect.Method.invoke(Method.java:498)
	DEBUG_FRAME = org.apache.maven.surefire.util.ReflectionUtils.invokeMethodWithArray(ReflectionUtils.java:189)
	DEBUG_FRAME = org.apache.maven.surefire.booter.ProviderFactory$ProviderProxy.invoke(ProviderFactory.java:165)
	DEBUG_FRAME = org.apache.maven.surefire.booter.ProviderFactory.invokeProvider(ProviderFactory.java:85)
	DEBUG_FRAME = org.apache.maven.surefire.booter.ForkedBooter.runSuitesInProcess(ForkedBooter.java:115)
	DEBUG_FRAME = org.apache.maven.surefire.booter.ForkedBooter.main(ForkedBooter.java:75)

15:40:49,504 DEBUG [main] AxisOperation:485 - Entry: AxisOperation::getInputAction
15:40:49,504 DEBUG [main] AxisOperation:506 - Exit: AxisOperation::getInputAction null
15:40:49,505 DEBUG [main] AxisOperation:467 - Entry: AxisOperation::setSoapAction, previous soapAction: null updated soapAction: urn:getSystemIsATool
15:40:49,505 DEBUG [main] AxisOperation:471 - Exit: AxisOperation::setSoapAction
15:40:49,505 DEBUG [main] AxisService:872 - mapActionToOperation: Mapping Action to Operation: action: getSystemIsATool; operation: org.apache.axis2.description.OutInAxisOperation@6aa3a905named: {http://trm.ws.gazelletest.tm.gazelle.ihe.net/}getSystemIsATool
15:40:49,505 DEBUG [main] AxisService:878 - DEBUG_FRAME = org.apache.axis2.util.JavaUtils.callStackToString(JavaUtils.java:564)
	DEBUG_FRAME = org.apache.axis2.description.AxisService.mapActionToOperation(AxisService.java:878)
	DEBUG_FRAME = org.apache.axis2.description.AxisService.addOperation(AxisService.java:724)
	DEBUG_FRAME = net.ihe.gazelle.ws.client.GazelleTRMServiceStub.populateAxisService(GazelleTRMServiceStub.java:106)
	DEBUG_FRAME = net.ihe.gazelle.ws.client.GazelleTRMServiceStub.<init>(GazelleTRMServiceStub.java:40)
	DEBUG_FRAME = net.ihe.gazelle.ws.client.GazelleTRMServiceStub.<init>(GazelleTRMServiceStub.java:29)
	DEBUG_FRAME = net.ihe.gazelle.ws.client.GazelleTRMServiceStub.<init>(GazelleTRMServiceStub.java:75)
	DEBUG_FRAME = net.ihe.gazelle.ws.client.GazelleTRMServiceClient.<init>(GazelleTRMServiceClient.java:11)
	DEBUG_FRAME = net.ihe.gazelle.ws.client.GazelleTRMServiceStubTest.getTestInstanceById(GazelleTRMServiceStubTest.java:41)
	DEBUG_FRAME = sun.reflect.NativeMethodAccessorImpl.invoke0(Native Method)
	DEBUG_FRAME = sun.reflect.NativeMethodAccessorImpl.invoke(NativeMethodAccessorImpl.java:62)
	DEBUG_FRAME = sun.reflect.DelegatingMethodAccessorImpl.invoke(DelegatingMethodAccessorImpl.java:43)
	DEBUG_FRAME = java.lang.reflect.Method.invoke(Method.java:498)
	DEBUG_FRAME = org.junit.runners.model.FrameworkMethod$1.runReflectiveCall(FrameworkMethod.java:44)
	DEBUG_FRAME = org.junit.internal.runners.model.ReflectiveCallable.run(ReflectiveCallable.java:15)
	DEBUG_FRAME = org.junit.runners.model.FrameworkMethod.invokeExplosively(FrameworkMethod.java:41)
	DEBUG_FRAME = org.junit.internal.runners.statements.InvokeMethod.evaluate(InvokeMethod.java:20)
	DEBUG_FRAME = org.junit.runners.BlockJUnit4ClassRunner.runNotIgnored(BlockJUnit4ClassRunner.java:79)
	DEBUG_FRAME = org.junit.runners.BlockJUnit4ClassRunner.runChild(BlockJUnit4ClassRunner.java:71)
	DEBUG_FRAME = org.junit.runners.BlockJUnit4ClassRunner.runChild(BlockJUnit4ClassRunner.java:49)
	DEBUG_FRAME = org.junit.runners.ParentRunner$3.run(ParentRunner.java:193)
	DEBUG_FRAME = org.junit.runners.ParentRunner$1.schedule(ParentRunner.java:52)
	DEBUG_FRAME = org.junit.runners.ParentRunner.runChildren(ParentRunner.java:191)
	DEBUG_FRAME = org.junit.runners.ParentRunner.access$000(ParentRunner.java:42)
	DEBUG_FRAME = org.junit.runners.ParentRunner$2.evaluate(ParentRunner.java:184)
	DEBUG_FRAME = org.junit.runners.ParentRunner.run(ParentRunner.java:236)
	DEBUG_FRAME = org.apache.maven.surefire.junit4.JUnit4Provider.execute(JUnit4Provider.java:252)
	DEBUG_FRAME = org.apache.maven.surefire.junit4.JUnit4Provider.executeTestSet(JUnit4Provider.java:141)
	DEBUG_FRAME = org.apache.maven.surefire.junit4.JUnit4Provider.invoke(JUnit4Provider.java:112)
	DEBUG_FRAME = sun.reflect.NativeMethodAccessorImpl.invoke0(Native Method)
	DEBUG_FRAME = sun.reflect.NativeMethodAccessorImpl.invoke(NativeMethodAccessorImpl.java:62)
	DEBUG_FRAME = sun.reflect.DelegatingMethodAccessorImpl.invoke(DelegatingMethodAccessorImpl.java:43)
	DEBUG_FRAME = java.lang.reflect.Method.invoke(Method.java:498)
	DEBUG_FRAME = org.apache.maven.surefire.util.ReflectionUtils.invokeMethodWithArray(ReflectionUtils.java:189)
	DEBUG_FRAME = org.apache.maven.surefire.booter.ProviderFactory$ProviderProxy.invoke(ProviderFactory.java:165)
	DEBUG_FRAME = org.apache.maven.surefire.booter.ProviderFactory.invokeProvider(ProviderFactory.java:85)
	DEBUG_FRAME = org.apache.maven.surefire.booter.ForkedBooter.runSuitesInProcess(ForkedBooter.java:115)
	DEBUG_FRAME = org.apache.maven.surefire.booter.ForkedBooter.main(ForkedBooter.java:75)

15:40:49,506 DEBUG [main] AxisOperation:485 - Entry: AxisOperation::getInputAction
15:40:49,506 DEBUG [main] AxisOperation:490 - Debug: AxisOperation::getInputAction - using soapAction
15:40:49,506 DEBUG [main] AxisOperation:506 - Exit: AxisOperation::getInputAction urn:getSystemIsATool
15:40:49,506 DEBUG [main] AxisService:872 - mapActionToOperation: Mapping Action to Operation: action: urn:getSystemIsATool; operation: org.apache.axis2.description.OutInAxisOperation@6aa3a905named: {http://trm.ws.gazelletest.tm.gazelle.ihe.net/}getSystemIsATool
15:40:49,507 DEBUG [main] AxisService:878 - DEBUG_FRAME = org.apache.axis2.util.JavaUtils.callStackToString(JavaUtils.java:564)
	DEBUG_FRAME = org.apache.axis2.description.AxisService.mapActionToOperation(AxisService.java:878)
	DEBUG_FRAME = org.apache.axis2.description.AxisService.addOperation(AxisService.java:728)
	DEBUG_FRAME = net.ihe.gazelle.ws.client.GazelleTRMServiceStub.populateAxisService(GazelleTRMServiceStub.java:106)
	DEBUG_FRAME = net.ihe.gazelle.ws.client.GazelleTRMServiceStub.<init>(GazelleTRMServiceStub.java:40)
	DEBUG_FRAME = net.ihe.gazelle.ws.client.GazelleTRMServiceStub.<init>(GazelleTRMServiceStub.java:29)
	DEBUG_FRAME = net.ihe.gazelle.ws.client.GazelleTRMServiceStub.<init>(GazelleTRMServiceStub.java:75)
	DEBUG_FRAME = net.ihe.gazelle.ws.client.GazelleTRMServiceClient.<init>(GazelleTRMServiceClient.java:11)
	DEBUG_FRAME = net.ihe.gazelle.ws.client.GazelleTRMServiceStubTest.getTestInstanceById(GazelleTRMServiceStubTest.java:41)
	DEBUG_FRAME = sun.reflect.NativeMethodAccessorImpl.invoke0(Native Method)
	DEBUG_FRAME = sun.reflect.NativeMethodAccessorImpl.invoke(NativeMethodAccessorImpl.java:62)
	DEBUG_FRAME = sun.reflect.DelegatingMethodAccessorImpl.invoke(DelegatingMethodAccessorImpl.java:43)
	DEBUG_FRAME = java.lang.reflect.Method.invoke(Method.java:498)
	DEBUG_FRAME = org.junit.runners.model.FrameworkMethod$1.runReflectiveCall(FrameworkMethod.java:44)
	DEBUG_FRAME = org.junit.internal.runners.model.ReflectiveCallable.run(ReflectiveCallable.java:15)
	DEBUG_FRAME = org.junit.runners.model.FrameworkMethod.invokeExplosively(FrameworkMethod.java:41)
	DEBUG_FRAME = org.junit.internal.runners.statements.InvokeMethod.evaluate(InvokeMethod.java:20)
	DEBUG_FRAME = org.junit.runners.BlockJUnit4ClassRunner.runNotIgnored(BlockJUnit4ClassRunner.java:79)
	DEBUG_FRAME = org.junit.runners.BlockJUnit4ClassRunner.runChild(BlockJUnit4ClassRunner.java:71)
	DEBUG_FRAME = org.junit.runners.BlockJUnit4ClassRunner.runChild(BlockJUnit4ClassRunner.java:49)
	DEBUG_FRAME = org.junit.runners.ParentRunner$3.run(ParentRunner.java:193)
	DEBUG_FRAME = org.junit.runners.ParentRunner$1.schedule(ParentRunner.java:52)
	DEBUG_FRAME = org.junit.runners.ParentRunner.runChildren(ParentRunner.java:191)
	DEBUG_FRAME = org.junit.runners.ParentRunner.access$000(ParentRunner.java:42)
	DEBUG_FRAME = org.junit.runners.ParentRunner$2.evaluate(ParentRunner.java:184)
	DEBUG_FRAME = org.junit.runners.ParentRunner.run(ParentRunner.java:236)
	DEBUG_FRAME = org.apache.maven.surefire.junit4.JUnit4Provider.execute(JUnit4Provider.java:252)
	DEBUG_FRAME = org.apache.maven.surefire.junit4.JUnit4Provider.executeTestSet(JUnit4Provider.java:141)
	DEBUG_FRAME = org.apache.maven.surefire.junit4.JUnit4Provider.invoke(JUnit4Provider.java:112)
	DEBUG_FRAME = sun.reflect.NativeMethodAccessorImpl.invoke0(Native Method)
	DEBUG_FRAME = sun.reflect.NativeMethodAccessorImpl.invoke(NativeMethodAccessorImpl.java:62)
	DEBUG_FRAME = sun.reflect.DelegatingMethodAccessorImpl.invoke(DelegatingMethodAccessorImpl.java:43)
	DEBUG_FRAME = java.lang.reflect.Method.invoke(Method.java:498)
	DEBUG_FRAME = org.apache.maven.surefire.util.ReflectionUtils.invokeMethodWithArray(ReflectionUtils.java:189)
	DEBUG_FRAME = org.apache.maven.surefire.booter.ProviderFactory$ProviderProxy.invoke(ProviderFactory.java:165)
	DEBUG_FRAME = org.apache.maven.surefire.booter.ProviderFactory.invokeProvider(ProviderFactory.java:85)
	DEBUG_FRAME = org.apache.maven.surefire.booter.ForkedBooter.runSuitesInProcess(ForkedBooter.java:115)
	DEBUG_FRAME = org.apache.maven.surefire.booter.ForkedBooter.main(ForkedBooter.java:75)

15:40:49,507 DEBUG [main] AxisOperation:485 - Entry: AxisOperation::getInputAction
15:40:49,507 DEBUG [main] AxisOperation:506 - Exit: AxisOperation::getInputAction null
15:40:49,507 DEBUG [main] AxisOperation:467 - Entry: AxisOperation::setSoapAction, previous soapAction: null updated soapAction: urn:getTestInstancesByTestingSession
15:40:49,508 DEBUG [main] AxisOperation:471 - Exit: AxisOperation::setSoapAction
15:40:49,508 DEBUG [main] AxisService:872 - mapActionToOperation: Mapping Action to Operation: action: getTestInstancesByTestingSession; operation: org.apache.axis2.description.OutInAxisOperation@4612b856named: {http://trm.ws.gazelletest.tm.gazelle.ihe.net/}getTestInstancesByTestingSession
15:40:49,508 DEBUG [main] AxisService:878 - DEBUG_FRAME = org.apache.axis2.util.JavaUtils.callStackToString(JavaUtils.java:564)
	DEBUG_FRAME = org.apache.axis2.description.AxisService.mapActionToOperation(AxisService.java:878)
	DEBUG_FRAME = org.apache.axis2.description.AxisService.addOperation(AxisService.java:724)
	DEBUG_FRAME = net.ihe.gazelle.ws.client.GazelleTRMServiceStub.populateAxisService(GazelleTRMServiceStub.java:115)
	DEBUG_FRAME = net.ihe.gazelle.ws.client.GazelleTRMServiceStub.<init>(GazelleTRMServiceStub.java:40)
	DEBUG_FRAME = net.ihe.gazelle.ws.client.GazelleTRMServiceStub.<init>(GazelleTRMServiceStub.java:29)
	DEBUG_FRAME = net.ihe.gazelle.ws.client.GazelleTRMServiceStub.<init>(GazelleTRMServiceStub.java:75)
	DEBUG_FRAME = net.ihe.gazelle.ws.client.GazelleTRMServiceClient.<init>(GazelleTRMServiceClient.java:11)
	DEBUG_FRAME = net.ihe.gazelle.ws.client.GazelleTRMServiceStubTest.getTestInstanceById(GazelleTRMServiceStubTest.java:41)
	DEBUG_FRAME = sun.reflect.NativeMethodAccessorImpl.invoke0(Native Method)
	DEBUG_FRAME = sun.reflect.NativeMethodAccessorImpl.invoke(NativeMethodAccessorImpl.java:62)
	DEBUG_FRAME = sun.reflect.DelegatingMethodAccessorImpl.invoke(DelegatingMethodAccessorImpl.java:43)
	DEBUG_FRAME = java.lang.reflect.Method.invoke(Method.java:498)
	DEBUG_FRAME = org.junit.runners.model.FrameworkMethod$1.runReflectiveCall(FrameworkMethod.java:44)
	DEBUG_FRAME = org.junit.internal.runners.model.ReflectiveCallable.run(ReflectiveCallable.java:15)
	DEBUG_FRAME = org.junit.runners.model.FrameworkMethod.invokeExplosively(FrameworkMethod.java:41)
	DEBUG_FRAME = org.junit.internal.runners.statements.InvokeMethod.evaluate(InvokeMethod.java:20)
	DEBUG_FRAME = org.junit.runners.BlockJUnit4ClassRunner.runNotIgnored(BlockJUnit4ClassRunner.java:79)
	DEBUG_FRAME = org.junit.runners.BlockJUnit4ClassRunner.runChild(BlockJUnit4ClassRunner.java:71)
	DEBUG_FRAME = org.junit.runners.BlockJUnit4ClassRunner.runChild(BlockJUnit4ClassRunner.java:49)
	DEBUG_FRAME = org.junit.runners.ParentRunner$3.run(ParentRunner.java:193)
	DEBUG_FRAME = org.junit.runners.ParentRunner$1.schedule(ParentRunner.java:52)
	DEBUG_FRAME = org.junit.runners.ParentRunner.runChildren(ParentRunner.java:191)
	DEBUG_FRAME = org.junit.runners.ParentRunner.access$000(ParentRunner.java:42)
	DEBUG_FRAME = org.junit.runners.ParentRunner$2.evaluate(ParentRunner.java:184)
	DEBUG_FRAME = org.junit.runners.ParentRunner.run(ParentRunner.java:236)
	DEBUG_FRAME = org.apache.maven.surefire.junit4.JUnit4Provider.execute(JUnit4Provider.java:252)
	DEBUG_FRAME = org.apache.maven.surefire.junit4.JUnit4Provider.executeTestSet(JUnit4Provider.java:141)
	DEBUG_FRAME = org.apache.maven.surefire.junit4.JUnit4Provider.invoke(JUnit4Provider.java:112)
	DEBUG_FRAME = sun.reflect.NativeMethodAccessorImpl.invoke0(Native Method)
	DEBUG_FRAME = sun.reflect.NativeMethodAccessorImpl.invoke(NativeMethodAccessorImpl.java:62)
	DEBUG_FRAME = sun.reflect.DelegatingMethodAccessorImpl.invoke(DelegatingMethodAccessorImpl.java:43)
	DEBUG_FRAME = java.lang.reflect.Method.invoke(Method.java:498)
	DEBUG_FRAME = org.apache.maven.surefire.util.ReflectionUtils.invokeMethodWithArray(ReflectionUtils.java:189)
	DEBUG_FRAME = org.apache.maven.surefire.booter.ProviderFactory$ProviderProxy.invoke(ProviderFactory.java:165)
	DEBUG_FRAME = org.apache.maven.surefire.booter.ProviderFactory.invokeProvider(ProviderFactory.java:85)
	DEBUG_FRAME = org.apache.maven.surefire.booter.ForkedBooter.runSuitesInProcess(ForkedBooter.java:115)
	DEBUG_FRAME = org.apache.maven.surefire.booter.ForkedBooter.main(ForkedBooter.java:75)

15:40:49,508 DEBUG [main] AxisOperation:485 - Entry: AxisOperation::getInputAction
15:40:49,508 DEBUG [main] AxisOperation:490 - Debug: AxisOperation::getInputAction - using soapAction
15:40:49,509 DEBUG [main] AxisOperation:506 - Exit: AxisOperation::getInputAction urn:getTestInstancesByTestingSession
15:40:49,509 DEBUG [main] AxisService:872 - mapActionToOperation: Mapping Action to Operation: action: urn:getTestInstancesByTestingSession; operation: org.apache.axis2.description.OutInAxisOperation@4612b856named: {http://trm.ws.gazelletest.tm.gazelle.ihe.net/}getTestInstancesByTestingSession
15:40:49,509 DEBUG [main] AxisService:878 - DEBUG_FRAME = org.apache.axis2.util.JavaUtils.callStackToString(JavaUtils.java:564)
	DEBUG_FRAME = org.apache.axis2.description.AxisService.mapActionToOperation(AxisService.java:878)
	DEBUG_FRAME = org.apache.axis2.description.AxisService.addOperation(AxisService.java:728)
	DEBUG_FRAME = net.ihe.gazelle.ws.client.GazelleTRMServiceStub.populateAxisService(GazelleTRMServiceStub.java:115)
	DEBUG_FRAME = net.ihe.gazelle.ws.client.GazelleTRMServiceStub.<init>(GazelleTRMServiceStub.java:40)
	DEBUG_FRAME = net.ihe.gazelle.ws.client.GazelleTRMServiceStub.<init>(GazelleTRMServiceStub.java:29)
	DEBUG_FRAME = net.ihe.gazelle.ws.client.GazelleTRMServiceStub.<init>(GazelleTRMServiceStub.java:75)
	DEBUG_FRAME = net.ihe.gazelle.ws.client.GazelleTRMServiceClient.<init>(GazelleTRMServiceClient.java:11)
	DEBUG_FRAME = net.ihe.gazelle.ws.client.GazelleTRMServiceStubTest.getTestInstanceById(GazelleTRMServiceStubTest.java:41)
	DEBUG_FRAME = sun.reflect.NativeMethodAccessorImpl.invoke0(Native Method)
	DEBUG_FRAME = sun.reflect.NativeMethodAccessorImpl.invoke(NativeMethodAccessorImpl.java:62)
	DEBUG_FRAME = sun.reflect.DelegatingMethodAccessorImpl.invoke(DelegatingMethodAccessorImpl.java:43)
	DEBUG_FRAME = java.lang.reflect.Method.invoke(Method.java:498)
	DEBUG_FRAME = org.junit.runners.model.FrameworkMethod$1.runReflectiveCall(FrameworkMethod.java:44)
	DEBUG_FRAME = org.junit.internal.runners.model.ReflectiveCallable.run(ReflectiveCallable.java:15)
	DEBUG_FRAME = org.junit.runners.model.FrameworkMethod.invokeExplosively(FrameworkMethod.java:41)
	DEBUG_FRAME = org.junit.internal.runners.statements.InvokeMethod.evaluate(InvokeMethod.java:20)
	DEBUG_FRAME = org.junit.runners.BlockJUnit4ClassRunner.runNotIgnored(BlockJUnit4ClassRunner.java:79)
	DEBUG_FRAME = org.junit.runners.BlockJUnit4ClassRunner.runChild(BlockJUnit4ClassRunner.java:71)
	DEBUG_FRAME = org.junit.runners.BlockJUnit4ClassRunner.runChild(BlockJUnit4ClassRunner.java:49)
	DEBUG_FRAME = org.junit.runners.ParentRunner$3.run(ParentRunner.java:193)
	DEBUG_FRAME = org.junit.runners.ParentRunner$1.schedule(ParentRunner.java:52)
	DEBUG_FRAME = org.junit.runners.ParentRunner.runChildren(ParentRunner.java:191)
	DEBUG_FRAME = org.junit.runners.ParentRunner.access$000(ParentRunner.java:42)
	DEBUG_FRAME = org.junit.runners.ParentRunner$2.evaluate(ParentRunner.java:184)
	DEBUG_FRAME = org.junit.runners.ParentRunner.run(ParentRunner.java:236)
	DEBUG_FRAME = org.apache.maven.surefire.junit4.JUnit4Provider.execute(JUnit4Provider.java:252)
	DEBUG_FRAME = org.apache.maven.surefire.junit4.JUnit4Provider.executeTestSet(JUnit4Provider.java:141)
	DEBUG_FRAME = org.apache.maven.surefire.junit4.JUnit4Provider.invoke(JUnit4Provider.java:112)
	DEBUG_FRAME = sun.reflect.NativeMethodAccessorImpl.invoke0(Native Method)
	DEBUG_FRAME = sun.reflect.NativeMethodAccessorImpl.invoke(NativeMethodAccessorImpl.java:62)
	DEBUG_FRAME = sun.reflect.DelegatingMethodAccessorImpl.invoke(DelegatingMethodAccessorImpl.java:43)
	DEBUG_FRAME = java.lang.reflect.Method.invoke(Method.java:498)
	DEBUG_FRAME = org.apache.maven.surefire.util.ReflectionUtils.invokeMethodWithArray(ReflectionUtils.java:189)
	DEBUG_FRAME = org.apache.maven.surefire.booter.ProviderFactory$ProviderProxy.invoke(ProviderFactory.java:165)
	DEBUG_FRAME = org.apache.maven.surefire.booter.ProviderFactory.invokeProvider(ProviderFactory.java:85)
	DEBUG_FRAME = org.apache.maven.surefire.booter.ForkedBooter.runSuitesInProcess(ForkedBooter.java:115)
	DEBUG_FRAME = org.apache.maven.surefire.booter.ForkedBooter.main(ForkedBooter.java:75)

15:40:49,509 DEBUG [main] AxisOperation:485 - Entry: AxisOperation::getInputAction
15:40:49,509 DEBUG [main] AxisOperation:506 - Exit: AxisOperation::getInputAction null
15:40:49,510 DEBUG [main] AxisOperation:467 - Entry: AxisOperation::setSoapAction, previous soapAction: null updated soapAction: urn:getTestInstanceById
15:40:49,510 DEBUG [main] AxisOperation:471 - Exit: AxisOperation::setSoapAction
15:40:49,510 DEBUG [main] AxisService:872 - mapActionToOperation: Mapping Action to Operation: action: getTestInstanceById; operation: org.apache.axis2.description.OutInAxisOperation@2df6226dnamed: {http://trm.ws.gazelletest.tm.gazelle.ihe.net/}getTestInstanceById
15:40:49,510 DEBUG [main] AxisService:878 - DEBUG_FRAME = org.apache.axis2.util.JavaUtils.callStackToString(JavaUtils.java:564)
	DEBUG_FRAME = org.apache.axis2.description.AxisService.mapActionToOperation(AxisService.java:878)
	DEBUG_FRAME = org.apache.axis2.description.AxisService.addOperation(AxisService.java:724)
	DEBUG_FRAME = net.ihe.gazelle.ws.client.GazelleTRMServiceStub.populateAxisService(GazelleTRMServiceStub.java:124)
	DEBUG_FRAME = net.ihe.gazelle.ws.client.GazelleTRMServiceStub.<init>(GazelleTRMServiceStub.java:40)
	DEBUG_FRAME = net.ihe.gazelle.ws.client.GazelleTRMServiceStub.<init>(GazelleTRMServiceStub.java:29)
	DEBUG_FRAME = net.ihe.gazelle.ws.client.GazelleTRMServiceStub.<init>(GazelleTRMServiceStub.java:75)
	DEBUG_FRAME = net.ihe.gazelle.ws.client.GazelleTRMServiceClient.<init>(GazelleTRMServiceClient.java:11)
	DEBUG_FRAME = net.ihe.gazelle.ws.client.GazelleTRMServiceStubTest.getTestInstanceById(GazelleTRMServiceStubTest.java:41)
	DEBUG_FRAME = sun.reflect.NativeMethodAccessorImpl.invoke0(Native Method)
	DEBUG_FRAME = sun.reflect.NativeMethodAccessorImpl.invoke(NativeMethodAccessorImpl.java:62)
	DEBUG_FRAME = sun.reflect.DelegatingMethodAccessorImpl.invoke(DelegatingMethodAccessorImpl.java:43)
	DEBUG_FRAME = java.lang.reflect.Method.invoke(Method.java:498)
	DEBUG_FRAME = org.junit.runners.model.FrameworkMethod$1.runReflectiveCall(FrameworkMethod.java:44)
	DEBUG_FRAME = org.junit.internal.runners.model.ReflectiveCallable.run(ReflectiveCallable.java:15)
	DEBUG_FRAME = org.junit.runners.model.FrameworkMethod.invokeExplosively(FrameworkMethod.java:41)
	DEBUG_FRAME = org.junit.internal.runners.statements.InvokeMethod.evaluate(InvokeMethod.java:20)
	DEBUG_FRAME = org.junit.runners.BlockJUnit4ClassRunner.runNotIgnored(BlockJUnit4ClassRunner.java:79)
	DEBUG_FRAME = org.junit.runners.BlockJUnit4ClassRunner.runChild(BlockJUnit4ClassRunner.java:71)
	DEBUG_FRAME = org.junit.runners.BlockJUnit4ClassRunner.runChild(BlockJUnit4ClassRunner.java:49)
	DEBUG_FRAME = org.junit.runners.ParentRunner$3.run(ParentRunner.java:193)
	DEBUG_FRAME = org.junit.runners.ParentRunner$1.schedule(ParentRunner.java:52)
	DEBUG_FRAME = org.junit.runners.ParentRunner.runChildren(ParentRunner.java:191)
	DEBUG_FRAME = org.junit.runners.ParentRunner.access$000(ParentRunner.java:42)
	DEBUG_FRAME = org.junit.runners.ParentRunner$2.evaluate(ParentRunner.java:184)
	DEBUG_FRAME = org.junit.runners.ParentRunner.run(ParentRunner.java:236)
	DEBUG_FRAME = org.apache.maven.surefire.junit4.JUnit4Provider.execute(JUnit4Provider.java:252)
	DEBUG_FRAME = org.apache.maven.surefire.junit4.JUnit4Provider.executeTestSet(JUnit4Provider.java:141)
	DEBUG_FRAME = org.apache.maven.surefire.junit4.JUnit4Provider.invoke(JUnit4Provider.java:112)
	DEBUG_FRAME = sun.reflect.NativeMethodAccessorImpl.invoke0(Native Method)
	DEBUG_FRAME = sun.reflect.NativeMethodAccessorImpl.invoke(NativeMethodAccessorImpl.java:62)
	DEBUG_FRAME = sun.reflect.DelegatingMethodAccessorImpl.invoke(DelegatingMethodAccessorImpl.java:43)
	DEBUG_FRAME = java.lang.reflect.Method.invoke(Method.java:498)
	DEBUG_FRAME = org.apache.maven.surefire.util.ReflectionUtils.invokeMethodWithArray(ReflectionUtils.java:189)
	DEBUG_FRAME = org.apache.maven.surefire.booter.ProviderFactory$ProviderProxy.invoke(ProviderFactory.java:165)
	DEBUG_FRAME = org.apache.maven.surefire.booter.ProviderFactory.invokeProvider(ProviderFactory.java:85)
	DEBUG_FRAME = org.apache.maven.surefire.booter.ForkedBooter.runSuitesInProcess(ForkedBooter.java:115)
	DEBUG_FRAME = org.apache.maven.surefire.booter.ForkedBooter.main(ForkedBooter.java:75)

15:40:49,511 DEBUG [main] AxisOperation:485 - Entry: AxisOperation::getInputAction
15:40:49,511 DEBUG [main] AxisOperation:490 - Debug: AxisOperation::getInputAction - using soapAction
15:40:49,511 DEBUG [main] AxisOperation:506 - Exit: AxisOperation::getInputAction urn:getTestInstanceById
15:40:49,511 DEBUG [main] AxisService:872 - mapActionToOperation: Mapping Action to Operation: action: urn:getTestInstanceById; operation: org.apache.axis2.description.OutInAxisOperation@2df6226dnamed: {http://trm.ws.gazelletest.tm.gazelle.ihe.net/}getTestInstanceById
15:40:49,512 DEBUG [main] AxisService:878 - DEBUG_FRAME = org.apache.axis2.util.JavaUtils.callStackToString(JavaUtils.java:564)
	DEBUG_FRAME = org.apache.axis2.description.AxisService.mapActionToOperation(AxisService.java:878)
	DEBUG_FRAME = org.apache.axis2.description.AxisService.addOperation(AxisService.java:728)
	DEBUG_FRAME = net.ihe.gazelle.ws.client.GazelleTRMServiceStub.populateAxisService(GazelleTRMServiceStub.java:124)
	DEBUG_FRAME = net.ihe.gazelle.ws.client.GazelleTRMServiceStub.<init>(GazelleTRMServiceStub.java:40)
	DEBUG_FRAME = net.ihe.gazelle.ws.client.GazelleTRMServiceStub.<init>(GazelleTRMServiceStub.java:29)
	DEBUG_FRAME = net.ihe.gazelle.ws.client.GazelleTRMServiceStub.<init>(GazelleTRMServiceStub.java:75)
	DEBUG_FRAME = net.ihe.gazelle.ws.client.GazelleTRMServiceClient.<init>(GazelleTRMServiceClient.java:11)
	DEBUG_FRAME = net.ihe.gazelle.ws.client.GazelleTRMServiceStubTest.getTestInstanceById(GazelleTRMServiceStubTest.java:41)
	DEBUG_FRAME = sun.reflect.NativeMethodAccessorImpl.invoke0(Native Method)
	DEBUG_FRAME = sun.reflect.NativeMethodAccessorImpl.invoke(NativeMethodAccessorImpl.java:62)
	DEBUG_FRAME = sun.reflect.DelegatingMethodAccessorImpl.invoke(DelegatingMethodAccessorImpl.java:43)
	DEBUG_FRAME = java.lang.reflect.Method.invoke(Method.java:498)
	DEBUG_FRAME = org.junit.runners.model.FrameworkMethod$1.runReflectiveCall(FrameworkMethod.java:44)
	DEBUG_FRAME = org.junit.internal.runners.model.ReflectiveCallable.run(ReflectiveCallable.java:15)
	DEBUG_FRAME = org.junit.runners.model.FrameworkMethod.invokeExplosively(FrameworkMethod.java:41)
	DEBUG_FRAME = org.junit.internal.runners.statements.InvokeMethod.evaluate(InvokeMethod.java:20)
	DEBUG_FRAME = org.junit.runners.BlockJUnit4ClassRunner.runNotIgnored(BlockJUnit4ClassRunner.java:79)
	DEBUG_FRAME = org.junit.runners.BlockJUnit4ClassRunner.runChild(BlockJUnit4ClassRunner.java:71)
	DEBUG_FRAME = org.junit.runners.BlockJUnit4ClassRunner.runChild(BlockJUnit4ClassRunner.java:49)
	DEBUG_FRAME = org.junit.runners.ParentRunner$3.run(ParentRunner.java:193)
	DEBUG_FRAME = org.junit.runners.ParentRunner$1.schedule(ParentRunner.java:52)
	DEBUG_FRAME = org.junit.runners.ParentRunner.runChildren(ParentRunner.java:191)
	DEBUG_FRAME = org.junit.runners.ParentRunner.access$000(ParentRunner.java:42)
	DEBUG_FRAME = org.junit.runners.ParentRunner$2.evaluate(ParentRunner.java:184)
	DEBUG_FRAME = org.junit.runners.ParentRunner.run(ParentRunner.java:236)
	DEBUG_FRAME = org.apache.maven.surefire.junit4.JUnit4Provider.execute(JUnit4Provider.java:252)
	DEBUG_FRAME = org.apache.maven.surefire.junit4.JUnit4Provider.executeTestSet(JUnit4Provider.java:141)
	DEBUG_FRAME = org.apache.maven.surefire.junit4.JUnit4Provider.invoke(JUnit4Provider.java:112)
	DEBUG_FRAME = sun.reflect.NativeMethodAccessorImpl.invoke0(Native Method)
	DEBUG_FRAME = sun.reflect.NativeMethodAccessorImpl.invoke(NativeMethodAccessorImpl.java:62)
	DEBUG_FRAME = sun.reflect.DelegatingMethodAccessorImpl.invoke(DelegatingMethodAccessorImpl.java:43)
	DEBUG_FRAME = java.lang.reflect.Method.invoke(Method.java:498)
	DEBUG_FRAME = org.apache.maven.surefire.util.ReflectionUtils.invokeMethodWithArray(ReflectionUtils.java:189)
	DEBUG_FRAME = org.apache.maven.surefire.booter.ProviderFactory$ProviderProxy.invoke(ProviderFactory.java:165)
	DEBUG_FRAME = org.apache.maven.surefire.booter.ProviderFactory.invokeProvider(ProviderFactory.java:85)
	DEBUG_FRAME = org.apache.maven.surefire.booter.ForkedBooter.runSuitesInProcess(ForkedBooter.java:115)
	DEBUG_FRAME = org.apache.maven.surefire.booter.ForkedBooter.main(ForkedBooter.java:75)

15:40:49,512 DEBUG [main] Loader:132 - Trying to find [org/apache/axis2/deployment/axis2_default.xml] using sun.misc.Launcher$AppClassLoader@232204a1 class loader.
15:40:49,513 DEBUG [main] StAXUtils:210 - XMLStreamReader is org.apache.axiom.util.stax.dialect.Woodstox4StreamReaderWrapper
15:40:49,528 DEBUG [main] AxiomContainerSupport:172 - Builder is already complete.
15:40:49,531 DEBUG [main] Phase:98 - Handler RequestURIBasedDispatcher added to Phase Transport
15:40:49,531 DEBUG [main] Phase:98 - Handler SOAPActionBasedDispatcher added to Phase Transport
15:40:49,531 DEBUG [main] Phase:98 - Handler AddressingBasedDispatcher added to Phase Addressing
15:40:49,532 DEBUG [main] Phase:98 - Handler RequestURIBasedDispatcher added to Phase Dispatch
15:40:49,532 DEBUG [main] Phase:98 - Handler SOAPActionBasedDispatcher added to Phase Dispatch
15:40:49,532 DEBUG [main] Phase:98 - Handler RequestURIOperationDispatcher added to Phase Dispatch
15:40:49,533 DEBUG [main] Phase:98 - Handler SOAPMessageBodyBasedDispatcher added to Phase Dispatch
15:40:49,533 DEBUG [main] Phase:98 - Handler HTTPLocationBasedDispatcher added to Phase Dispatch
15:40:49,534 DEBUG [main] Phase:98 - Handler RequestURIBasedDispatcher added to Phase Transport
15:40:49,534 DEBUG [main] Phase:98 - Handler SOAPActionBasedDispatcher added to Phase Transport
15:40:49,534 DEBUG [main] Phase:98 - Handler AddressingBasedDispatcher added to Phase Addressing
15:40:49,535 DEBUG [main] Phase:98 - Handler RequestURIBasedDispatcher added to Phase Dispatch
15:40:49,535 DEBUG [main] Phase:98 - Handler SOAPActionBasedDispatcher added to Phase Dispatch
15:40:49,535 DEBUG [main] Phase:98 - Handler RequestURIOperationDispatcher added to Phase Dispatch
15:40:49,535 DEBUG [main] Phase:98 - Handler SOAPMessageBodyBasedDispatcher added to Phase Dispatch
15:40:49,536 DEBUG [main] Phase:98 - Handler HTTPLocationBasedDispatcher added to Phase Dispatch
15:40:49,538 DEBUG [main] Loader:256 - java.lang.ClassNotFoundException: org.apache.axis2.jaxws.framework.JAXWSServiceBuilderExtension
15:40:49,539  WARN [main] AxisConfigBuilder:442 - Unable to instantiate deployer org.apache.axis2.deployment.ServiceDeployer; see debug logs for more details
15:40:49,539 DEBUG [main] AxisConfigBuilder:444 - org.apache.axis2.jaxws.framework.JAXWSServiceBuilderExtension
java.lang.ClassNotFoundException: org.apache.axis2.jaxws.framework.JAXWSServiceBuilderExtension
	at java.net.URLClassLoader.findClass(URLClassLoader.java:381)
	at java.lang.ClassLoader.loadClass(ClassLoader.java:424)
	at sun.misc.Launcher$AppClassLoader.loadClass(Launcher.java:338)
	at java.lang.ClassLoader.loadClass(ClassLoader.java:357)
	at java.lang.Class.forName0(Native Method)
	at java.lang.Class.forName(Class.java:264)
	at org.apache.axis2.util.Loader.loadClass(Loader.java:261)
	at org.apache.axis2.deployment.AxisConfigBuilder.processDeployers(AxisConfigBuilder.java:434)
	at org.apache.axis2.deployment.AxisConfigBuilder.populateConfig(AxisConfigBuilder.java:275)
	at org.apache.axis2.deployment.DeploymentEngine.populateAxisConfiguration(DeploymentEngine.java:629)
	at org.apache.axis2.deployment.FileSystemConfigurator.getAxisConfiguration(FileSystemConfigurator.java:116)
	at org.apache.axis2.context.ConfigurationContextFactory.createConfigurationContext(ConfigurationContextFactory.java:64)
	at org.apache.axis2.context.ConfigurationContextFactory.createConfigurationContextFromFileSystem(ConfigurationContextFactory.java:210)
	at org.apache.axis2.client.ServiceClient.configureServiceClient(ServiceClient.java:150)
	at org.apache.axis2.client.ServiceClient.<init>(ServiceClient.java:143)
	at net.ihe.gazelle.ws.client.GazelleTRMServiceStub.<init>(GazelleTRMServiceStub.java:43)
	at net.ihe.gazelle.ws.client.GazelleTRMServiceStub.<init>(GazelleTRMServiceStub.java:29)
	at net.ihe.gazelle.ws.client.GazelleTRMServiceStub.<init>(GazelleTRMServiceStub.java:75)
	at net.ihe.gazelle.ws.client.GazelleTRMServiceClient.<init>(GazelleTRMServiceClient.java:11)
	at net.ihe.gazelle.ws.client.GazelleTRMServiceStubTest.getTestInstanceById(GazelleTRMServiceStubTest.java:41)
	at sun.reflect.NativeMethodAccessorImpl.invoke0(Native Method)
	at sun.reflect.NativeMethodAccessorImpl.invoke(NativeMethodAccessorImpl.java:62)
	at sun.reflect.DelegatingMethodAccessorImpl.invoke(DelegatingMethodAccessorImpl.java:43)
	at java.lang.reflect.Method.invoke(Method.java:498)
	at org.junit.runners.model.FrameworkMethod$1.runReflectiveCall(FrameworkMethod.java:44)
	at org.junit.internal.runners.model.ReflectiveCallable.run(ReflectiveCallable.java:15)
	at org.junit.runners.model.FrameworkMethod.invokeExplosively(FrameworkMethod.java:41)
	at org.junit.internal.runners.statements.InvokeMethod.evaluate(InvokeMethod.java:20)
	at org.junit.runners.BlockJUnit4ClassRunner.runNotIgnored(BlockJUnit4ClassRunner.java:79)
	at org.junit.runners.BlockJUnit4ClassRunner.runChild(BlockJUnit4ClassRunner.java:71)
	at org.junit.runners.BlockJUnit4ClassRunner.runChild(BlockJUnit4ClassRunner.java:49)
	at org.junit.runners.ParentRunner$3.run(ParentRunner.java:193)
	at org.junit.runners.ParentRunner$1.schedule(ParentRunner.java:52)
	at org.junit.runners.ParentRunner.runChildren(ParentRunner.java:191)
	at org.junit.runners.ParentRunner.access$000(ParentRunner.java:42)
	at org.junit.runners.ParentRunner$2.evaluate(ParentRunner.java:184)
	at org.junit.runners.ParentRunner.run(ParentRunner.java:236)
	at org.apache.maven.surefire.junit4.JUnit4Provider.execute(JUnit4Provider.java:252)
	at org.apache.maven.surefire.junit4.JUnit4Provider.executeTestSet(JUnit4Provider.java:141)
	at org.apache.maven.surefire.junit4.JUnit4Provider.invoke(JUnit4Provider.java:112)
	at sun.reflect.NativeMethodAccessorImpl.invoke0(Native Method)
	at sun.reflect.NativeMethodAccessorImpl.invoke(NativeMethodAccessorImpl.java:62)
	at sun.reflect.DelegatingMethodAccessorImpl.invoke(DelegatingMethodAccessorImpl.java:43)
	at java.lang.reflect.Method.invoke(Method.java:498)
	at org.apache.maven.surefire.util.ReflectionUtils.invokeMethodWithArray(ReflectionUtils.java:189)
	at org.apache.maven.surefire.booter.ProviderFactory$ProviderProxy.invoke(ProviderFactory.java:165)
	at org.apache.maven.surefire.booter.ProviderFactory.invokeProvider(ProviderFactory.java:85)
	at org.apache.maven.surefire.booter.ForkedBooter.runSuitesInProcess(ForkedBooter.java:115)
	at org.apache.maven.surefire.booter.ForkedBooter.main(ForkedBooter.java:75)
15:40:49,540 DEBUG [main] AxisConfiguration:486 - Adding service to allServices map: [GazelleTRMService1523540449496_2] 
15:40:49,540 DEBUG [main] AxisOperation:567 - AxisOperation::getSoapAction urn:anonRobustOp
15:40:49,541 DEBUG [main] AxisOperation:567 - AxisOperation::getSoapAction urn:anonOutonlyOp
15:40:49,541 DEBUG [main] AxisOperation:567 - AxisOperation::getSoapAction urn:getSystemIsATool
15:40:49,541 DEBUG [main] AxisOperation:567 - AxisOperation::getSoapAction urn:anonOutInOp
15:40:49,541 DEBUG [main] AxisOperation:567 - AxisOperation::getSoapAction urn:getTestInstancesByTestingSession
15:40:49,542 DEBUG [main] AxisOperation:567 - AxisOperation::getSoapAction urn:getTestInstanceById
15:40:49,542 DEBUG [main] AxisOperation:567 - AxisOperation::getSoapAction urn:anonRobustOp
15:40:49,542 DEBUG [main] AxisOperation:567 - AxisOperation::getSoapAction urn:anonOutonlyOp
15:40:49,542 DEBUG [main] AxisOperation:567 - AxisOperation::getSoapAction urn:getSystemIsATool
15:40:49,542 DEBUG [main] AxisOperation:567 - AxisOperation::getSoapAction urn:anonOutInOp
15:40:49,542 DEBUG [main] AxisOperation:567 - AxisOperation::getSoapAction urn:getTestInstancesByTestingSession
15:40:49,542 DEBUG [main] AxisOperation:567 - AxisOperation::getSoapAction urn:getTestInstanceById
15:40:49,543 DEBUG [main] AxisConfiguration:396 - Adding service to allEndpoints map: (GazelleTRMService1523540449496_2,GazelleTRMService1523540449496_2HttpEndpoint) 
15:40:49,543 DEBUG [main] AxisConfiguration:396 - Adding service to allEndpoints map: (GazelleTRMService1523540449496_2,GazelleTRMService1523540449496_2HttpSoap11Endpoint) 
15:40:49,543 DEBUG [main] AxisConfiguration:396 - Adding service to allEndpoints map: (GazelleTRMService1523540449496_2,GazelleTRMService1523540449496_2HttpSoap12Endpoint) 
15:40:49,543 DEBUG [main] AxisConfiguration:403 - After adding to allEndpoints map, size is 3
15:40:49,544 DEBUG [main] AxisService:1971 - Get operation for {http://trm.ws.gazelletest.tm.gazelle.ihe.net/}getTestInstanceById
15:40:49,544 DEBUG [main] AxisService:2014 - Found axis operation:  org.apache.axis2.description.OutInAxisOperation@2df6226d
15:40:49,545 DEBUG [main] Options:589 - setAction Old action is (null)
15:40:49,545 DEBUG [main] Options:590 - setAction New action is (http://trm.ws.gazelletest.tm.gazelle.ihe.net/gazelleTRM/getTestInstanceById)
15:40:49,545 DEBUG [main] ConfigurationContext:85 - registerOperationContext (false): org.apache.axis2.context.OperationContext@93cf163 with key: urn:uuid:695e2e41-51fe-4ea2-9a0c-b730063168a5
15:40:49,545 DEBUG [main] OutInAxisOperationClient:164 - Entry: OutInAxisOperationClient::execute, true
15:40:49,545 DEBUG [main] Options:246 - getAction (null) from org.apache.axis2.client.Options@25bfcafd
15:40:49,546 DEBUG [main] MessageContext:1119 - SoapAction is (null)
15:40:49,546 DEBUG [main] Options:246 - getAction (http://trm.ws.gazelletest.tm.gazelle.ihe.net/gazelleTRM/getTestInstanceById) from org.apache.axis2.client.Options@2a76840c
15:40:49,546 DEBUG [main] Options:246 - getAction (null) from org.apache.axis2.client.Options@25bfcafd
15:40:49,546 DEBUG [main] MessageContext:1524 - Old SoapAction is (null)
15:40:49,546 DEBUG [main] MessageContext:1525 - New SoapAction is (http://trm.ws.gazelletest.tm.gazelle.ihe.net/gazelleTRM/getTestInstanceById)
15:40:49,546 DEBUG [main] Options:589 - setAction Old action is (null)
15:40:49,546 DEBUG [main] Options:590 - setAction New action is (http://trm.ws.gazelletest.tm.gazelle.ihe.net/gazelleTRM/getTestInstanceById)
15:40:49,546 DEBUG [main] OutInAxisOperationClient:194 - OutInAxisOperationClient: useAsyncOption null
15:40:49,546 DEBUG [main] ConfigurationContext:85 - registerOperationContext (false): org.apache.axis2.context.OperationContext@93cf163 with key: urn:uuid:695e2e41-51fe-4ea2-9a0c-b730063168a5
15:40:49,547 DEBUG [main] Options:246 - getAction (http://trm.ws.gazelletest.tm.gazelle.ihe.net/gazelleTRM/getTestInstanceById) from org.apache.axis2.client.Options@25bfcafd
15:40:49,547 DEBUG [main] MessageContext:1154 - WASAction is (http://trm.ws.gazelletest.tm.gazelle.ihe.net/gazelleTRM/getTestInstanceById)
15:40:49,547 DEBUG [main] ConfigurationContext:85 - msgContext: [MessageContext: logID=5da2a63f455693ddf120d8e0e53bb4fc67ebbd7001e845c7] action: http://trm.ws.gazelletest.tm.gazelle.ihe.net/gazelleTRM/getTestInstanceById
15:40:49,547 DEBUG [main] Phase:289 - [MessageContext: logID=5da2a63f455693ddf120d8e0e53bb4fc67ebbd7001e845c7] Checking pre-condition for Phase "RMPhase"
15:40:49,548 DEBUG [main] Phase:300 - [MessageContext: logID=5da2a63f455693ddf120d8e0e53bb4fc67ebbd7001e845c7] Invoking phase "RMPhase"
15:40:49,548 DEBUG [main] Phase:319 - [MessageContext: logID=5da2a63f455693ddf120d8e0e53bb4fc67ebbd7001e845c7] Checking post-conditions for phase "RMPhase"
15:40:49,548 DEBUG [main] Phase:289 - [MessageContext: logID=5da2a63f455693ddf120d8e0e53bb4fc67ebbd7001e845c7] Checking pre-condition for Phase "OpPhase"
15:40:49,548 DEBUG [main] Phase:300 - [MessageContext: logID=5da2a63f455693ddf120d8e0e53bb4fc67ebbd7001e845c7] Invoking phase "OpPhase"
15:40:49,548 DEBUG [main] Phase:319 - [MessageContext: logID=5da2a63f455693ddf120d8e0e53bb4fc67ebbd7001e845c7] Checking post-conditions for phase "OpPhase"
15:40:49,548 DEBUG [main] Phase:289 - [MessageContext: logID=5da2a63f455693ddf120d8e0e53bb4fc67ebbd7001e845c7] Checking pre-condition for Phase "OperationOutPhase"
15:40:49,548 DEBUG [main] Phase:300 - [MessageContext: logID=5da2a63f455693ddf120d8e0e53bb4fc67ebbd7001e845c7] Invoking phase "OperationOutPhase"
15:40:49,548 DEBUG [main] Phase:319 - [MessageContext: logID=5da2a63f455693ddf120d8e0e53bb4fc67ebbd7001e845c7] Checking post-conditions for phase "OperationOutPhase"
15:40:49,548 DEBUG [main] Phase:289 - [MessageContext: logID=5da2a63f455693ddf120d8e0e53bb4fc67ebbd7001e845c7] Checking pre-condition for Phase "PolicyDetermination"
15:40:49,549 DEBUG [main] Phase:300 - [MessageContext: logID=5da2a63f455693ddf120d8e0e53bb4fc67ebbd7001e845c7] Invoking phase "PolicyDetermination"
15:40:49,549 DEBUG [main] Phase:319 - [MessageContext: logID=5da2a63f455693ddf120d8e0e53bb4fc67ebbd7001e845c7] Checking post-conditions for phase "PolicyDetermination"
15:40:49,549 DEBUG [main] Phase:289 - [MessageContext: logID=5da2a63f455693ddf120d8e0e53bb4fc67ebbd7001e845c7] Checking pre-condition for Phase "MessageOut"
15:40:49,549 DEBUG [main] Phase:300 - [MessageContext: logID=5da2a63f455693ddf120d8e0e53bb4fc67ebbd7001e845c7] Invoking phase "MessageOut"
15:40:49,549 DEBUG [main] Phase:319 - [MessageContext: logID=5da2a63f455693ddf120d8e0e53bb4fc67ebbd7001e845c7] Checking post-conditions for phase "MessageOut"
15:40:49,549 DEBUG [main] Phase:289 - [MessageContext: logID=5da2a63f455693ddf120d8e0e53bb4fc67ebbd7001e845c7] Checking pre-condition for Phase "Security"
15:40:49,549 DEBUG [main] Phase:300 - [MessageContext: logID=5da2a63f455693ddf120d8e0e53bb4fc67ebbd7001e845c7] Invoking phase "Security"
15:40:49,549 DEBUG [main] Phase:319 - [MessageContext: logID=5da2a63f455693ddf120d8e0e53bb4fc67ebbd7001e845c7] Checking post-conditions for phase "Security"
15:40:49,550 DEBUG [main] DefaultHttpParams:151 - Set parameter http.connection-manager.timeout = 30000
15:40:49,550 DEBUG [main] DefaultHttpParams:151 - Set parameter http.connection.timeout = 60000
15:40:49,550 DEBUG [main] DefaultHttpParams:151 - Set parameter http.socket.timeout = 60000
15:40:49,550 DEBUG [main] DefaultHttpParams:151 - Set parameter http.socket.timeout = 60000
15:40:49,550 DEBUG [main] OMOutputFormat:196 - Start getContentType: OMOutputFormat [ mimeBoundary =null rootContentId=null doOptimize=false doingSWA=false isSOAP11=true charSetEncoding=UTF-8 xmlVersion=null contentType=null ignoreXmlDeclaration=false autoCloseWriter=false actionProperty=null optimizedThreshold=0]
15:40:49,550 DEBUG [main] OMOutputFormat:215 - getContentType= {text/xml}   OMOutputFormat [ mimeBoundary =null rootContentId=null doOptimize=false doingSWA=false isSOAP11=true charSetEncoding=UTF-8 xmlVersion=null contentType=text/xml ignoreXmlDeclaration=false autoCloseWriter=false actionProperty=null optimizedThreshold=0]
15:40:49,551 DEBUG [main] SOAPMessageFormatter:123 - contentType from the OMOutputFormat =text/xml
15:40:49,551 DEBUG [main] SOAPMessageFormatter:148 - contentType returned =text/xml; charset=UTF-8
15:40:49,551 DEBUG [main] DefaultHttpParams:151 - Set parameter http.connection.timeout = 60000
15:40:49,551 DEBUG [main] DefaultHttpParams:151 - Set parameter http.socket.timeout = 60000
15:40:49,551 DEBUG [main] MultiThreadedHttpConnectionManager:412 - HttpConnectionManager.getConnection:  config = HostConfiguration[host=https://gazelle.ihe.net], timeout = 30000
15:40:49,552 DEBUG [main] MultiThreadedHttpConnectionManager:760 - Allocating new connection, hostConfig=HostConfiguration[host=https://gazelle.ihe.net]
15:40:49,552 DEBUG [main] HttpConnection:692 - Open connection to gazelle.ihe.net:443
15:40:49,553 DEBUG [main] header:70 - >> "POST //gazelle-tm-ejb/GazelleTRMService/gazelleTRM HTTP/1.1[\r][\n]"
15:40:49,553 DEBUG [main] HttpMethodBase:1352 - Adding Host request header
15:40:49,553 DEBUG [main] header:70 - >> "Content-Type: text/xml; charset=UTF-8[\r][\n]"
15:40:49,553 DEBUG [main] header:70 - >> "SOAPAction: ""[\r][\n]"
15:40:49,553 DEBUG [main] header:70 - >> "User-Agent: Axis2[\r][\n]"
15:40:49,554 DEBUG [main] header:70 - >> "Host: gazelle.ihe.net[\r][\n]"
15:40:49,554 DEBUG [main] header:70 - >> "Transfer-Encoding: chunked[\r][\n]"
15:40:49,554 DEBUG [main] header:70 - >> "[\r][\n]"
15:40:49,555 DEBUG [main] SOAPMessageFormatter:51 - start writeTo()
15:40:49,555 DEBUG [main] SOAPMessageFormatter:52 -   preserve=false
15:40:49,555 DEBUG [main] SOAPMessageFormatter:53 -   isOptimized=false
15:40:49,555 DEBUG [main] SOAPMessageFormatter:54 -   isDoingSWA=false
15:40:49,555 DEBUG [main] MTOMXMLStreamWriter:130 - Creating MTOMXMLStreamWriter
15:40:49,555 DEBUG [main] MTOMXMLStreamWriter:131 - OutputStream =class org.apache.commons.httpclient.ChunkedOutputStream
15:40:49,556 DEBUG [main] MTOMXMLStreamWriter:132 - OMFormat = OMOutputFormat [ mimeBoundary =null rootContentId=null doOptimize=false doingSWA=false isSOAP11=true charSetEncoding=UTF-8 xmlVersion=null contentType=text/xml ignoreXmlDeclaration=false autoCloseWriter=false actionProperty=null optimizedThreshold=0]
15:40:49,556 DEBUG [main] MTOMXMLStreamWriter:133 - preserveAttachments = false
15:40:49,556 DEBUG [main] StAXUtils:344 - XMLStreamWriter is org.apache.axiom.util.stax.dialect.Woodstox4StreamWriterWrapper
15:40:49,556 DEBUG [main] MTOMXMLStreamWriter:230 - Calling MTOMXMLStreamWriter.flush
15:40:49,573 DEBUG [main] SOAPEnvelopeImpl:180 - Could not close builder or parser due to:
15:40:49,574 DEBUG [main] SOAPEnvelopeImpl:182 - builder is null
15:40:49,574 DEBUG [main] MTOMXMLStreamWriter:219 - close
15:40:49,574 DEBUG [main] MTOMXMLStreamWriter:230 - Calling MTOMXMLStreamWriter.flush
15:40:49,574 DEBUG [main] SOAPMessageFormatter:81 - end writeTo()
15:40:49,574 DEBUG [main] content:70 - >> "146[\r][\n]"
15:40:49,575 DEBUG [main] content:84 - >> "<?xml version='1.0' encoding='UTF-8'?><soapenv:Envelope xmlns:soapenv="http://schemas.xmlsoap.org/soap/envelope/"><soapenv:Header/><soapenv:Body><ns1:getTestInstanceById xmlns:ns1="http://trm.ws.gazelletest.tm.gazelle.ihe.net/"><testInstanceId>56342</testInstanceId></ns1:getTestInstanceById></soapenv:Body></soapenv:Envelope>"
15:40:49,575 DEBUG [main] content:70 - >> "[\r][\n]"
15:40:49,575 DEBUG [main] content:84 - >> "0"
15:40:49,575 DEBUG [main] content:70 - >> "[\r][\n]"
15:40:49,575 DEBUG [main] content:70 - >> "[\r][\n]"
15:40:49,576 DEBUG [main] EntityEnclosingMethod:508 - Request body sent
15:40:49,847 DEBUG [main] header:70 - << "HTTP/1.1 200 OK[\r][\n]"
15:40:49,847 DEBUG [main] header:70 - << "HTTP/1.1 200 OK[\r][\n]"
15:40:49,848 DEBUG [main] header:70 - << "Date: Thu, 12 Apr 2018 13:40:49 GMT[\r][\n]"
15:40:49,848 DEBUG [main] header:70 - << "Server: Apache[\r][\n]"
15:40:49,848 DEBUG [main] header:70 - << "Strict-Transport-Security: max-age=63072000; includeSubdomains;[\r][\n]"
15:40:49,848 DEBUG [main] header:70 - << "Content-Type: text/xml;charset=UTF-8[\r][\n]"
15:40:49,848 DEBUG [main] header:70 - << "Content-Length: 5637[\r][\n]"
15:40:49,849 DEBUG [main] header:70 - << "Vary: Accept-Encoding[\r][\n]"
15:40:49,849 DEBUG [main] header:70 - << "X-Frame-Options: sameorigin[\r][\n]"
15:40:49,849 DEBUG [main] header:70 - << "[\r][\n]"
15:40:49,849 DEBUG [main] Phase:340 - [MessageContext: logID=5da2a63f455693ddf120d8e0e53bb4fc67ebbd7001e845c7] Invoking flowComplete() in Phase "Security"
15:40:49,849 DEBUG [main] Phase:340 - [MessageContext: logID=5da2a63f455693ddf120d8e0e53bb4fc67ebbd7001e845c7] Invoking flowComplete() in Phase "MessageOut"
15:40:49,849 DEBUG [main] Phase:340 - [MessageContext: logID=5da2a63f455693ddf120d8e0e53bb4fc67ebbd7001e845c7] Invoking flowComplete() in Phase "PolicyDetermination"
15:40:49,849 DEBUG [main] Phase:340 - [MessageContext: logID=5da2a63f455693ddf120d8e0e53bb4fc67ebbd7001e845c7] Invoking flowComplete() in Phase "OperationOutPhase"
15:40:49,849 DEBUG [main] Phase:340 - [MessageContext: logID=5da2a63f455693ddf120d8e0e53bb4fc67ebbd7001e845c7] Invoking flowComplete() in Phase "OpPhase"
15:40:49,850 DEBUG [main] Phase:340 - [MessageContext: logID=5da2a63f455693ddf120d8e0e53bb4fc67ebbd7001e845c7] Invoking flowComplete() in Phase "RMPhase"
15:40:49,850 DEBUG [main] Options:246 - getAction (http://trm.ws.gazelletest.tm.gazelle.ihe.net/gazelleTRM/getTestInstanceById) from org.apache.axis2.client.Options@2a76840c
15:40:49,850 DEBUG [main] MessageContext:1524 - Old SoapAction is (http://trm.ws.gazelletest.tm.gazelle.ihe.net/gazelleTRM/getTestInstanceById)
15:40:49,850 DEBUG [main] MessageContext:1525 - New SoapAction is (null)
15:40:49,850 DEBUG [main] Options:589 - setAction Old action is (null)
15:40:49,850 DEBUG [main] Options:590 - setAction New action is (null)
15:40:49,851 DEBUG [main] Options:246 - getAction (http://trm.ws.gazelletest.tm.gazelle.ihe.net/gazelleTRM/getTestInstanceById) from org.apache.axis2.client.Options@2a76840c
15:40:49,851 DEBUG [main] MessageContext:1119 - SoapAction is (http://trm.ws.gazelletest.tm.gazelle.ihe.net/gazelleTRM/getTestInstanceById)
15:40:49,851 DEBUG [main] TransportUtils:200 - createSOAPEnvelope using Builder (class org.apache.axis2.builder.SOAPBuilder) selected from type (text/xml)
15:40:49,854 DEBUG [main] content:70 - << "<soap:Envelope xmlns:soap="http://schemas.xmlsoap.org/soap/envelope/"><soap:Body><ns2:getTestInstanceByIdResponse xmlns:ns2="http://trm.ws.gazelletest.tm.gazelle.ihe.net/"><testInstance><id>56342</id><lastStatus>paused</lastStatus><participants><aipo><actor>REFERRAL_REQUESTER</actor><id>1840</id><integrationProfile>XBeR-WD</integrationProfile><integrationProfileOption>NONE</integrationProfileOption></aipo><roleInTestId>12580</roleInTestId><status>unverified</status><system>OTHER_VANAD Enovation</system><systemUsername>evermeulen</systemUsername></participants><test><id>12123</id><keyword>XBER_WD_10-Request</keyword><name>XBER / WD Request Referral</name><shortDescription>Referral Requestor Actor generates a Request Referral, then uploads XDW document to gazelle for evaluation.</shortDescription><testPeerType>NO_PEER_TEST</testPeerType><testStatus>ready</testStatus><testType>connectathon</testType><trmTestDescriptions><description>&lt;h2&gt;Special Instructions&lt;/h2&gt;[\n]"
15:40:49,854 DEBUG [main] content:70 - << "&lt;p&gt;&amp;nbsp;&lt;/p&gt;[\n]"
15:40:49,854 DEBUG [main] content:70 - << "&lt;div id="_mcePaste" style="position: absolute; left: -10000px; top: 0px; width: 1px; height: 1px; overflow: hidden;"&gt;Connectathon testers using XDS.b based XDW documents should use the Connectathon XDW registry/repository for testing.&lt;/div&gt;[\n]"
15:40:49,854 DEBUG [main] content:70 - << "&lt;div id="_mcePaste" style="position: absolute; left: -10000px; top: 0px; width: 1px; height: 1px; overflow: hidden;"&gt;Monitors will evaluate uploaded messages by downloading them to an XML viewer tool and visually identifying need components.&lt;/div&gt;[\n]"
15:40:49,855 DEBUG [main] content:70 - << "&lt;p&gt;&amp;nbsp;&lt;/p&gt;[\n]"
15:40:49,855 DEBUG [main] content:70 - << "&lt;ul&gt;[\n]"
15:40:49,855 DEBUG [main] content:70 - << "&lt;li&gt;Connectathon testers using XDS.b based XDW documents should use the Connectathon XDW registry/repository for testing.&lt;/li&gt;[\n]"
15:40:49,855 DEBUG [main] content:70 - << "&lt;li&gt;Monitors will evaluate uploaded messages by downloading them to an XML viewer tool and visually identifying need components.&lt;/li&gt;[\n]"
15:40:49,855 DEBUG [main] content:70 - << "&lt;/ul&gt;[\n]"
15:40:49,855 DEBUG [main] content:70 - << "&lt;h2&gt;Description&lt;/h2&gt;[\n]"
15:40:49,855 DEBUG [main] content:70 - << "&lt;p&gt;Tests the ability to generate a request for referral.&lt;/p&gt;[\n]"
15:40:49,856 DEBUG [main] content:70 - << "&lt;h2&gt;Evaluation&lt;/h2&gt;[\n]"
15:40:49,856 DEBUG [main] content:70 - << "&lt;p&gt;A connectathon Monitor will evaluate the uploaded XDW document, checking for a Request Referral task with:&lt;/p&gt;[\n]"
15:40:49,856 DEBUG [main] content:70 - << "&lt;ul&gt;[\n]"
15:40:49,856 DEBUG [main] content:70 - << "&lt;li&gt;taskType &amp;nbsp; &amp;nbsp; &amp;nbsp; &amp;nbsp;Request Referral&amp;nbsp;&lt;/li&gt;[\n]"
15:40:49,856 DEBUG [main] content:70 - << "&lt;li&gt;taskName &amp;nbsp; &amp;nbsp; &amp;nbsp; &amp;nbsp;RequestReferral&lt;/li&gt;[\n]"
15:40:49,856 DEBUG [main] content:70 - << "&lt;li&gt;status &amp;nbsp; &amp;nbsp; &amp;nbsp; &amp;nbsp; &amp;nbsp;COMPLETED&lt;/li&gt;[\n]"
15:40:49,856 DEBUG [main] content:70 - << "&lt;li&gt;Optional input of medical record(s)&lt;/li&gt;[\n]"
15:40:49,857 DEBUG [main] content:70 - << "&lt;li&gt;No ancestor tasks in input&lt;/li&gt;[\n]"
15:40:49,857 DEBUG [main] content:70 - << "&lt;li&gt;Required output of an eReferral&lt;/li&gt;[\n]"
15:40:49,857 DEBUG [main] content:70 - << "&lt;/ul&gt;[\n]"
15:40:49,857 DEBUG [main] content:84 - << "&lt;p&gt;&amp;nbsp;&lt;/p&gt;</description><language>English</language></trmTestDescriptions><trmTestRoles><cardMax>1</cardMax><cardMin>1</cardMin><id>2131396</id><roleInTest><aipos><actor>REFERRAL_REQUESTER</actor><id>1840</id><integrationProfile>XBeR-WD</integrationProfile><integrationProfileOption>NONE</integrationProfileOption></aipos><id>12580</id><keyword>REFERRAL_REQUESTER-XBeR-WD</keyword></roleInTest><testOption>R</testOption></trmTestRoles><trmTestSteps><description>Use the gazelle patient generator to generate a new patient and ID. Use this patient as the subject for your work.</description><messageType>None</messageType><stepIndex>10</stepIndex><testRoleInitiatorId>2131396</testRoleInitiatorId><testRoleResponderId>2131396</testRoleResponderId><testStepOption>R</testStepOption></trmTestSteps><trmTestSteps><description>Create a referral request, including an XDW workflow document containing a Request Referral task in COMPLETED status and an eReferral output document</description><messageType>XDW Workflow Doc</messageType><stepIndex>20</stepIndex><testRoleInitiatorId>2131396</testRoleInitiatorId><testRoleResponderId>2131396</testRoleResponderId><testStepOption>R</testStepOption></trmTestSteps><trmTestSteps><description>Enter the Referral Request UID, the Patient ID, and the Patient Name in the test chat area.</description><messageType>None</messageType><stepIndex>30</stepInde"
15:40:49,858 DEBUG [main] StAXUtils:194 - XMLStreamReader is org.apache.axiom.util.stax.dialect.Woodstox4StreamReaderWrapper
15:40:49,858 DEBUG [main] StAXSOAPModelBuilder:210 - Starting to process SOAP 1.1 message
15:40:49,859 DEBUG [main] StAXOMBuilder:696 - Performing look-ahead; START_ELEMENT found
15:40:49,859 DEBUG [main] Phase:289 - [MessageContext: logID=4da2a63f455693ddf120d8e0e53bb4fc67ebbd7001e845c7] Checking pre-condition for Phase "Transport"
15:40:49,859 DEBUG [main] Phase:300 - [MessageContext: logID=4da2a63f455693ddf120d8e0e53bb4fc67ebbd7001e845c7] Invoking phase "Transport"
15:40:49,860 DEBUG [main] Phase:331 - [MessageContext: logID=4da2a63f455693ddf120d8e0e53bb4fc67ebbd7001e845c7] Invoking Handler 'RequestURIBasedDispatcher' in Phase 'Transport'
15:40:49,860 DEBUG [main] Phase:331 - [MessageContext: logID=4da2a63f455693ddf120d8e0e53bb4fc67ebbd7001e845c7] Invoking Handler 'SOAPActionBasedDispatcher' in Phase 'Transport'
15:40:49,860 DEBUG [main] Phase:319 - [MessageContext: logID=4da2a63f455693ddf120d8e0e53bb4fc67ebbd7001e845c7] Checking post-conditions for phase "Transport"
15:40:49,860 DEBUG [main] Phase:289 - [MessageContext: logID=4da2a63f455693ddf120d8e0e53bb4fc67ebbd7001e845c7] Checking pre-condition for Phase "Addressing"
15:40:49,860 DEBUG [main] Phase:300 - [MessageContext: logID=4da2a63f455693ddf120d8e0e53bb4fc67ebbd7001e845c7] Invoking phase "Addressing"
15:40:49,860 DEBUG [main] Phase:331 - [MessageContext: logID=4da2a63f455693ddf120d8e0e53bb4fc67ebbd7001e845c7] Invoking Handler 'AddressingBasedDispatcher' in Phase 'Addressing'
15:40:49,861 DEBUG [main] Phase:319 - [MessageContext: logID=4da2a63f455693ddf120d8e0e53bb4fc67ebbd7001e845c7] Checking post-conditions for phase "Addressing"
15:40:49,861 DEBUG [main] Phase:289 - [MessageContext: logID=4da2a63f455693ddf120d8e0e53bb4fc67ebbd7001e845c7] Checking pre-condition for Phase "Security"
15:40:49,861 DEBUG [main] Phase:300 - [MessageContext: logID=4da2a63f455693ddf120d8e0e53bb4fc67ebbd7001e845c7] Invoking phase "Security"
15:40:49,861 DEBUG [main] Phase:319 - [MessageContext: logID=4da2a63f455693ddf120d8e0e53bb4fc67ebbd7001e845c7] Checking post-conditions for phase "Security"
15:40:49,861 DEBUG [main] Phase:289 - [MessageContext: logID=4da2a63f455693ddf120d8e0e53bb4fc67ebbd7001e845c7] Checking pre-condition for Phase "PreDispatch"
15:40:49,862 DEBUG [main] Phase:300 - [MessageContext: logID=4da2a63f455693ddf120d8e0e53bb4fc67ebbd7001e845c7] Invoking phase "PreDispatch"
15:40:49,862 DEBUG [main] Phase:319 - [MessageContext: logID=4da2a63f455693ddf120d8e0e53bb4fc67ebbd7001e845c7] Checking post-conditions for phase "PreDispatch"
15:40:49,862 DEBUG [main] Phase:289 - [MessageContext: logID=4da2a63f455693ddf120d8e0e53bb4fc67ebbd7001e845c7] Checking pre-condition for Phase "Dispatch"
15:40:49,862 DEBUG [main] Phase:300 - [MessageContext: logID=4da2a63f455693ddf120d8e0e53bb4fc67ebbd7001e845c7] Invoking phase "Dispatch"
15:40:49,862 DEBUG [main] Phase:331 - [MessageContext: logID=4da2a63f455693ddf120d8e0e53bb4fc67ebbd7001e845c7] Invoking Handler 'RequestURIBasedDispatcher' in Phase 'Dispatch'
15:40:49,862 DEBUG [main] Phase:331 - [MessageContext: logID=4da2a63f455693ddf120d8e0e53bb4fc67ebbd7001e845c7] Invoking Handler 'SOAPActionBasedDispatcher' in Phase 'Dispatch'
15:40:49,862 DEBUG [main] Phase:331 - [MessageContext: logID=4da2a63f455693ddf120d8e0e53bb4fc67ebbd7001e845c7] Invoking Handler 'RequestURIOperationDispatcher' in Phase 'Dispatch'
15:40:49,862 DEBUG [main] Phase:331 - [MessageContext: logID=4da2a63f455693ddf120d8e0e53bb4fc67ebbd7001e845c7] Invoking Handler 'SOAPMessageBodyBasedDispatcher' in Phase 'Dispatch'
15:40:49,863 DEBUG [main] Phase:331 - [MessageContext: logID=4da2a63f455693ddf120d8e0e53bb4fc67ebbd7001e845c7] Invoking Handler 'HTTPLocationBasedDispatcher' in Phase 'Dispatch'
15:40:49,863 DEBUG [main] Phase:319 - [MessageContext: logID=4da2a63f455693ddf120d8e0e53bb4fc67ebbd7001e845c7] Checking post-conditions for phase "Dispatch"
15:40:49,863 DEBUG [main] AddressingHelper:102 - [MessageContext: logID=4da2a63f455693ddf120d8e0e53bb4fc67ebbd7001e845c7] isReplyRedirected: ReplyTo is null. Returning false
15:40:49,863 DEBUG [main] Phase:289 - [MessageContext: logID=4da2a63f455693ddf120d8e0e53bb4fc67ebbd7001e845c7] Checking pre-condition for Phase "RMPhase"
15:40:49,863 DEBUG [main] Phase:300 - [MessageContext: logID=4da2a63f455693ddf120d8e0e53bb4fc67ebbd7001e845c7] Invoking phase "RMPhase"
15:40:49,863 DEBUG [main] Phase:319 - [MessageContext: logID=4da2a63f455693ddf120d8e0e53bb4fc67ebbd7001e845c7] Checking post-conditions for phase "RMPhase"
15:40:49,863 DEBUG [main] Phase:289 - [MessageContext: logID=4da2a63f455693ddf120d8e0e53bb4fc67ebbd7001e845c7] Checking pre-condition for Phase "OpPhase"
15:40:49,863 DEBUG [main] Phase:300 - [MessageContext: logID=4da2a63f455693ddf120d8e0e53bb4fc67ebbd7001e845c7] Invoking phase "OpPhase"
15:40:49,863 DEBUG [main] Phase:319 - [MessageContext: logID=4da2a63f455693ddf120d8e0e53bb4fc67ebbd7001e845c7] Checking post-conditions for phase "OpPhase"
15:40:49,863 DEBUG [main] Phase:289 - [MessageContext: logID=4da2a63f455693ddf120d8e0e53bb4fc67ebbd7001e845c7] Checking pre-condition for Phase "OperationInPhase"
15:40:49,864 DEBUG [main] Phase:300 - [MessageContext: logID=4da2a63f455693ddf120d8e0e53bb4fc67ebbd7001e845c7] Invoking phase "OperationInPhase"
15:40:49,864 DEBUG [main] Phase:319 - [MessageContext: logID=4da2a63f455693ddf120d8e0e53bb4fc67ebbd7001e845c7] Checking post-conditions for phase "OperationInPhase"
15:40:49,864 DEBUG [main] Phase:340 - [MessageContext: logID=4da2a63f455693ddf120d8e0e53bb4fc67ebbd7001e845c7] Invoking flowComplete() in Phase "OperationInPhase"
15:40:49,864 DEBUG [main] Phase:340 - [MessageContext: logID=4da2a63f455693ddf120d8e0e53bb4fc67ebbd7001e845c7] Invoking flowComplete() in Phase "OpPhase"
15:40:49,864 DEBUG [main] Phase:340 - [MessageContext: logID=4da2a63f455693ddf120d8e0e53bb4fc67ebbd7001e845c7] Invoking flowComplete() in Phase "RMPhase"
15:40:49,864 DEBUG [main] Phase:340 - [MessageContext: logID=4da2a63f455693ddf120d8e0e53bb4fc67ebbd7001e845c7] Invoking flowComplete() in Phase "Dispatch"
15:40:49,864 DEBUG [main] Phase:359 - [MessageContext: logID=4da2a63f455693ddf120d8e0e53bb4fc67ebbd7001e845c7] Invoking flowComplete() for Handler 'HTTPLocationBasedDispatcher' in Phase 'Dispatch'
15:40:49,864 DEBUG [main] Phase:359 - [MessageContext: logID=4da2a63f455693ddf120d8e0e53bb4fc67ebbd7001e845c7] Invoking flowComplete() for Handler 'SOAPMessageBodyBasedDispatcher' in Phase 'Dispatch'
15:40:49,864 DEBUG [main] Phase:359 - [MessageContext: logID=4da2a63f455693ddf120d8e0e53bb4fc67ebbd7001e845c7] Invoking flowComplete() for Handler 'RequestURIOperationDispatcher' in Phase 'Dispatch'
15:40:49,864 DEBUG [main] Phase:359 - [MessageContext: logID=4da2a63f455693ddf120d8e0e53bb4fc67ebbd7001e845c7] Invoking flowComplete() for Handler 'SOAPActionBasedDispatcher' in Phase 'Dispatch'
15:40:49,865 DEBUG [main] Phase:359 - [MessageContext: logID=4da2a63f455693ddf120d8e0e53bb4fc67ebbd7001e845c7] Invoking flowComplete() for Handler 'RequestURIBasedDispatcher' in Phase 'Dispatch'
15:40:49,865 DEBUG [main] Phase:340 - [MessageContext: logID=4da2a63f455693ddf120d8e0e53bb4fc67ebbd7001e845c7] Invoking flowComplete() in Phase "PreDispatch"
15:40:49,865 DEBUG [main] Phase:340 - [MessageContext: logID=4da2a63f455693ddf120d8e0e53bb4fc67ebbd7001e845c7] Invoking flowComplete() in Phase "Security"
15:40:49,865 DEBUG [main] Phase:340 - [MessageContext: logID=4da2a63f455693ddf120d8e0e53bb4fc67ebbd7001e845c7] Invoking flowComplete() in Phase "Addressing"
15:40:49,865 DEBUG [main] Phase:359 - [MessageContext: logID=4da2a63f455693ddf120d8e0e53bb4fc67ebbd7001e845c7] Invoking flowComplete() for Handler 'AddressingBasedDispatcher' in Phase 'Addressing'
15:40:49,865 DEBUG [main] Phase:340 - [MessageContext: logID=4da2a63f455693ddf120d8e0e53bb4fc67ebbd7001e845c7] Invoking flowComplete() in Phase "Transport"
15:40:49,865 DEBUG [main] Phase:359 - [MessageContext: logID=4da2a63f455693ddf120d8e0e53bb4fc67ebbd7001e845c7] Invoking flowComplete() for Handler 'SOAPActionBasedDispatcher' in Phase 'Transport'
15:40:49,865 DEBUG [main] Phase:359 - [MessageContext: logID=4da2a63f455693ddf120d8e0e53bb4fc67ebbd7001e845c7] Invoking flowComplete() for Handler 'RequestURIBasedDispatcher' in Phase 'Transport'
15:40:49,865 DEBUG [main] StAXOMBuilder:648 - Consuming look-ahead token START_ELEMENT
15:40:49,866 DEBUG [main] PullSerializer:66 - Pull serializer created; initial state is org.apache.axiom.om.impl.common.serializer.pull.Navigator@47f4e407[cache=false,document=false]
15:40:49,868 DEBUG [main] StAXBuilder:575 - Caching disabled; current element level is 3
15:40:49,868 DEBUG [main] Navigator:661 - Switching to pull-through mode; first event is START_ELEMENT; depth is 1
15:40:49,868 DEBUG [main] PullSerializer:109 - Switching to state org.apache.axiom.om.impl.common.serializer.pull.PullThroughWrapper@6ff65192[reader=org.apache.axiom.util.stax.dialect.Woodstox4StreamReaderWrapper@2dd80673]
15:40:49,881 DEBUG [main] content:84 - << "x><testRoleInitiatorId>2131396</testRoleInitiatorId><testRoleResponderId>2131396</testRoleResponderId><testStepOption>R</testStepOption></trmTestSteps><trmTestSteps><description>Upload the XDW document to into the samples area of Gazelle.</description><messageType>XDW Workflow Doc</messageType><stepIndex>40</stepIndex><testRoleInitiatorId>2131396</testRoleInitiatorId><testRoleResponderId>2131396</testRoleResponderId><testStepOption>R</testStepOption></trmTestSteps><version>NA2014</version></test><testSteps><initiator>OTHER_VANAD Enovation</initiator><responder>OTHER_VANAD Enovation</responder><roleInTestInitId>12580</roleInTestInitId><roleInTestRespId>12580</roleInTestRespId><status2>activated</status2><testStepId>1501470</testStepId></testSteps><testSteps><initiator>OTHER_VANAD Enovation</initiator><responder>OTHER_VANAD Enovation</responder><roleInTestInitId>12580</roleInTestInitId><roleInTestRespId>12580</roleInTestRespId><status2>activated</status2><testStepId>1501471</testStepId></testSteps><testSteps><initiator>OTHER_VANAD Enovation</initiator><responder>OTHER_VANAD Enovation</responder><roleInTestInitId>12580</roleInTestInitId><roleInTestRespId>12580</roleInTestRespId><status2>activated</status2><testStepId>1501472</testStepId></testSteps><testSteps><initiator>OTHER_VANAD Enovation</initiator><responder>OTHER_VANAD Enovation</responder><roleInTestInitId>12580</roleInTestInitId><roleInTestRespId>12580</roleInTestRespId><status2>activated</status2><testStepId>1501473</testStepId></testSteps><testingSessionId>40</testingSessionId></testInstance></ns2:getTestInstanceByIdResponse></soap:Body></soap:Envelope>"
15:40:49,884 DEBUG [main] HttpMethodBase:1024 - Resorting to protocol version default close connection policy
15:40:49,885 DEBUG [main] HttpMethodBase:1028 - Should NOT close connection, using HTTP/1.1
15:40:49,885 DEBUG [main] HttpConnection:1178 - Releasing connection back to connection manager.
15:40:49,885 DEBUG [main] MultiThreadedHttpConnectionManager:979 - Freeing connection, hostConfig=HostConfiguration[host=https://gazelle.ihe.net]
15:40:49,885 DEBUG [main] IdleConnectionHandler:76 - Adding connection at: 1523540449885
15:40:49,885 DEBUG [main] MultiThreadedHttpConnectionManager:961 - Notifying no-one, there are no waiting threads
Tests run: 2, Failures: 0, Errors: 0, Skipped: 0, Time elapsed: 1.925 sec

Results :

Tests run: 2, Failures: 0, Errors: 0, Skipped: 0

[JENKINS] Recording test results
[WARNING] Attempt to (de-)serialize anonymous class hudson.maven.reporters.SurefireArchiver$2; see: https://jenkins.io/redirect/serialization-of-anonymous-classes/
[WARNING] Attempt to (de-)serialize anonymous class hudson.maven.reporters.BuildInfoRecorder$1; see: https://jenkins.io/redirect/serialization-of-anonymous-classes/
[INFO] 
[INFO] --- maven-jar-plugin:2.6:jar (default-jar) @ GazelleTRMClient ---
[INFO] Building jar: /home/jenkins/.hudson/jobs/GazelleTRMClient-SNAPSHOT/workspace/target/GazelleTRMClient-1.1.1-SNAPSHOT.jar
[INFO] 
[INFO] --- maven-install-plugin:2.4:install (default-install) @ GazelleTRMClient ---
[INFO] Installing /home/jenkins/.hudson/jobs/GazelleTRMClient-SNAPSHOT/workspace/target/GazelleTRMClient-1.1.1-SNAPSHOT.jar to /home/jenkins/.m2/repository/net/ihe/gazelle/maven/GazelleTRMClient/1.1.1-SNAPSHOT/GazelleTRMClient-1.1.1-SNAPSHOT.jar
[INFO] Installing /home/jenkins/.hudson/jobs/GazelleTRMClient-SNAPSHOT/workspace/pom.xml to /home/jenkins/.m2/repository/net/ihe/gazelle/maven/GazelleTRMClient/1.1.1-SNAPSHOT/GazelleTRMClient-1.1.1-SNAPSHOT.pom
[WARNING] Attempt to (de-)serialize anonymous class hudson.maven.reporters.MavenArtifactArchiver$2; see: https://jenkins.io/redirect/serialization-of-anonymous-classes/
[WARNING] Attempt to (de-)serialize anonymous class hudson.maven.reporters.MavenFingerprinter$1; see: https://jenkins.io/redirect/serialization-of-anonymous-classes/
Started calculate disk usage of build
Finished Calculation of disk usage of build in 0 seconds
Started calculate disk usage of workspace
Finished Calculation of disk usage of workspace in 0 seconds
[INFO] 
[INFO] ------------------------------------------------------------------------
[INFO] Building GazelleTRMClient 1.1.1-SNAPSHOT
[INFO] ------------------------------------------------------------------------
[INFO] 
[INFO] --- sonar-maven-plugin:3.4.0.905:sonar (default-cli) @ GazelleTRMClient ---
[INFO] User cache: /home/jenkins/.sonar/cache
[INFO] SonarQube version: 7.0.0
[INFO] Default locale: "en_GB", source code encoding: "UTF-8" (analysis is platform dependent)
[INFO] Publish mode
[INFO] Load global settings
[INFO] Load global settings (done) | time=159ms
[INFO] Server id: 1e5f71089284882
[INFO] User cache: /home/jenkins/.sonar/cache
[INFO] Load plugins index
[INFO] Load plugins index (done) | time=51ms
[INFO] Load/download plugins
[INFO] Plugin [l10nfr] defines 'l10nen' as base plugin. This metadata can be removed from manifest of l10n plugins since version 5.2.
[INFO] Plugin [l10nde] defines 'l10nen' as base plugin. This metadata can be removed from manifest of l10n plugins since version 5.2.
[INFO] Plugin [l10nel] defines 'l10nen' as base plugin. This metadata can be removed from manifest of l10n plugins since version 5.2.
[INFO] Plugin [l10nit] defines 'l10nen' as base plugin. This metadata can be removed from manifest of l10n plugins since version 5.2.
[INFO] Plugin [l10nja] defines 'l10nen' as base plugin. This metadata can be removed from manifest of l10n plugins since version 5.2.
[INFO] Plugin [l10nko] defines 'l10nen' as base plugin. This metadata can be removed from manifest of l10n plugins since version 5.2.
[INFO] Plugin [l10nes] defines 'l10nen' as base plugin. This metadata can be removed from manifest of l10n plugins since version 5.2.
[INFO] Load/download plugins (done) | time=12ms
[INFO] Process project properties
[INFO] Load project repositories
[INFO] Load project repositories (done) | time=69ms
[INFO] Load quality profiles
[INFO] Load quality profiles (done) | time=25ms
[INFO] Load active rules
[INFO] Load active rules (done) | time=385ms
[INFO] Load metrics repository
[INFO] Load metrics repository (done) | time=21ms
[INFO] Project key: net.ihe.gazelle.maven:GazelleTRMClient
[INFO] -------------  Scan GazelleTRMClient
[INFO] Base dir: /home/jenkins/.hudson/jobs/GazelleTRMClient-SNAPSHOT/workspace
[INFO] Working dir: /home/jenkins/.hudson/jobs/GazelleTRMClient-SNAPSHOT/workspace/target/sonar
[INFO] Source paths: pom.xml, src/main/java
[INFO] Test paths: src/test/java
[INFO] Source encoding: UTF-8, default locale: en_GB
[INFO] Load server rules
[INFO] Load server rules (done) | time=50ms
[INFO] Index files
[INFO] 3 files indexed
[INFO] Quality profile for java: Sonar way with Findbugs
[INFO] Quality profile for xml: Sonar way
[WARNING] ----------------------------------------------------------------
[WARNING] Sonargraph Integration: Skipping project GazelleTRMClient [net.ihe.gazelle.maven:GazelleTRMClient], since no Sonargraph rules are activated in current SonarQube quality profile [SonarQube].
[WARNING] ----------------------------------------------------------------
[WARNING] ----------------------------------------------------------------
[WARNING] Sonargraph Integration: Skipping project GazelleTRMClient [net.ihe.gazelle.maven:GazelleTRMClient], since no Sonargraph rules are activated in current SonarQube quality profile [SonarQube].
[WARNING] ----------------------------------------------------------------
[INFO] Sensor JavaSquidSensor [java]
[INFO] Configured Java source version (sonar.java.source): 7
[INFO] JavaClasspath initialization
[INFO] JavaClasspath initialization (done) | time=11ms
[INFO] JavaTestClasspath initialization
[INFO] JavaTestClasspath initialization (done) | time=2ms
[INFO] Java Main Files AST scan
[INFO] 1 source files to be analyzed
[INFO] 1/1 source files have been analyzed
[INFO] Java Main Files AST scan (done) | time=334ms
[INFO] Java Test Files AST scan
[INFO] 1 source files to be analyzed
[INFO] 1/1 source files have been analyzed
[INFO] Java Test Files AST scan (done) | time=67ms
[INFO] Sensor JavaSquidSensor [java] (done) | time=822ms
[INFO] Sensor PmdSensor [pmd]
[INFO] Execute PMD 5.4.2...
[INFO] Java version: 1.7
[INFO] PMD configuration: /home/jenkins/.hudson/jobs/GazelleTRMClient-SNAPSHOT/workspace/target/sonar/pmd.xml
[INFO] PMD configuration: /home/jenkins/.hudson/jobs/GazelleTRMClient-SNAPSHOT/workspace/target/sonar/pmd-unit-tests.xml
[INFO] Execute PMD 5.4.2 done: 393 ms
[INFO] Sensor PmdSensor [pmd] (done) | time=395ms
[INFO] Sensor Sonar-Sonargraph-Plugin [3.5] [Sonargraph]
[INFO] ----------------------------------------------------------------
[INFO] Sonargraph: Skipping project GazelleTRMClient [net.ihe.gazelle.maven:GazelleTRMClient], since no Sonargraph rules are activated in current SonarQube quality profile.
[INFO] ----------------------------------------------------------------
[INFO] Sensor Sonar-Sonargraph-Plugin [3.5] [Sonargraph] (done) | time=2ms
[INFO] Sensor FindBugs Sensor [findbugs]
[INFO] Loading findbugs plugin: /home/jenkins/.hudson/jobs/GazelleTRMClient-SNAPSHOT/workspace/target/sonar/findbugs/fb-contrib.jar
[INFO] Loading findbugs plugin: /home/jenkins/.hudson/jobs/GazelleTRMClient-SNAPSHOT/workspace/target/sonar/findbugs/findsecbugs-plugin.jar
[INFO] Findbugs output report: /home/jenkins/.hudson/jobs/GazelleTRMClient-SNAPSHOT/workspace/target/sonar/findbugs-result.xml
[WARNING] The class 'net.ihe.gazelle.ws.client.GazelleTRMServiceStub' could not be matched to its original source file. It might be a dynamically generated class.
[WARNING] The class 'net.ihe.gazelle.ws.client.GazelleTRMServiceStub' could not be matched to its original source file. It might be a dynamically generated class.
[WARNING] The class 'net.ihe.gazelle.ws.client.GazelleTRMServiceStub' could not be matched to its original source file. It might be a dynamically generated class.
[WARNING] The class 'net.ihe.gazelle.ws.client.GazelleTRMServiceStub' could not be matched to its original source file. It might be a dynamically generated class.
[WARNING] The class 'net.ihe.gazelle.ws.client.GazelleTRMServiceStub' could not be matched to its original source file. It might be a dynamically generated class.
[WARNING] The class 'net.ihe.gazelle.ws.client.GazelleTRMServiceStub' could not be matched to its original source file. It might be a dynamically generated class.
[WARNING] The class 'net.ihe.gazelle.ws.client.GazelleTRMServiceStub' could not be matched to its original source file. It might be a dynamically generated class.
[WARNING] The class 'net.ihe.gazelle.ws.client.GazelleTRMServiceStub' could not be matched to its original source file. It might be a dynamically generated class.
[WARNING] The class 'net.ihe.gazelle.ws.client.GazelleTRMServiceStub' could not be matched to its original source file. It might be a dynamically generated class.
[WARNING] The class 'net.ihe.gazelle.ws.client.GazelleTRMServiceStub' could not be matched to its original source file. It might be a dynamically generated class.
[WARNING] The class 'net.ihe.gazelle.ws.client.GazelleTRMServiceStub' could not be matched to its original source file. It might be a dynamically generated class.
[WARNING] The class 'net.ihe.gazelle.ws.client.GazelleTRMServiceStub' could not be matched to its original source file. It might be a dynamically generated class.
[WARNING] The class 'net.ihe.gazelle.ws.client.GazelleTRMServiceStub$GetSystemIsATool' could not be matched to its original source file. It might be a dynamically generated class.
[WARNING] The class 'net.ihe.gazelle.ws.client.GazelleTRMServiceStub$GetSystemIsATool' could not be matched to its original source file. It might be a dynamically generated class.
[WARNING] The class 'net.ihe.gazelle.ws.client.GazelleTRMServiceStub$GetSystemIsATool' could not be matched to its original source file. It might be a dynamically generated class.
[WARNING] The class 'net.ihe.gazelle.ws.client.GazelleTRMServiceStub$GetSystemIsATool$Factory' could not be matched to its original source file. It might be a dynamically generated class.
[WARNING] The class 'net.ihe.gazelle.ws.client.GazelleTRMServiceStub$GetSystemIsATool$Factory' could not be matched to its original source file. It might be a dynamically generated class.
[WARNING] The class 'net.ihe.gazelle.ws.client.GazelleTRMServiceStub$GetSystemIsAToolE' could not be matched to its original source file. It might be a dynamically generated class.
[WARNING] The class 'net.ihe.gazelle.ws.client.GazelleTRMServiceStub$GetSystemIsAToolE' could not be matched to its original source file. It might be a dynamically generated class.
[WARNING] The class 'net.ihe.gazelle.ws.client.GazelleTRMServiceStub$GetSystemIsAToolE' could not be matched to its original source file. It might be a dynamically generated class.
[WARNING] The class 'net.ihe.gazelle.ws.client.GazelleTRMServiceStub$GetSystemIsAToolE$Factory' could not be matched to its original source file. It might be a dynamically generated class.
[WARNING] The class 'net.ihe.gazelle.ws.client.GazelleTRMServiceStub$GetSystemIsAToolE$Factory' could not be matched to its original source file. It might be a dynamically generated class.
[WARNING] The class 'net.ihe.gazelle.ws.client.GazelleTRMServiceStub$GetSystemIsAToolResponse' could not be matched to its original source file. It might be a dynamically generated class.
[WARNING] The class 'net.ihe.gazelle.ws.client.GazelleTRMServiceStub$GetSystemIsAToolResponse' could not be matched to its original source file. It might be a dynamically generated class.
[WARNING] The class 'net.ihe.gazelle.ws.client.GazelleTRMServiceStub$GetSystemIsAToolResponse' could not be matched to its original source file. It might be a dynamically generated class.
[WARNING] The class 'net.ihe.gazelle.ws.client.GazelleTRMServiceStub$GetSystemIsAToolResponse$Factory' could not be matched to its original source file. It might be a dynamically generated class.
[WARNING] The class 'net.ihe.gazelle.ws.client.GazelleTRMServiceStub$GetSystemIsAToolResponse$Factory' could not be matched to its original source file. It might be a dynamically generated class.
[WARNING] The class 'net.ihe.gazelle.ws.client.GazelleTRMServiceStub$GetSystemIsAToolResponseE' could not be matched to its original source file. It might be a dynamically generated class.
[WARNING] The class 'net.ihe.gazelle.ws.client.GazelleTRMServiceStub$GetSystemIsAToolResponseE' could not be matched to its original source file. It might be a dynamically generated class.
[WARNING] The class 'net.ihe.gazelle.ws.client.GazelleTRMServiceStub$GetSystemIsAToolResponseE' could not be matched to its original source file. It might be a dynamically generated class.
[WARNING] The class 'net.ihe.gazelle.ws.client.GazelleTRMServiceStub$GetSystemIsAToolResponseE$Factory' could not be matched to its original source file. It might be a dynamically generated class.
[WARNING] The class 'net.ihe.gazelle.ws.client.GazelleTRMServiceStub$GetSystemIsAToolResponseE$Factory' could not be matched to its original source file. It might be a dynamically generated class.
[WARNING] The class 'net.ihe.gazelle.ws.client.GazelleTRMServiceStub$GetTestInstanceById' could not be matched to its original source file. It might be a dynamically generated class.
[WARNING] The class 'net.ihe.gazelle.ws.client.GazelleTRMServiceStub$GetTestInstanceById' could not be matched to its original source file. It might be a dynamically generated class.
[WARNING] The class 'net.ihe.gazelle.ws.client.GazelleTRMServiceStub$GetTestInstanceById' could not be matched to its original source file. It might be a dynamically generated class.
[WARNING] The class 'net.ihe.gazelle.ws.client.GazelleTRMServiceStub$GetTestInstanceById$Factory' could not be matched to its original source file. It might be a dynamically generated class.
[WARNING] The class 'net.ihe.gazelle.ws.client.GazelleTRMServiceStub$GetTestInstanceById$Factory' could not be matched to its original source file. It might be a dynamically generated class.
[WARNING] The class 'net.ihe.gazelle.ws.client.GazelleTRMServiceStub$GetTestInstanceByIdE' could not be matched to its original source file. It might be a dynamically generated class.
[WARNING] The class 'net.ihe.gazelle.ws.client.GazelleTRMServiceStub$GetTestInstanceByIdE' could not be matched to its original source file. It might be a dynamically generated class.
[WARNING] The class 'net.ihe.gazelle.ws.client.GazelleTRMServiceStub$GetTestInstanceByIdE' could not be matched to its original source file. It might be a dynamically generated class.
[WARNING] The class 'net.ihe.gazelle.ws.client.GazelleTRMServiceStub$GetTestInstanceByIdE$Factory' could not be matched to its original source file. It might be a dynamically generated class.
[WARNING] The class 'net.ihe.gazelle.ws.client.GazelleTRMServiceStub$GetTestInstanceByIdE$Factory' could not be matched to its original source file. It might be a dynamically generated class.
[WARNING] The class 'net.ihe.gazelle.ws.client.GazelleTRMServiceStub$GetTestInstanceByIdResponse' could not be matched to its original source file. It might be a dynamically generated class.
[WARNING] The class 'net.ihe.gazelle.ws.client.GazelleTRMServiceStub$GetTestInstanceByIdResponse' could not be matched to its original source file. It might be a dynamically generated class.
[WARNING] The class 'net.ihe.gazelle.ws.client.GazelleTRMServiceStub$GetTestInstanceByIdResponse' could not be matched to its original source file. It might be a dynamically generated class.
[WARNING] The class 'net.ihe.gazelle.ws.client.GazelleTRMServiceStub$GetTestInstanceByIdResponse$Factory' could not be matched to its original source file. It might be a dynamically generated class.
[WARNING] The class 'net.ihe.gazelle.ws.client.GazelleTRMServiceStub$GetTestInstanceByIdResponse$Factory' could not be matched to its original source file. It might be a dynamically generated class.
[WARNING] The class 'net.ihe.gazelle.ws.client.GazelleTRMServiceStub$GetTestInstanceByIdResponseE' could not be matched to its original source file. It might be a dynamically generated class.
[WARNING] The class 'net.ihe.gazelle.ws.client.GazelleTRMServiceStub$GetTestInstanceByIdResponseE' could not be matched to its original source file. It might be a dynamically generated class.
[WARNING] The class 'net.ihe.gazelle.ws.client.GazelleTRMServiceStub$GetTestInstanceByIdResponseE' could not be matched to its original source file. It might be a dynamically generated class.
[WARNING] The class 'net.ihe.gazelle.ws.client.GazelleTRMServiceStub$GetTestInstanceByIdResponseE$Factory' could not be matched to its original source file. It might be a dynamically generated class.
[WARNING] The class 'net.ihe.gazelle.ws.client.GazelleTRMServiceStub$GetTestInstanceByIdResponseE$Factory' could not be matched to its original source file. It might be a dynamically generated class.
[WARNING] The class 'net.ihe.gazelle.ws.client.GazelleTRMServiceStub$GetTestInstancesByTestingSession' could not be matched to its original source file. It might be a dynamically generated class.
[WARNING] The class 'net.ihe.gazelle.ws.client.GazelleTRMServiceStub$GetTestInstancesByTestingSession' could not be matched to its original source file. It might be a dynamically generated class.
[WARNING] The class 'net.ihe.gazelle.ws.client.GazelleTRMServiceStub$GetTestInstancesByTestingSession' could not be matched to its original source file. It might be a dynamically generated class.
[WARNING] The class 'net.ihe.gazelle.ws.client.GazelleTRMServiceStub$GetTestInstancesByTestingSession$Factory' could not be matched to its original source file. It might be a dynamically generated class.
[WARNING] The class 'net.ihe.gazelle.ws.client.GazelleTRMServiceStub$GetTestInstancesByTestingSession$Factory' could not be matched to its original source file. It might be a dynamically generated class.
[WARNING] The class 'net.ihe.gazelle.ws.client.GazelleTRMServiceStub$GetTestInstancesByTestingSessionE' could not be matched to its original source file. It might be a dynamically generated class.
[WARNING] The class 'net.ihe.gazelle.ws.client.GazelleTRMServiceStub$GetTestInstancesByTestingSessionE' could not be matched to its original source file. It might be a dynamically generated class.
[WARNING] The class 'net.ihe.gazelle.ws.client.GazelleTRMServiceStub$GetTestInstancesByTestingSessionE' could not be matched to its original source file. It might be a dynamically generated class.
[WARNING] The class 'net.ihe.gazelle.ws.client.GazelleTRMServiceStub$GetTestInstancesByTestingSessionE$Factory' could not be matched to its original source file. It might be a dynamically generated class.
[WARNING] The class 'net.ihe.gazelle.ws.client.GazelleTRMServiceStub$GetTestInstancesByTestingSessionE$Factory' could not be matched to its original source file. It might be a dynamically generated class.
[WARNING] The class 'net.ihe.gazelle.ws.client.GazelleTRMServiceStub$GetTestInstancesByTestingSessionResponse' could not be matched to its original source file. It might be a dynamically generated class.
[WARNING] The class 'net.ihe.gazelle.ws.client.GazelleTRMServiceStub$GetTestInstancesByTestingSessionResponse' could not be matched to its original source file. It might be a dynamically generated class.
[WARNING] The class 'net.ihe.gazelle.ws.client.GazelleTRMServiceStub$GetTestInstancesByTestingSessionResponse' could not be matched to its original source file. It might be a dynamically generated class.
[WARNING] The class 'net.ihe.gazelle.ws.client.GazelleTRMServiceStub$GetTestInstancesByTestingSessionResponse$Factory' could not be matched to its original source file. It might be a dynamically generated class.
[WARNING] The class 'net.ihe.gazelle.ws.client.GazelleTRMServiceStub$GetTestInstancesByTestingSessionResponse$Factory' could not be matched to its original source file. It might be a dynamically generated class.
[WARNING] The class 'net.ihe.gazelle.ws.client.GazelleTRMServiceStub$GetTestInstancesByTestingSessionResponseE' could not be matched to its original source file. It might be a dynamically generated class.
[WARNING] The class 'net.ihe.gazelle.ws.client.GazelleTRMServiceStub$GetTestInstancesByTestingSessionResponseE' could not be matched to its original source file. It might be a dynamically generated class.
[WARNING] The class 'net.ihe.gazelle.ws.client.GazelleTRMServiceStub$GetTestInstancesByTestingSessionResponseE' could not be matched to its original source file. It might be a dynamically generated class.
[WARNING] The class 'net.ihe.gazelle.ws.client.GazelleTRMServiceStub$GetTestInstancesByTestingSessionResponseE$Factory' could not be matched to its original source file. It might be a dynamically generated class.
[WARNING] The class 'net.ihe.gazelle.ws.client.GazelleTRMServiceStub$GetTestInstancesByTestingSessionResponseE$Factory' could not be matched to its original source file. It might be a dynamically generated class.
[WARNING] The class 'net.ihe.gazelle.ws.client.GazelleTRMServiceStub$SOAPException' could not be matched to its original source file. It might be a dynamically generated class.
[WARNING] The class 'net.ihe.gazelle.ws.client.GazelleTRMServiceStub$SOAPException' could not be matched to its original source file. It might be a dynamically generated class.
[WARNING] The class 'net.ihe.gazelle.ws.client.GazelleTRMServiceStub$SOAPException' could not be matched to its original source file. It might be a dynamically generated class.
[WARNING] The class 'net.ihe.gazelle.ws.client.GazelleTRMServiceStub$SOAPException' could not be matched to its original source file. It might be a dynamically generated class.
[WARNING] The class 'net.ihe.gazelle.ws.client.GazelleTRMServiceStub$SOAPException$Factory' could not be matched to its original source file. It might be a dynamically generated class.
[WARNING] The class 'net.ihe.gazelle.ws.client.GazelleTRMServiceStub$SOAPException$Factory' could not be matched to its original source file. It might be a dynamically generated class.
[WARNING] The class 'net.ihe.gazelle.ws.client.GazelleTRMServiceStub$SOAPExceptionE' could not be matched to its original source file. It might be a dynamically generated class.
[WARNING] The class 'net.ihe.gazelle.ws.client.GazelleTRMServiceStub$SOAPExceptionE' could not be matched to its original source file. It might be a dynamically generated class.
[WARNING] The class 'net.ihe.gazelle.ws.client.GazelleTRMServiceStub$SOAPExceptionE' could not be matched to its original source file. It might be a dynamically generated class.
[WARNING] The class 'net.ihe.gazelle.ws.client.GazelleTRMServiceStub$SOAPExceptionE$Factory' could not be matched to its original source file. It might be a dynamically generated class.
[WARNING] The class 'net.ihe.gazelle.ws.client.GazelleTRMServiceStub$SOAPExceptionE$Factory' could not be matched to its original source file. It might be a dynamically generated class.
[WARNING] The class 'net.ihe.gazelle.ws.client.GazelleTRMServiceStub$TrMaipo' could not be matched to its original source file. It might be a dynamically generated class.
[WARNING] The class 'net.ihe.gazelle.ws.client.GazelleTRMServiceStub$TrMaipo' could not be matched to its original source file. It might be a dynamically generated class.
[WARNING] The class 'net.ihe.gazelle.ws.client.GazelleTRMServiceStub$TrMaipo' could not be matched to its original source file. It might be a dynamically generated class.
[WARNING] The class 'net.ihe.gazelle.ws.client.GazelleTRMServiceStub$TrMaipo$Factory' could not be matched to its original source file. It might be a dynamically generated class.
[WARNING] The class 'net.ihe.gazelle.ws.client.GazelleTRMServiceStub$TrMaipo$Factory' could not be matched to its original source file. It might be a dynamically generated class.
[WARNING] The class 'net.ihe.gazelle.ws.client.GazelleTRMServiceStub$TrmChannelType' could not be matched to its original source file. It might be a dynamically generated class.
[WARNING] The class 'net.ihe.gazelle.ws.client.GazelleTRMServiceStub$TrmChannelType' could not be matched to its original source file. It might be a dynamically generated class.
[WARNING] The class 'net.ihe.gazelle.ws.client.GazelleTRMServiceStub$TrmChannelType' could not be matched to its original source file. It might be a dynamically generated class.
[WARNING] The class 'net.ihe.gazelle.ws.client.GazelleTRMServiceStub$TrmChannelType' could not be matched to its original source file. It might be a dynamically generated class.
[WARNING] The class 'net.ihe.gazelle.ws.client.GazelleTRMServiceStub$TrmChannelType$Factory' could not be matched to its original source file. It might be a dynamically generated class.
[WARNING] The class 'net.ihe.gazelle.ws.client.GazelleTRMServiceStub$TrmChannelType$Factory' could not be matched to its original source file. It might be a dynamically generated class.
[WARNING] The class 'net.ihe.gazelle.ws.client.GazelleTRMServiceStub$TrmChannelType$Factory' could not be matched to its original source file. It might be a dynamically generated class.
[WARNING] The class 'net.ihe.gazelle.ws.client.GazelleTRMServiceStub$TrmChannelType$Factory' could not be matched to its original source file. It might be a dynamically generated class.
[WARNING] The class 'net.ihe.gazelle.ws.client.GazelleTRMServiceStub$TrmChannelType$Factory' could not be matched to its original source file. It might be a dynamically generated class.
[WARNING] The class 'net.ihe.gazelle.ws.client.GazelleTRMServiceStub$TrmChannelType$Factory' could not be matched to its original source file. It might be a dynamically generated class.
[WARNING] The class 'net.ihe.gazelle.ws.client.GazelleTRMServiceStub$TrmChannelType$Factory' could not be matched to its original source file. It might be a dynamically generated class.
[WARNING] The class 'net.ihe.gazelle.ws.client.GazelleTRMServiceStub$TrmConfiguration' could not be matched to its original source file. It might be a dynamically generated class.
[WARNING] The class 'net.ihe.gazelle.ws.client.GazelleTRMServiceStub$TrmConfiguration' could not be matched to its original source file. It might be a dynamically generated class.
[WARNING] The class 'net.ihe.gazelle.ws.client.GazelleTRMServiceStub$TrmConfiguration' could not be matched to its original source file. It might be a dynamically generated class.
[WARNING] The class 'net.ihe.gazelle.ws.client.GazelleTRMServiceStub$TrmConfiguration$Factory' could not be matched to its original source file. It might be a dynamically generated class.
[WARNING] The class 'net.ihe.gazelle.ws.client.GazelleTRMServiceStub$TrmConfiguration$Factory' could not be matched to its original source file. It might be a dynamically generated class.
[WARNING] The class 'net.ihe.gazelle.ws.client.GazelleTRMServiceStub$TrmParticipant' could not be matched to its original source file. It might be a dynamically generated class.
[WARNING] The class 'net.ihe.gazelle.ws.client.GazelleTRMServiceStub$TrmParticipant' could not be matched to its original source file. It might be a dynamically generated class.
[WARNING] The class 'net.ihe.gazelle.ws.client.GazelleTRMServiceStub$TrmParticipant' could not be matched to its original source file. It might be a dynamically generated class.
[WARNING] The class 'net.ihe.gazelle.ws.client.GazelleTRMServiceStub$TrmParticipant$Factory' could not be matched to its original source file. It might be a dynamically generated class.
[WARNING] The class 'net.ihe.gazelle.ws.client.GazelleTRMServiceStub$TrmParticipant$Factory' could not be matched to its original source file. It might be a dynamically generated class.
[WARNING] The class 'net.ihe.gazelle.ws.client.GazelleTRMServiceStub$TrmRoleInTest' could not be matched to its original source file. It might be a dynamically generated class.
[WARNING] The class 'net.ihe.gazelle.ws.client.GazelleTRMServiceStub$TrmRoleInTest' could not be matched to its original source file. It might be a dynamically generated class.
[WARNING] The class 'net.ihe.gazelle.ws.client.GazelleTRMServiceStub$TrmRoleInTest' could not be matched to its original source file. It might be a dynamically generated class.
[WARNING] The class 'net.ihe.gazelle.ws.client.GazelleTRMServiceStub$TrmRoleInTest' could not be matched to its original source file. It might be a dynamically generated class.
[WARNING] The class 'net.ihe.gazelle.ws.client.GazelleTRMServiceStub$TrmRoleInTest' could not be matched to its original source file. It might be a dynamically generated class.
[WARNING] The class 'net.ihe.gazelle.ws.client.GazelleTRMServiceStub$TrmRoleInTest$Factory' could not be matched to its original source file. It might be a dynamically generated class.
[WARNING] The class 'net.ihe.gazelle.ws.client.GazelleTRMServiceStub$TrmRoleInTest$Factory' could not be matched to its original source file. It might be a dynamically generated class.
[WARNING] The class 'net.ihe.gazelle.ws.client.GazelleTRMServiceStub$TrmShortTestInstance' could not be matched to its original source file. It might be a dynamically generated class.
[WARNING] The class 'net.ihe.gazelle.ws.client.GazelleTRMServiceStub$TrmShortTestInstance' could not be matched to its original source file. It might be a dynamically generated class.
[WARNING] The class 'net.ihe.gazelle.ws.client.GazelleTRMServiceStub$TrmShortTestInstance' could not be matched to its original source file. It might be a dynamically generated class.
[WARNING] The class 'net.ihe.gazelle.ws.client.GazelleTRMServiceStub$TrmShortTestInstance$Factory' could not be matched to its original source file. It might be a dynamically generated class.
[WARNING] The class 'net.ihe.gazelle.ws.client.GazelleTRMServiceStub$TrmShortTestInstance$Factory' could not be matched to its original source file. It might be a dynamically generated class.
[WARNING] The class 'net.ihe.gazelle.ws.client.GazelleTRMServiceStub$TrmTest' could not be matched to its original source file. It might be a dynamically generated class.
[WARNING] The class 'net.ihe.gazelle.ws.client.GazelleTRMServiceStub$TrmTest' could not be matched to its original source file. It might be a dynamically generated class.
[WARNING] The class 'net.ihe.gazelle.ws.client.GazelleTRMServiceStub$TrmTest' could not be matched to its original source file. It might be a dynamically generated class.
[WARNING] The class 'net.ihe.gazelle.ws.client.GazelleTRMServiceStub$TrmTest' could not be matched to its original source file. It might be a dynamically generated class.
[WARNING] The class 'net.ihe.gazelle.ws.client.GazelleTRMServiceStub$TrmTest' could not be matched to its original source file. It might be a dynamically generated class.
[WARNING] The class 'net.ihe.gazelle.ws.client.GazelleTRMServiceStub$TrmTest' could not be matched to its original source file. It might be a dynamically generated class.
[WARNING] The class 'net.ihe.gazelle.ws.client.GazelleTRMServiceStub$TrmTest' could not be matched to its original source file. It might be a dynamically generated class.
[WARNING] The class 'net.ihe.gazelle.ws.client.GazelleTRMServiceStub$TrmTest' could not be matched to its original source file. It might be a dynamically generated class.
[WARNING] The class 'net.ihe.gazelle.ws.client.GazelleTRMServiceStub$TrmTest' could not be matched to its original source file. It might be a dynamically generated class.
[WARNING] The class 'net.ihe.gazelle.ws.client.GazelleTRMServiceStub$TrmTest$Factory' could not be matched to its original source file. It might be a dynamically generated class.
[WARNING] The class 'net.ihe.gazelle.ws.client.GazelleTRMServiceStub$TrmTest$Factory' could not be matched to its original source file. It might be a dynamically generated class.
[WARNING] The class 'net.ihe.gazelle.ws.client.GazelleTRMServiceStub$TrmTestDescription' could not be matched to its original source file. It might be a dynamically generated class.
[WARNING] The class 'net.ihe.gazelle.ws.client.GazelleTRMServiceStub$TrmTestDescription' could not be matched to its original source file. It might be a dynamically generated class.
[WARNING] The class 'net.ihe.gazelle.ws.client.GazelleTRMServiceStub$TrmTestDescription' could not be matched to its original source file. It might be a dynamically generated class.
[WARNING] The class 'net.ihe.gazelle.ws.client.GazelleTRMServiceStub$TrmTestDescription$Factory' could not be matched to its original source file. It might be a dynamically generated class.
[WARNING] The class 'net.ihe.gazelle.ws.client.GazelleTRMServiceStub$TrmTestDescription$Factory' could not be matched to its original source file. It might be a dynamically generated class.
[WARNING] The class 'net.ihe.gazelle.ws.client.GazelleTRMServiceStub$TrmTestInstance' could not be matched to its original source file. It might be a dynamically generated class.
[WARNING] The class 'net.ihe.gazelle.ws.client.GazelleTRMServiceStub$TrmTestInstance' could not be matched to its original source file. It might be a dynamically generated class.
[WARNING] The class 'net.ihe.gazelle.ws.client.GazelleTRMServiceStub$TrmTestInstance' could not be matched to its original source file. It might be a dynamically generated class.
[WARNING] The class 'net.ihe.gazelle.ws.client.GazelleTRMServiceStub$TrmTestInstance' could not be matched to its original source file. It might be a dynamically generated class.
[WARNING] The class 'net.ihe.gazelle.ws.client.GazelleTRMServiceStub$TrmTestInstance' could not be matched to its original source file. It might be a dynamically generated class.
[WARNING] The class 'net.ihe.gazelle.ws.client.GazelleTRMServiceStub$TrmTestInstance' could not be matched to its original source file. It might be a dynamically generated class.
[WARNING] The class 'net.ihe.gazelle.ws.client.GazelleTRMServiceStub$TrmTestInstance' could not be matched to its original source file. It might be a dynamically generated class.
[WARNING] The class 'net.ihe.gazelle.ws.client.GazelleTRMServiceStub$TrmTestInstance' could not be matched to its original source file. It might be a dynamically generated class.
[WARNING] The class 'net.ihe.gazelle.ws.client.GazelleTRMServiceStub$TrmTestInstance' could not be matched to its original source file. It might be a dynamically generated class.
[WARNING] The class 'net.ihe.gazelle.ws.client.GazelleTRMServiceStub$TrmTestInstance$Factory' could not be matched to its original source file. It might be a dynamically generated class.
[WARNING] The class 'net.ihe.gazelle.ws.client.GazelleTRMServiceStub$TrmTestInstance$Factory' could not be matched to its original source file. It might be a dynamically generated class.
[WARNING] The class 'net.ihe.gazelle.ws.client.GazelleTRMServiceStub$TrmTestInstances' could not be matched to its original source file. It might be a dynamically generated class.
[WARNING] The class 'net.ihe.gazelle.ws.client.GazelleTRMServiceStub$TrmTestInstances' could not be matched to its original source file. It might be a dynamically generated class.
[WARNING] The class 'net.ihe.gazelle.ws.client.GazelleTRMServiceStub$TrmTestInstances' could not be matched to its original source file. It might be a dynamically generated class.
[WARNING] The class 'net.ihe.gazelle.ws.client.GazelleTRMServiceStub$TrmTestInstances' could not be matched to its original source file. It might be a dynamically generated class.
[WARNING] The class 'net.ihe.gazelle.ws.client.GazelleTRMServiceStub$TrmTestInstances' could not be matched to its original source file. It might be a dynamically generated class.
[WARNING] The class 'net.ihe.gazelle.ws.client.GazelleTRMServiceStub$TrmTestInstances$Factory' could not be matched to its original source file. It might be a dynamically generated class.
[WARNING] The class 'net.ihe.gazelle.ws.client.GazelleTRMServiceStub$TrmTestInstances$Factory' could not be matched to its original source file. It might be a dynamically generated class.
[WARNING] The class 'net.ihe.gazelle.ws.client.GazelleTRMServiceStub$TrmTestRole' could not be matched to its original source file. It might be a dynamically generated class.
[WARNING] The class 'net.ihe.gazelle.ws.client.GazelleTRMServiceStub$TrmTestRole' could not be matched to its original source file. It might be a dynamically generated class.
[WARNING] The class 'net.ihe.gazelle.ws.client.GazelleTRMServiceStub$TrmTestRole' could not be matched to its original source file. It might be a dynamically generated class.
[WARNING] The class 'net.ihe.gazelle.ws.client.GazelleTRMServiceStub$TrmTestRole$Factory' could not be matched to its original source file. It might be a dynamically generated class.
[WARNING] The class 'net.ihe.gazelle.ws.client.GazelleTRMServiceStub$TrmTestRole$Factory' could not be matched to its original source file. It might be a dynamically generated class.
[WARNING] The class 'net.ihe.gazelle.ws.client.GazelleTRMServiceStub$TrmTestStep' could not be matched to its original source file. It might be a dynamically generated class.
[WARNING] The class 'net.ihe.gazelle.ws.client.GazelleTRMServiceStub$TrmTestStep' could not be matched to its original source file. It might be a dynamically generated class.
[WARNING] The class 'net.ihe.gazelle.ws.client.GazelleTRMServiceStub$TrmTestStep' could not be matched to its original source file. It might be a dynamically generated class.
[WARNING] The class 'net.ihe.gazelle.ws.client.GazelleTRMServiceStub$TrmTestStep$Factory' could not be matched to its original source file. It might be a dynamically generated class.
[WARNING] The class 'net.ihe.gazelle.ws.client.GazelleTRMServiceStub$TrmTestStep$Factory' could not be matched to its original source file. It might be a dynamically generated class.
[WARNING] The class 'net.ihe.gazelle.ws.client.GazelleTRMServiceStub$TrmTestStepInstance' could not be matched to its original source file. It might be a dynamically generated class.
[WARNING] The class 'net.ihe.gazelle.ws.client.GazelleTRMServiceStub$TrmTestStepInstance' could not be matched to its original source file. It might be a dynamically generated class.
[WARNING] The class 'net.ihe.gazelle.ws.client.GazelleTRMServiceStub$TrmTestStepInstance' could not be matched to its original source file. It might be a dynamically generated class.
[WARNING] The class 'net.ihe.gazelle.ws.client.GazelleTRMServiceStub$TrmTestStepInstance' could not be matched to its original source file. It might be a dynamically generated class.
[WARNING] The class 'net.ihe.gazelle.ws.client.GazelleTRMServiceStub$TrmTestStepInstance' could not be matched to its original source file. It might be a dynamically generated class.
[WARNING] The class 'net.ihe.gazelle.ws.client.GazelleTRMServiceStub$TrmTestStepInstance' could not be matched to its original source file. It might be a dynamically generated class.
[WARNING] The class 'net.ihe.gazelle.ws.client.GazelleTRMServiceStub$TrmTestStepInstance' could not be matched to its original source file. It might be a dynamically generated class.
[WARNING] The class 'net.ihe.gazelle.ws.client.GazelleTRMServiceStub$TrmTestStepInstance$Factory' could not be matched to its original source file. It might be a dynamically generated class.
[WARNING] The class 'net.ihe.gazelle.ws.client.GazelleTRMServiceStub$TrmTestStepInstance$Factory' could not be matched to its original source file. It might be a dynamically generated class.
[INFO] Sensor FindBugs Sensor [findbugs] (done) | time=12609ms
[INFO] Sensor SurefireSensor [java]
[INFO] parsing [/home/jenkins/.hudson/jobs/GazelleTRMClient-SNAPSHOT/workspace/target/surefire-reports]
[INFO] Sensor SurefireSensor [java] (done) | time=74ms
[INFO] Sensor JaCoCoSensor [java]
[INFO] Sensor JaCoCoSensor [java] (done) | time=0ms
[INFO] Sensor SonarJavaXmlFileSensor [java]
[INFO] 1 source files to be analyzed
[INFO] Sensor SonarJavaXmlFileSensor [java] (done) | time=293ms
[INFO] Sensor XML Sensor [xml]
[INFO] 1/1 source files have been analyzed
[INFO] Sensor XML Sensor [xml] (done) | time=91ms
[INFO] Sensor Zero Coverage Sensor
[INFO] Sensor Zero Coverage Sensor (done) | time=12ms
[INFO] Sensor CPD Block Indexer
[INFO] Sensor CPD Block Indexer (done) | time=18ms
[INFO] SCM Publisher is disabled
[INFO] Calculating CPD for 1 file
[INFO] CPD calculation finished
[INFO] Analysis report generated in 65ms, dir size=90 KB
[INFO] Analysis reports compressed in 8ms, zip size=23 KB
[INFO] Analysis report uploaded in 75ms
[INFO] ANALYSIS SUCCESSFUL, you can browse https://gazelle.ihe.net/sonar/dashboard/index/net.ihe.gazelle.maven:GazelleTRMClient
[INFO] Note that you will be able to access the updated dashboard once the server has processed the submitted analysis report
[INFO] More about the report processing at https://gazelle.ihe.net/sonar/api/ce/task?id=AWK6FqyNcBDqAaoMr5Xm
[INFO] Task total time: 16.618 s
Started calculate disk usage of build
Finished Calculation of disk usage of build in 0 seconds
Started calculate disk usage of workspace
Finished Calculation of disk usage of workspace in 0 seconds
[INFO] ------------------------------------------------------------------------
[INFO] BUILD SUCCESS
[INFO] ------------------------------------------------------------------------
[INFO] Total time: 39.391 s
[INFO] Finished at: 2018-04-12T15:41:11+02:00
[INFO] Final Memory: 59M/1703M
[INFO] ------------------------------------------------------------------------
Waiting for Jenkins to finish collecting data