FailedConsole Output

Started by user Eric Poiseau
[EnvInject] - Loading node environment variables.
Building in workspace /home/jenkins/.hudson/jobs/LCSDSimulator-SNAPSHOT/workspace
Cleaning local Directory .
Checking out svn+ssh://scm.gforge.inria.fr/svn/gazelle/Maven/simulators/LCSDSimulator/trunk at revision '2016-03-02T11:09:38.367 +0100'
A         LCSDSimulator-ejb
AU        LCSDSimulator-ejb/pom.xml
A         LCSDSimulator-ejb/.classpath
A         LCSDSimulator-ejb/.project
A         LCSDSimulator-ejb/src
A         LCSDSimulator-ejb/src/main
A         LCSDSimulator-ejb/src/main/java
A         LCSDSimulator-ejb/src/main/java/net
A         LCSDSimulator-ejb/src/main/java/net/ihe
A         LCSDSimulator-ejb/src/main/java/net/ihe/gazelle
A         LCSDSimulator-ejb/src/main/java/net/ihe/gazelle/simulator
A         LCSDSimulator-ejb/src/main/java/net/ihe/gazelle/simulator/lcsd
A         LCSDSimulator-ejb/src/main/java/net/ihe/gazelle/simulator/lcsd/DataModel
AU        LCSDSimulator-ejb/src/main/java/net/ihe/gazelle/simulator/lcsd/DataModel/ValueSetPathDataModel.java
A         LCSDSimulator-ejb/src/main/java/net/ihe/gazelle/simulator/lcsd/action
AU        LCSDSimulator-ejb/src/main/java/net/ihe/gazelle/simulator/lcsd/action/LCSDHL7MessageManagerLocal.java
AU        LCSDSimulator-ejb/src/main/java/net/ihe/gazelle/simulator/lcsd/action/CodeSetAdministration.java
AU        LCSDSimulator-ejb/src/main/java/net/ihe/gazelle/simulator/lcsd/action/LCSDCodeSet.java
AU        LCSDSimulator-ejb/src/main/java/net/ihe/gazelle/simulator/lcsd/action/CodeSetConsumerManager.java
AU        LCSDSimulator-ejb/src/main/java/net/ihe/gazelle/simulator/lcsd/action/CodeSetMasterManager.java
AU        LCSDSimulator-ejb/src/main/java/net/ihe/gazelle/simulator/lcsd/action/LCSDHL7MessageManager.java
A         LCSDSimulator-ejb/src/main/java/net/ihe/gazelle/simulator/lcsd/model
AU        LCSDSimulator-ejb/src/main/java/net/ihe/gazelle/simulator/lcsd/model/Language.java
AU        LCSDSimulator-ejb/src/main/java/net/ihe/gazelle/simulator/lcsd/model/MyJDomAttribute.java
AU        LCSDSimulator-ejb/src/main/java/net/ihe/gazelle/simulator/lcsd/model/ControlIdGenerator.java
AU        LCSDSimulator-ejb/src/main/java/net/ihe/gazelle/simulator/lcsd/model/ValueSetPath.java
AU        LCSDSimulator-ejb/src/main/java/net/ihe/gazelle/simulator/lcsd/model/MyCEDataType.java
AU        LCSDSimulator-ejb/src/main/java/net/ihe/gazelle/simulator/lcsd/model/MySpecimen.java
AU        LCSDSimulator-ejb/src/main/java/net/ihe/gazelle/simulator/lcsd/model/ReferenceRange.java
AU        LCSDSimulator-ejb/src/main/java/net/ihe/gazelle/simulator/lcsd/model/Range.java
A         LCSDSimulator-ejb/src/main/java/net/ihe/gazelle/simulator/lcsd/utils
AU        LCSDSimulator-ejb/src/main/java/net/ihe/gazelle/simulator/lcsd/utils/SegmentGenerator.java
AU        LCSDSimulator-ejb/src/main/java/net/ihe/gazelle/simulator/lcsd/utils/LCSDCommon.java
AU        LCSDSimulator-ejb/src/main/java/net/ihe/gazelle/simulator/lcsd/utils/SegmentParser.java
A         LCSDSimulator-ejb/src/main/java/net/ihe/gazelle/simulator/lcsd/Filter
AU        LCSDSimulator-ejb/src/main/java/net/ihe/gazelle/simulator/lcsd/Filter/ValueSetPathFilter1.java
A         LCSDSimulator-ejb/src/main/java/net/ihe/gazelle/simulator/lcsd/server
AU        LCSDSimulator-ejb/src/main/java/net/ihe/gazelle/simulator/lcsd/server/ReceiverApplication.java
AU        LCSDSimulator-ejb/src/main/java/net/ihe/gazelle/simulator/lcsd/server/ServerAction.java
A         LCSDSimulator-ejb/src/main/java/net/ihe/gazelle/simulator/lcsd/converter
AU        LCSDSimulator-ejb/src/main/java/net/ihe/gazelle/simulator/lcsd/converter/ValueSetPathConverter.java
A         LCSDSimulator-ejb/src/main/java/net/ihe/gazelle/simulator/ws
AU        LCSDSimulator-ejb/src/main/java/net/ihe/gazelle/simulator/ws/SimulatorWS.java
A         LCSDSimulator-ejb/src/main/resources
A         LCSDSimulator-ejb/src/main/resources/META-INF
AU        LCSDSimulator-ejb/src/main/resources/META-INF/persistence.xml
AU        LCSDSimulator-ejb/src/main/resources/META-INF/ejb-jar.xml
AU        LCSDSimulator-ejb/src/main/resources/META-INF/standard-jaxws-endpoint-config.xml
AU        LCSDSimulator-ejb/src/main/resources/META-INF/hibernate.cfg.xml
AU        LCSDSimulator-ejb/src/main/resources/seam.properties
AU        LCSDSimulator-ejb/src/main/resources/version.properties
A         LCSDSimulator-ejb/src/main/resources/HL7MessageSamplesForLCSD
AU        LCSDSimulator-ejb/src/main/resources/HL7MessageSamplesForLCSD/TEST_MFN_M08.txt
AU        LCSDSimulator-ejb/src/main/resources/HL7MessageSamplesForLCSD/TEST_MFN_M09.txt
AU        LCSDSimulator-ejb/src/main/resources/HL7MessageSamplesForLCSD/CATALOGUE_CERBA_TEST_VERSION_ 15_FINAL_CORRECTION_READY_FOR_LCSD.txt
AU        LCSDSimulator-ejb/src/main/resources/HL7MessageSamplesForLCSD/Home_description.txt
AU        LCSDSimulator-ejb/src/main/resources/HL7MessageSamplesForLCSD/TEST_MFN_M10.txt
AU        LCSDSimulator-ejb/src/main/resources/HL7MessageSamplesForLCSD/TEST_MFN_M11.txt
A         LCSDSimulator-ejb/src/main/resources/ScriptForConnectathonCodeSetGeneration
A         LCSDSimulator-ejb/src/main/resources/ScriptForConnectathonCodeSetGeneration/Python
A         LCSDSimulator-ejb/src/main/resources/ScriptForConnectathonCodeSetGeneration/Python/SQL_Requests_To_Delete.sql
A         LCSDSimulator-ejb/src/main/resources/ScriptForConnectathonCodeSetGeneration/Python/SQL_Requests_To_Update.sql
A         LCSDSimulator-ejb/src/main/resources/ScriptForConnectathonCodeSetGeneration/Python/TemplateForGeneration
AU        LCSDSimulator-ejb/src/main/resources/ScriptForConnectathonCodeSetGeneration/Python/TemplateForGeneration/BatteryCodes_For_Connectathon_Bern2012.xml
AU        LCSDSimulator-ejb/src/main/resources/ScriptForConnectathonCodeSetGeneration/Python/TemplateForGeneration/NonNumericCodes_For_Connectathon_Bern2012.xml
AU        LCSDSimulator-ejb/src/main/resources/ScriptForConnectathonCodeSetGeneration/Python/TemplateForGeneration/CalculatedCodes_For_Connectathon_Bern2012.xml
AU        LCSDSimulator-ejb/src/main/resources/ScriptForConnectathonCodeSetGeneration/Python/TemplateForGeneration/NumericCodes_For_Connectathon_Bern2012.xml
A         LCSDSimulator-ejb/src/main/resources/ScriptForConnectathonCodeSetGeneration/Python/LCSDPythonScriptToGenerateCodes.py
A         LCSDSimulator-ejb/src/main/resources/ScriptForConnectathonCodeSetGeneration/Python/Generated_Files
AU        LCSDSimulator-ejb/src/main/resources/ScriptForConnectathonCodeSetGeneration/Python/Generated_Files/BatteryCodes_For_Connectathon_Bern2012_EHIP_EGESOFT.xml
AU        LCSDSimulator-ejb/src/main/resources/ScriptForConnectathonCodeSetGeneration/Python/Generated_Files/NonNumericCodes_For_Connectathon_Bern2012_EHIP_EGESOFT.xml
AU        LCSDSimulator-ejb/src/main/resources/ScriptForConnectathonCodeSetGeneration/Python/Generated_Files/BatteryCodes_For_Connectathon_Bern2012_molis_vt_channel_v4h.xml
AU        LCSDSimulator-ejb/src/main/resources/ScriptForConnectathonCodeSetGeneration/Python/Generated_Files/CalculatedCodes_For_Connectathon_Bern2012_MODULAB_IZASA_Systelab.xml
AU        LCSDSimulator-ejb/src/main/resources/ScriptForConnectathonCodeSetGeneration/Python/Generated_Files/NonNumericCodes_For_Connectathon_Bern2012_molis_vt_channel_v4h.xml
AU        LCSDSimulator-ejb/src/main/resources/ScriptForConnectathonCodeSetGeneration/Python/Generated_Files/NumericCodes_For_Connectathon_Bern2012_MODULAB_IZASA_Systelab.xml
AU        LCSDSimulator-ejb/src/main/resources/ScriptForConnectathonCodeSetGeneration/Python/Generated_Files/BatteryCodes_For_Connectathon_Bern2012_MODULAB_IZASA_Systelab.xml
AU        LCSDSimulator-ejb/src/main/resources/ScriptForConnectathonCodeSetGeneration/Python/Generated_Files/CalculatedCodes_For_Connectathon_Bern2012_Glims_8_10_MIPS.xml
AU        LCSDSimulator-ejb/src/main/resources/ScriptForConnectathonCodeSetGeneration/Python/Generated_Files/NumericCodes_For_Connectathon_Bern2012_Glims_8_10_MIPS.xml
AU        LCSDSimulator-ejb/src/main/resources/ScriptForConnectathonCodeSetGeneration/Python/Generated_Files/NonNumericCodes_For_Connectathon_Bern2012_MODULAB_IZASA_Systelab.xml
AU        LCSDSimulator-ejb/src/main/resources/ScriptForConnectathonCodeSetGeneration/Python/Generated_Files/CalculatedCodes_For_Connectathon_Bern2012_EHIP_EGESOFT.xml
AU        LCSDSimulator-ejb/src/main/resources/ScriptForConnectathonCodeSetGeneration/Python/Generated_Files/NumericCodes_For_Connectathon_Bern2012_EHIP_EGESOFT.xml
AU        LCSDSimulator-ejb/src/main/resources/ScriptForConnectathonCodeSetGeneration/Python/Generated_Files/BatteryCodes_For_Connectathon_Bern2012_Glims_8_10_MIPS.xml
AU        LCSDSimulator-ejb/src/main/resources/ScriptForConnectathonCodeSetGeneration/Python/Generated_Files/CalculatedCodes_For_Connectathon_Bern2012_molis_vt_channel_v4h.xml
AU        LCSDSimulator-ejb/src/main/resources/ScriptForConnectathonCodeSetGeneration/Python/Generated_Files/NonNumericCodes_For_Connectathon_Bern2012_Glims_8_10_MIPS.xml
AU        LCSDSimulator-ejb/src/main/resources/ScriptForConnectathonCodeSetGeneration/Python/Generated_Files/NumericCodes_For_Connectathon_Bern2012_molis_vt_channel_v4h.xml
A         LCSDSimulator-ejb/src/main/resources/CodeSetTemplateSamples
AU        LCSDSimulator-ejb/src/main/resources/CodeSetTemplateSamples/BatteryCodes.xml
AU        LCSDSimulator-ejb/src/main/resources/CodeSetTemplateSamples/BatteryCodes1.xml
AU        LCSDSimulator-ejb/src/main/resources/CodeSetTemplateSamples/NonNumericCodes.xml
AU        LCSDSimulator-ejb/src/main/resources/CodeSetTemplateSamples/CalculatedCodes.xml
AU        LCSDSimulator-ejb/src/main/resources/CodeSetTemplateSamples/NumericCodes.xml
A         LCSDSimulator-ejb/src/main/resources/sequenceDiagramSDX
A         LCSDSimulator-ejb/src/main/resources/sequenceDiagramSDX/LAB-51-CSC.sdx
A         LCSDSimulator-ejb/src/main/resources/sequenceDiagramSDX/LAB-51-2.sdx
A         LCSDSimulator-ejb/src/main/resources/sequenceDiagramSDX/LAB-51.sdx
AU        lcsd-simulator-04092014
AU        .project
A         LCSDSimulator-ear
A         LCSDSimulator-ear/.classpath
A         LCSDSimulator-ear/.project
A         LCSDSimulator-ear/src
A         LCSDSimulator-ear/src/main
A         LCSDSimulator-ear/src/main/application
AU        LCSDSimulator-ear/src/main/application/LCSDSimulator-ds.xml
A         LCSDSimulator-ear/src/main/sql
A         LCSDSimulator-ear/src/main/sql/import-prod_update1.sql
A         LCSDSimulator-ear/src/main/sql/initial_import-dev.sql
A         LCSDSimulator-ear/src/main/sql/import-prod_update2.sql
A         LCSDSimulator-ear/src/main/sql/import-prod_update3.sql
A         LCSDSimulator-ear/src/main/sql/import-prod_update4.sql
A         LCSDSimulator-ear/src/main/sql/initial_import-prod.sql
A         LCSDSimulator-ear/src/main/sql/import-dev.sql
AU        LCSDSimulator-ear/pom.xml
AU        pom.xml
A         LCSDSimulator-war
AU        LCSDSimulator-war/.project
A         LCSDSimulator-war/src
A         LCSDSimulator-war/src/main
A         LCSDSimulator-war/src/main/messages
AU        LCSDSimulator-war/src/main/messages/LCSDSimulator.properties
A         LCSDSimulator-war/src/main/resources
A         LCSDSimulator-war/src/main/webapp
AU        LCSDSimulator-war/src/main/webapp/LCSDSimulatorCodeSet.xhtml
A         LCSDSimulator-war/src/main/webapp/WEB-INF
AU        LCSDSimulator-war/src/main/webapp/WEB-INF/web.xml
AU        LCSDSimulator-war/src/main/webapp/WEB-INF/pages.xml
AU        LCSDSimulator-war/src/main/webapp/WEB-INF/components.xml
AU        LCSDSimulator-war/src/main/webapp/codeSetAdministration.xhtml
AU        LCSDSimulator-war/src/main/webapp/sendMessage.xhtml
A         LCSDSimulator-war/src/main/webapp/img
AU        LCSDSimulator-war/src/main/webapp/img/lcsdsequencediagramCSC.png
AU        LCSDSimulator-war/src/main/webapp/img/view_codes_50_50.png
AU        LCSDSimulator-war/src/main/webapp/img/false_50_50.png
AU        LCSDSimulator-war/src/main/webapp/img/lcsdsequencediagramCSM.png
AU        LCSDSimulator-war/src/main/webapp/img/true_50_50.png
AU        LCSDSimulator-war/src/main/webapp/img/underConstruction.gif
AU        LCSDSimulator-war/src/main/webapp/lcsdActionColumn.xhtml
A         LCSDSimulator-war/src/main/webapp/CodeSetsXMLFiles
AU        LCSDSimulator-war/src/main/webapp/CodeSetsXMLFiles/BatteryCodes2.xml
AU        LCSDSimulator-war/src/main/webapp/CodeSetsXMLFiles/NonNumericCodes.xml
AU        LCSDSimulator-war/src/main/webapp/CodeSetsXMLFiles/CalculatedCodes.xml
AU        LCSDSimulator-war/src/main/webapp/CodeSetsXMLFiles/NumericCodes.xml
AU        LCSDSimulator-war/src/main/webapp/CodeSetsXMLFiles/LCSD_XSL.xsl
AU        LCSDSimulator-war/src/main/webapp/CodeSetsXMLFiles/BatteryCodes.xml
AU        LCSDSimulator-war/src/main/webapp/csmSimulator.xhtml
A         LCSDSimulator-war/src/main/webapp/layout
AU        LCSDSimulator-war/src/main/webapp/layout/menu.xhtml
AU        LCSDSimulator-war/src/main/webapp/layout/template.xhtml
AU        LCSDSimulator-war/src/main/webapp/layout/footer.xhtml
A         LCSDSimulator-war/src/main/webapp/home.xhtml.old
AU        LCSDSimulator-war/src/main/webapp/codeSetColumns.xhtml
AU        LCSDSimulator-war/src/main/webapp/cscSimulator.xhtml
AU        LCSDSimulator-war/src/main/webapp/lcsdHL7messages.xhtml
A         LCSDSimulator-war/src/main/crowdin
A         LCSDSimulator-war/src/main/crowdin/sv-SE
A         LCSDSimulator-war/src/main/crowdin/sv-SE/net.ihe.gazelle.simulators.simulator-common-war
AU        LCSDSimulator-war/src/main/crowdin/sv-SE/net.ihe.gazelle.simulators.simulator-common-war/simulator-common-war.properties
A         LCSDSimulator-war/src/main/crowdin/sv-SE/net.ihe.gazelle.simulator.hl7.HL7Common-war
AU        LCSDSimulator-war/src/main/crowdin/sv-SE/net.ihe.gazelle.simulator.hl7.HL7Common-war/HL7Common-war.properties
A         LCSDSimulator-war/src/main/crowdin/sv-SE/net.ihe.gazelle.simulators.LCSDSimulator.LCSDSimulator-war
AU        LCSDSimulator-war/src/main/crowdin/sv-SE/net.ihe.gazelle.simulators.LCSDSimulator.LCSDSimulator-war/LCSDSimulator.properties
A         LCSDSimulator-war/src/main/crowdin/fi
A         LCSDSimulator-war/src/main/crowdin/fi/net.ihe.gazelle.simulators.simulator-common-war
AU        LCSDSimulator-war/src/main/crowdin/fi/net.ihe.gazelle.simulators.simulator-common-war/simulator-common-war.properties
A         LCSDSimulator-war/src/main/crowdin/fi/net.ihe.gazelle.simulator.hl7.HL7Common-war
AU        LCSDSimulator-war/src/main/crowdin/fi/net.ihe.gazelle.simulator.hl7.HL7Common-war/HL7Common-war.properties
A         LCSDSimulator-war/src/main/crowdin/fi/net.ihe.gazelle.simulators.LCSDSimulator.LCSDSimulator-war
AU        LCSDSimulator-war/src/main/crowdin/fi/net.ihe.gazelle.simulators.LCSDSimulator.LCSDSimulator-war/LCSDSimulator.properties
A         LCSDSimulator-war/src/main/crowdin/en
A         LCSDSimulator-war/src/main/crowdin/en/net.ihe.gazelle.simulators.simulator-common-war
AU        LCSDSimulator-war/src/main/crowdin/en/net.ihe.gazelle.simulators.simulator-common-war/simulator-common-war.properties
A         LCSDSimulator-war/src/main/crowdin/en/net.ihe.gazelle.simulator.hl7.HL7Common-war
AU        LCSDSimulator-war/src/main/crowdin/en/net.ihe.gazelle.simulator.hl7.HL7Common-war/HL7Common-war.properties
A         LCSDSimulator-war/src/main/crowdin/en/net.ihe.gazelle.simulators.LCSDSimulator.LCSDSimulator-war
AU        LCSDSimulator-war/src/main/crowdin/en/net.ihe.gazelle.simulators.LCSDSimulator.LCSDSimulator-war/LCSDSimulator.properties
A         LCSDSimulator-war/src/main/crowdin/fr
A         LCSDSimulator-war/src/main/crowdin/fr/net.ihe.gazelle.simulators.simulator-common-war
AU        LCSDSimulator-war/src/main/crowdin/fr/net.ihe.gazelle.simulators.simulator-common-war/simulator-common-war.properties
A         LCSDSimulator-war/src/main/crowdin/fr/net.ihe.gazelle.simulator.hl7.HL7Common-war
AU        LCSDSimulator-war/src/main/crowdin/fr/net.ihe.gazelle.simulator.hl7.HL7Common-war/HL7Common-war.properties
A         LCSDSimulator-war/src/main/crowdin/fr/net.ihe.gazelle.simulators.LCSDSimulator.LCSDSimulator-war
AU        LCSDSimulator-war/src/main/crowdin/fr/net.ihe.gazelle.simulators.LCSDSimulator.LCSDSimulator-war/LCSDSimulator.properties
A         LCSDSimulator-war/src/main/crowdin/de
A         LCSDSimulator-war/src/main/crowdin/de/net.ihe.gazelle.simulators.simulator-common-war
AU        LCSDSimulator-war/src/main/crowdin/de/net.ihe.gazelle.simulators.simulator-common-war/simulator-common-war.properties
A         LCSDSimulator-war/src/main/crowdin/de/net.ihe.gazelle.simulator.hl7.HL7Common-war
AU        LCSDSimulator-war/src/main/crowdin/de/net.ihe.gazelle.simulator.hl7.HL7Common-war/HL7Common-war.properties
A         LCSDSimulator-war/src/main/crowdin/de/net.ihe.gazelle.simulators.LCSDSimulator.LCSDSimulator-war
AU        LCSDSimulator-war/src/main/crowdin/de/net.ihe.gazelle.simulators.LCSDSimulator.LCSDSimulator-war/LCSDSimulator.properties
A         LCSDSimulator-war/src/main/crowdin/ja
A         LCSDSimulator-war/src/main/crowdin/ja/net.ihe.gazelle.simulator.hl7.HL7Common-war
AU        LCSDSimulator-war/src/main/crowdin/ja/net.ihe.gazelle.simulator.hl7.HL7Common-war/HL7Common-war.properties
A         LCSDSimulator-war/src/main/crowdin/ja/net.ihe.gazelle.simulators.LCSDSimulator.LCSDSimulator-war
AU        LCSDSimulator-war/src/main/crowdin/ja/net.ihe.gazelle.simulators.LCSDSimulator.LCSDSimulator-war/LCSDSimulator.properties
A         LCSDSimulator-war/src/main/crowdin/ja/net.ihe.gazelle.simulators.simulator-common-war
AU        LCSDSimulator-war/src/main/crowdin/ja/net.ihe.gazelle.simulators.simulator-common-war/simulator-common-war.properties
AU        LCSDSimulator-war/pom.xml
AU        LCSDSimulator-war/.classpath
 U        .
At revision 50952

Parsing POMs
Downloaded artifact https://gazelle.ihe.net/nexus/content/groups/public/net/ihe/gazelle/simulator/hl7/HL7Common/4.0.2/HL7Common-4.0.2.pom
Downloaded artifact https://gazelle.ihe.net/nexus/content/groups/public/net/ihe/gazelle/simulators/simulator-common/3.0.3/simulator-common-3.0.3.pom
Downloaded artifact https://gazelle.ihe.net/nexus/content/groups/public/net/ihe/gazelle/simulators/simulator-parent/3.0.3/simulator-parent-3.0.3.pom
Established TCP socket on 56431
[workspace] $ /usr/lib/jvm/java-6-oracle//bin/java -Djava.net.preferIPv4Stack=true -Dfile.encoding=UTF8 -cp /home/jenkins/.hudson/plugins/maven-plugin/WEB-INF/lib/maven3-agent-1.7.jar:/home/jenkins/.hudson/tools/hudson.tasks.Maven_MavenInstallation/Maven3/boot/plexus-classworlds-2.4.jar org.jvnet.hudson.maven3.agent.Maven3Main /home/jenkins/.hudson/tools/hudson.tasks.Maven_MavenInstallation/Maven3 /home/jenkins/.hudson/war/WEB-INF/lib/remoting-2.53.2.jar /home/jenkins/.hudson/plugins/maven-plugin/WEB-INF/lib/maven3-interceptor-1.7.jar /home/jenkins/.hudson/plugins/maven-plugin/WEB-INF/lib/maven3-interceptor-commons-1.7.jar 56431
<===[JENKINS REMOTING CAPACITY]===>channel started
ERROR: [JENKINS-18403] JDK 5 not supported to run Maven; retrying with slave Java and setting compile/test properties to point to /usr/lib/jvm/java-6-oracle/
Established TCP socket on 57871
[workspace] $ /usr/lib/jvm/java-7-oracle/jre/bin/java -Djava.net.preferIPv4Stack=true -Dfile.encoding=UTF8 -cp /home/jenkins/.hudson/plugins/maven-plugin/WEB-INF/lib/maven3-agent-1.7.jar:/home/jenkins/.hudson/tools/hudson.tasks.Maven_MavenInstallation/Maven3/boot/plexus-classworlds-2.4.jar org.jvnet.hudson.maven3.agent.Maven3Main /home/jenkins/.hudson/tools/hudson.tasks.Maven_MavenInstallation/Maven3 /home/jenkins/.hudson/war/WEB-INF/lib/remoting-2.53.2.jar /home/jenkins/.hudson/plugins/maven-plugin/WEB-INF/lib/maven3-interceptor-1.7.jar /home/jenkins/.hudson/plugins/maven-plugin/WEB-INF/lib/maven3-interceptor-commons-1.7.jar 57871
<===[JENKINS REMOTING CAPACITY]===>channel started
Executing Maven:  -B -f /home/jenkins/.hudson/jobs/LCSDSimulator-SNAPSHOT/workspace/pom.xml clean install -P development
[INFO] Scanning for projects...
[INFO] ------------------------------------------------------------------------
[INFO] Reactor Build Order:
[INFO] 
[INFO] LCSDSimulator
[INFO] LCSDSimulator - EJB - JAR
[INFO] LCSDSimulator - WAR
[INFO] LCSDSimulator - EAR
[INFO]                                                                         
[INFO] ------------------------------------------------------------------------
[INFO] Building LCSDSimulator 3.0.1-SNAPSHOT
[INFO] ------------------------------------------------------------------------
[INFO] 
[INFO] --- maven-clean-plugin:2.4.1:clean (default-clean) @ LCSDSimulator ---
[INFO] 
[INFO] --- maven-buildmetadata-plugin:1.1.0.IHE.3:provide-buildmetadata (default) @ LCSDSimulator ---
[INFO] Executing: /bin/sh -c cd /home/jenkins/.hudson/jobs/LCSDSimulator-SNAPSHOT/workspace && svn --non-interactive log -v -r '{2016-02-01 10:09:47 +0000}:{2016-03-03 10:09:47 +0000}' svn://scm.gforge.inria.fr/svn/gazelle/Maven/simulators/LCSDSimulator/trunk
[INFO] Working directory: /home/jenkins/.hudson/jobs/LCSDSimulator-SNAPSHOT/workspace
[INFO] Executing: /bin/sh -c cd /home/jenkins/.hudson/jobs/LCSDSimulator-SNAPSHOT/workspace && svn --non-interactive log -v -r '{2016-01-02 10:09:48 +0000}:{2016-03-03 10:09:48 +0000}' svn://scm.gforge.inria.fr/svn/gazelle/Maven/simulators/LCSDSimulator/trunk
[INFO] Working directory: /home/jenkins/.hudson/jobs/LCSDSimulator-SNAPSHOT/workspace
[INFO] Executing: /bin/sh -c cd /home/jenkins/.hudson/jobs/LCSDSimulator-SNAPSHOT/workspace && svn --non-interactive log -v -r '{2015-12-03 10:09:48 +0000}:{2016-03-03 10:09:48 +0000}' svn://scm.gforge.inria.fr/svn/gazelle/Maven/simulators/LCSDSimulator/trunk
[INFO] Working directory: /home/jenkins/.hudson/jobs/LCSDSimulator-SNAPSHOT/workspace
[INFO] Executing: /bin/sh -c cd /home/jenkins/.hudson/jobs/LCSDSimulator-SNAPSHOT/workspace && svn --non-interactive log -v -r '{2015-11-03 10:09:48 +0000}:{2016-03-03 10:09:48 +0000}' svn://scm.gforge.inria.fr/svn/gazelle/Maven/simulators/LCSDSimulator/trunk
[INFO] Working directory: /home/jenkins/.hudson/jobs/LCSDSimulator-SNAPSHOT/workspace
[INFO] Executing: /bin/sh -c cd /home/jenkins/.hudson/jobs/LCSDSimulator-SNAPSHOT/workspace && svn --non-interactive log -v -r '{2015-10-04 10:09:48 +0000}:{2016-03-03 10:09:48 +0000}' svn://scm.gforge.inria.fr/svn/gazelle/Maven/simulators/LCSDSimulator/trunk
[INFO] Working directory: /home/jenkins/.hudson/jobs/LCSDSimulator-SNAPSHOT/workspace
[INFO] Executing: /bin/sh -c cd /home/jenkins/.hudson/jobs/LCSDSimulator-SNAPSHOT/workspace && svn --non-interactive log -v -r '{2015-09-04 10:09:48 +0000}:{2016-03-03 10:09:48 +0000}' svn://scm.gforge.inria.fr/svn/gazelle/Maven/simulators/LCSDSimulator/trunk
[INFO] Working directory: /home/jenkins/.hudson/jobs/LCSDSimulator-SNAPSHOT/workspace
[INFO] Writing properties '/home/jenkins/.hudson/jobs/LCSDSimulator-SNAPSHOT/workspace/target/build.properties'...
[INFO] Writing XML report '/home/jenkins/.hudson/jobs/LCSDSimulator-SNAPSHOT/workspace/target/buildmetadata.xml'...
[INFO] Building zip: /home/jenkins/.hudson/jobs/LCSDSimulator-SNAPSHOT/workspace/target/LCSDSimulator-3.0.1-SNAPSHOT-metadata.zip
[INFO] Installing /home/jenkins/.hudson/jobs/LCSDSimulator-SNAPSHOT/workspace/pom.xml to /home/jenkins/.m2/repository/net/ihe/gazelle/simulators/LCSDSimulator/LCSDSimulator/3.0.1-SNAPSHOT/LCSDSimulator-3.0.1-SNAPSHOT.pom
[INFO] Installing /home/jenkins/.hudson/jobs/LCSDSimulator-SNAPSHOT/workspace/target/LCSDSimulator-3.0.1-SNAPSHOT-metadata.zip to /home/jenkins/.m2/repository/net/ihe/gazelle/simulators/LCSDSimulator/LCSDSimulator/3.0.1-SNAPSHOT/LCSDSimulator-3.0.1-SNAPSHOT-metadata.zip
Started calculate disk usage of build
Finished Calculation of disk usage of build in 0 seconds
Started calculate disk usage of workspace
Finished Calculation of disk usage of workspace in 0 seconds
Downloading: https://gazelle.ihe.net/nexus/content/groups/public/net/ihe/gazelle/simulators/simulator-common-ejb/3.0.3/simulator-common-ejb-3.0.3.pom
Downloaded: https://gazelle.ihe.net/nexus/content/groups/public/net/ihe/gazelle/simulators/simulator-common-ejb/3.0.3/simulator-common-ejb-3.0.3.pom (5 KB at 7.9 KB/sec)
Downloading: https://gazelle.ihe.net/nexus/content/groups/public/net/ihe/gazelle/simulator/hl7/HL7Common-ejb/4.0.2/HL7Common-ejb-4.0.2.pom
Downloaded: https://gazelle.ihe.net/nexus/content/groups/public/net/ihe/gazelle/simulator/hl7/HL7Common-ejb/4.0.2/HL7Common-ejb-4.0.2.pom (3 KB at 6.0 KB/sec)
Downloading: https://gazelle.ihe.net/nexus/content/groups/public/net/ihe/gazelle/simulators/simulator-common-ejb/3.0.3/simulator-common-ejb-3.0.3.jar
Downloading: https://gazelle.ihe.net/nexus/content/groups/public/net/ihe/gazelle/simulator/hl7/HL7Common-ejb/4.0.2/HL7Common-ejb-4.0.2.jar
Downloaded: https://gazelle.ihe.net/nexus/content/groups/public/net/ihe/gazelle/simulators/simulator-common-ejb/3.0.3/simulator-common-ejb-3.0.3.jar (395 KB at 647.2 KB/sec)
Downloaded: https://gazelle.ihe.net/nexus/content/groups/public/net/ihe/gazelle/simulator/hl7/HL7Common-ejb/4.0.2/HL7Common-ejb-4.0.2.jar (126 KB at 208.4 KB/sec)
[INFO] Executing: /bin/sh -c cd /home/jenkins/.hudson/jobs/LCSDSimulator-SNAPSHOT/workspace/LCSDSimulator-ejb && svn --non-interactive log -v -r '{2016-02-01 10:09:51 +0000}:{2016-03-03 10:09:51 +0000}' svn://scm.gforge.inria.fr/svn/gazelle/Maven/simulators/LCSDSimulator/trunk/LCSDSimulator-ejb
[INFO] Working directory: /home/jenkins/.hudson/jobs/LCSDSimulator-SNAPSHOT/workspace/LCSDSimulator-ejb
[INFO] Executing: /bin/sh -c cd /home/jenkins/.hudson/jobs/LCSDSimulator-SNAPSHOT/workspace/LCSDSimulator-ejb && svn --non-interactive log -v -r '{2016-01-02 10:09:51 +0000}:{2016-03-03 10:09:51 +0000}' svn://scm.gforge.inria.fr/svn/gazelle/Maven/simulators/LCSDSimulator/trunk/LCSDSimulator-ejb
[INFO] Working directory: /home/jenkins/.hudson/jobs/LCSDSimulator-SNAPSHOT/workspace/LCSDSimulator-ejb
[INFO] Executing: /bin/sh -c cd /home/jenkins/.hudson/jobs/LCSDSimulator-SNAPSHOT/workspace/LCSDSimulator-ejb && svn --non-interactive log -v -r '{2015-12-03 10:09:51 +0000}:{2016-03-03 10:09:51 +0000}' svn://scm.gforge.inria.fr/svn/gazelle/Maven/simulators/LCSDSimulator/trunk/LCSDSimulator-ejb
[INFO] Working directory: /home/jenkins/.hudson/jobs/LCSDSimulator-SNAPSHOT/workspace/LCSDSimulator-ejb
[INFO] Executing: /bin/sh -c cd /home/jenkins/.hudson/jobs/LCSDSimulator-SNAPSHOT/workspace/LCSDSimulator-ejb && svn --non-interactive log -v -r '{2015-11-03 10:09:52 +0000}:{2016-03-03 10:09:52 +0000}' svn://scm.gforge.inria.fr/svn/gazelle/Maven/simulators/LCSDSimulator/trunk/LCSDSimulator-ejb
[INFO] Working directory: /home/jenkins/.hudson/jobs/LCSDSimulator-SNAPSHOT/workspace/LCSDSimulator-ejb
[INFO] Executing: /bin/sh -c cd /home/jenkins/.hudson/jobs/LCSDSimulator-SNAPSHOT/workspace/LCSDSimulator-ejb && svn --non-interactive log -v -r '{2015-10-04 10:09:52 +0000}:{2016-03-03 10:09:52 +0000}' svn://scm.gforge.inria.fr/svn/gazelle/Maven/simulators/LCSDSimulator/trunk/LCSDSimulator-ejb
[INFO] Working directory: /home/jenkins/.hudson/jobs/LCSDSimulator-SNAPSHOT/workspace/LCSDSimulator-ejb
[INFO] Executing: /bin/sh -c cd /home/jenkins/.hudson/jobs/LCSDSimulator-SNAPSHOT/workspace/LCSDSimulator-ejb && svn --non-interactive log -v -r '{2015-09-04 10:09:52 +0000}:{2016-03-03 10:09:52 +0000}' svn://scm.gforge.inria.fr/svn/gazelle/Maven/simulators/LCSDSimulator/trunk/LCSDSimulator-ejb
[INFO] Working directory: /home/jenkins/.hudson/jobs/LCSDSimulator-SNAPSHOT/workspace/LCSDSimulator-ejb
[INFO] Writing properties '/home/jenkins/.hudson/jobs/LCSDSimulator-SNAPSHOT/workspace/LCSDSimulator-ejb/target/classes/META-INF/build.properties'...
[INFO] Writing XML report '/home/jenkins/.hudson/jobs/LCSDSimulator-SNAPSHOT/workspace/LCSDSimulator-ejb/target/buildmetadata.xml'...
[debug] execute contextualize
[INFO] Using 'UTF-8' encoding to copy filtered resources.
[INFO] Copying 43 resources
[INFO] Compiling 23 source files to /home/jenkins/.hudson/jobs/LCSDSimulator-SNAPSHOT/workspace/LCSDSimulator-ejb/target/classes
[debug] execute contextualize
[INFO] Using 'UTF-8' encoding to copy filtered resources.
[INFO] skip non existing resourceDirectory /home/jenkins/.hudson/jobs/LCSDSimulator-SNAPSHOT/workspace/LCSDSimulator-ejb/src/test/resources
[INFO] No sources to compile
[INFO] No tests to run.
[JENKINS] Recording test results
[INFO] Building EJB LCSDSimulator-ejb-3.0.1-SNAPSHOT with EJB version 3.0
[INFO] Building jar: /home/jenkins/.hudson/jobs/LCSDSimulator-SNAPSHOT/workspace/LCSDSimulator-ejb/target/LCSDSimulator-ejb-3.0.1-SNAPSHOT.jar
[INFO] Installing /home/jenkins/.hudson/jobs/LCSDSimulator-SNAPSHOT/workspace/LCSDSimulator-ejb/target/LCSDSimulator-ejb-3.0.1-SNAPSHOT.jar to /home/jenkins/.m2/repository/net/ihe/gazelle/simulators/LCSDSimulator/LCSDSimulator-ejb/3.0.1-SNAPSHOT/LCSDSimulator-ejb-3.0.1-SNAPSHOT.jar
[INFO] Installing /home/jenkins/.hudson/jobs/LCSDSimulator-SNAPSHOT/workspace/LCSDSimulator-ejb/pom.xml to /home/jenkins/.m2/repository/net/ihe/gazelle/simulators/LCSDSimulator/LCSDSimulator-ejb/3.0.1-SNAPSHOT/LCSDSimulator-ejb-3.0.1-SNAPSHOT.pom
Started calculate disk usage of build
Finished Calculation of disk usage of build in 0 seconds
Started calculate disk usage of workspace
Finished Calculation of disk usage of workspace in 0 seconds
Downloading: https://gazelle.ihe.net/nexus/content/groups/public/net/ihe/gazelle/simulators/simulator-common-war/3.0.3/simulator-common-war-3.0.3.pom
Downloaded: https://gazelle.ihe.net/nexus/content/groups/public/net/ihe/gazelle/simulators/simulator-common-war/3.0.3/simulator-common-war-3.0.3.pom (946 B at 2.2 KB/sec)
Downloading: https://gazelle.ihe.net/nexus/content/groups/public/net/ihe/gazelle/simulator/hl7/HL7Common-war/4.0.2/HL7Common-war-4.0.2.pom
Downloaded: https://gazelle.ihe.net/nexus/content/groups/public/net/ihe/gazelle/simulator/hl7/HL7Common-war/4.0.2/HL7Common-war-4.0.2.pom (786 B at 2.2 KB/sec)
Downloading: https://gazelle.ihe.net/nexus/content/groups/public/net/ihe/gazelle/simulators/simulator-common-war/3.0.3/simulator-common-war-3.0.3.war
Downloading: https://gazelle.ihe.net/nexus/content/groups/public/net/ihe/gazelle/simulator/hl7/HL7Common-war/4.0.2/HL7Common-war-4.0.2.war
Downloaded: https://gazelle.ihe.net/nexus/content/groups/public/net/ihe/gazelle/simulator/hl7/HL7Common-war/4.0.2/HL7Common-war-4.0.2.war (112 KB at 199.3 KB/sec)
Downloaded: https://gazelle.ihe.net/nexus/content/groups/public/net/ihe/gazelle/simulators/simulator-common-war/3.0.3/simulator-common-war-3.0.3.war (237 KB at 387.8 KB/sec)
[INFO] Executing: /bin/sh -c cd /home/jenkins/.hudson/jobs/LCSDSimulator-SNAPSHOT/workspace/LCSDSimulator-war && svn --non-interactive log -v -r '{2016-02-01 10:09:57 +0000}:{2016-03-03 10:09:57 +0000}' svn://scm.gforge.inria.fr/svn/gazelle/Maven/simulators/LCSDSimulator/trunk/LCSDSimulator-war
[INFO] Working directory: /home/jenkins/.hudson/jobs/LCSDSimulator-SNAPSHOT/workspace/LCSDSimulator-war
[INFO] Executing: /bin/sh -c cd /home/jenkins/.hudson/jobs/LCSDSimulator-SNAPSHOT/workspace/LCSDSimulator-war && svn --non-interactive log -v -r '{2016-01-02 10:09:57 +0000}:{2016-03-03 10:09:57 +0000}' svn://scm.gforge.inria.fr/svn/gazelle/Maven/simulators/LCSDSimulator/trunk/LCSDSimulator-war
[INFO] Working directory: /home/jenkins/.hudson/jobs/LCSDSimulator-SNAPSHOT/workspace/LCSDSimulator-war
[INFO] Executing: /bin/sh -c cd /home/jenkins/.hudson/jobs/LCSDSimulator-SNAPSHOT/workspace/LCSDSimulator-war && svn --non-interactive log -v -r '{2015-12-03 10:09:57 +0000}:{2016-03-03 10:09:57 +0000}' svn://scm.gforge.inria.fr/svn/gazelle/Maven/simulators/LCSDSimulator/trunk/LCSDSimulator-war
[INFO] Working directory: /home/jenkins/.hudson/jobs/LCSDSimulator-SNAPSHOT/workspace/LCSDSimulator-war
[INFO] Executing: /bin/sh -c cd /home/jenkins/.hudson/jobs/LCSDSimulator-SNAPSHOT/workspace/LCSDSimulator-war && svn --non-interactive log -v -r '{2015-11-03 10:09:57 +0000}:{2016-03-03 10:09:57 +0000}' svn://scm.gforge.inria.fr/svn/gazelle/Maven/simulators/LCSDSimulator/trunk/LCSDSimulator-war
[INFO] Working directory: /home/jenkins/.hudson/jobs/LCSDSimulator-SNAPSHOT/workspace/LCSDSimulator-war
[INFO] Executing: /bin/sh -c cd /home/jenkins/.hudson/jobs/LCSDSimulator-SNAPSHOT/workspace/LCSDSimulator-war && svn --non-interactive log -v -r '{2015-10-04 10:09:57 +0000}:{2016-03-03 10:09:57 +0000}' svn://scm.gforge.inria.fr/svn/gazelle/Maven/simulators/LCSDSimulator/trunk/LCSDSimulator-war
[INFO] Working directory: /home/jenkins/.hudson/jobs/LCSDSimulator-SNAPSHOT/workspace/LCSDSimulator-war
[INFO] Executing: /bin/sh -c cd /home/jenkins/.hudson/jobs/LCSDSimulator-SNAPSHOT/workspace/LCSDSimulator-war && svn --non-interactive log -v -r '{2015-09-04 10:09:57 +0000}:{2016-03-03 10:09:57 +0000}' svn://scm.gforge.inria.fr/svn/gazelle/Maven/simulators/LCSDSimulator/trunk/LCSDSimulator-war
[INFO] Working directory: /home/jenkins/.hudson/jobs/LCSDSimulator-SNAPSHOT/workspace/LCSDSimulator-war
[INFO] Writing properties '/home/jenkins/.hudson/jobs/LCSDSimulator-SNAPSHOT/workspace/LCSDSimulator-war/target/LCSDSimulator-war-3.0.1-SNAPSHOT/META-INF/build.properties'...
[INFO] Writing XML report '/home/jenkins/.hudson/jobs/LCSDSimulator-SNAPSHOT/workspace/LCSDSimulator-war/target/buildmetadata.xml'...
[INFO] Skipped, using crowdin as messages.mode
[INFO] Using crowdin as messages.mode
[info] Aggregating all message properties from dependencies
[info] Aggregate properties for lang en
[info] Adding /home/jenkins/.hudson/jobs/LCSDSimulator-SNAPSHOT/workspace/LCSDSimulator-war/src/main/crowdin/en/net.ihe.gazelle.simulator.hl7.HL7Common-war/HL7Common-war.properties
[info] Adding /home/jenkins/.hudson/jobs/LCSDSimulator-SNAPSHOT/workspace/LCSDSimulator-war/src/main/crowdin/en/net.ihe.gazelle.simulators.simulator-common-war/simulator-common-war.properties
[info] Adding /home/jenkins/.hudson/jobs/LCSDSimulator-SNAPSHOT/workspace/LCSDSimulator-war/src/main/crowdin/en/net.ihe.gazelle.simulators.LCSDSimulator.LCSDSimulator-war/LCSDSimulator.properties
[info] Aggregate properties for lang sv-SE
[info] Adding /home/jenkins/.hudson/jobs/LCSDSimulator-SNAPSHOT/workspace/LCSDSimulator-war/src/main/crowdin/sv-SE/net.ihe.gazelle.simulator.hl7.HL7Common-war/HL7Common-war.properties
[info] Adding /home/jenkins/.hudson/jobs/LCSDSimulator-SNAPSHOT/workspace/LCSDSimulator-war/src/main/crowdin/sv-SE/net.ihe.gazelle.simulators.simulator-common-war/simulator-common-war.properties
[info] Adding /home/jenkins/.hudson/jobs/LCSDSimulator-SNAPSHOT/workspace/LCSDSimulator-war/src/main/crowdin/sv-SE/net.ihe.gazelle.simulators.LCSDSimulator.LCSDSimulator-war/LCSDSimulator.properties
[info] Aggregate properties for lang fr
[info] Adding /home/jenkins/.hudson/jobs/LCSDSimulator-SNAPSHOT/workspace/LCSDSimulator-war/src/main/crowdin/fr/net.ihe.gazelle.simulator.hl7.HL7Common-war/HL7Common-war.properties
[info] Adding /home/jenkins/.hudson/jobs/LCSDSimulator-SNAPSHOT/workspace/LCSDSimulator-war/src/main/crowdin/fr/net.ihe.gazelle.simulators.simulator-common-war/simulator-common-war.properties
[info] Adding /home/jenkins/.hudson/jobs/LCSDSimulator-SNAPSHOT/workspace/LCSDSimulator-war/src/main/crowdin/fr/net.ihe.gazelle.simulators.LCSDSimulator.LCSDSimulator-war/LCSDSimulator.properties
[info] Aggregate properties for lang fi
[info] Adding /home/jenkins/.hudson/jobs/LCSDSimulator-SNAPSHOT/workspace/LCSDSimulator-war/src/main/crowdin/fi/net.ihe.gazelle.simulator.hl7.HL7Common-war/HL7Common-war.properties
[info] Adding /home/jenkins/.hudson/jobs/LCSDSimulator-SNAPSHOT/workspace/LCSDSimulator-war/src/main/crowdin/fi/net.ihe.gazelle.simulators.simulator-common-war/simulator-common-war.properties
[info] Adding /home/jenkins/.hudson/jobs/LCSDSimulator-SNAPSHOT/workspace/LCSDSimulator-war/src/main/crowdin/fi/net.ihe.gazelle.simulators.LCSDSimulator.LCSDSimulator-war/LCSDSimulator.properties
[info] Aggregate properties for lang ja
[info] Adding /home/jenkins/.hudson/jobs/LCSDSimulator-SNAPSHOT/workspace/LCSDSimulator-war/src/main/crowdin/ja/net.ihe.gazelle.simulator.hl7.HL7Common-war/HL7Common-war.properties
[info] Adding /home/jenkins/.hudson/jobs/LCSDSimulator-SNAPSHOT/workspace/LCSDSimulator-war/src/main/crowdin/ja/net.ihe.gazelle.simulators.simulator-common-war/simulator-common-war.properties
[info] Adding /home/jenkins/.hudson/jobs/LCSDSimulator-SNAPSHOT/workspace/LCSDSimulator-war/src/main/crowdin/ja/net.ihe.gazelle.simulators.LCSDSimulator.LCSDSimulator-war/LCSDSimulator.properties
[info] Aggregate properties for lang de
[info] Adding /home/jenkins/.hudson/jobs/LCSDSimulator-SNAPSHOT/workspace/LCSDSimulator-war/src/main/crowdin/de/net.ihe.gazelle.simulator.hl7.HL7Common-war/HL7Common-war.properties
[info] Adding /home/jenkins/.hudson/jobs/LCSDSimulator-SNAPSHOT/workspace/LCSDSimulator-war/src/main/crowdin/de/net.ihe.gazelle.simulators.simulator-common-war/simulator-common-war.properties
[info] Adding /home/jenkins/.hudson/jobs/LCSDSimulator-SNAPSHOT/workspace/LCSDSimulator-war/src/main/crowdin/de/net.ihe.gazelle.simulators.LCSDSimulator.LCSDSimulator-war/LCSDSimulator.properties
[debug] execute contextualize
[INFO] Using 'UTF-8' encoding to copy filtered resources.
[INFO] Copying 0 resource
[INFO] Copying 6 resources
[INFO] Ignoring ui:param/f:param with name in [id, sectionToReRender, panelId, panelsToReRender, SuffixForID, panel2refresh, required, filterId, filterForm, divIdVar, dataListIdVar, editorIdVar, containerPanelId, varList, varTableId, varColor, tableName, onchange_callback, save_callback, convert_urls, theme_advanced_statusbar_location, theme_advanced_resizing, theme_advanced_toolbar_location, theme_advanced_toolbar_align, theme_advanced_buttons1, theme_advanced_buttons2, position]
[INFO] Names can be added using ignoredParamNames in gazelle-plugins configuration. (see mvn gazelle:help -Ddetail=true -Dgoal=check-xhtml-messages)
[WARNING] Missing translation in sendMessage.xhtml (line:13,col:19) : Send message
[WARNING] Missing translation in cscSimulator.xhtml (line:39,col:73) : img/lcsdsequencediagramCSC.png
[WARNING] Missing translation in csmSimulator.xhtml (line:35,col:33) : Code Set Master Simulator
[WARNING] Missing translation in csmSimulator.xhtml (line:39,col:52) : Code Set Master Simulator
[WARNING] Missing translation in csmSimulator.xhtml (line:55,col:62) : catDiv,codeSetDiv,sendButtonDiv,GUIMessagesInit
[WARNING] Missing translation in csmSimulator.xhtml (line:59,col:33) : LCSD CSM Simulator
[WARNING] Missing translation in menu.xhtml (line:49,col:30) : CSM
[WARNING] Missing translation in menu.xhtml (line:58,col:30) : CSC
[WARNING] Missing translation in menu.xhtml (line:91,col:48) : true
[WARNING] Missing translation in menu.xhtml (line:92,col:55) : false
[WARNING] Missing translation in menu.xhtml (line:93,col:56) : false
[WARNING] Missing translation in menu.xhtml (line:105,col:29) : Administration
[WARNING] Missing translation in menu.xhtml (line:113,col:47) : Configure application preferences
[WARNING] Missing translation in menu.xhtml (line:127,col:43) : HL7 Responders' configuration
[WARNING] Missing translation in menu.xhtml (line:134,col:24) : Statistics
[WARNING] Missing translation in template.xhtml (line:14,col:27) : LCSDSimulator
[WARNING] Missing translation in template.xhtml (line:24,col:61) : PDQPDCSimulator
[WARNING] Missing translation in footer.xhtml (line:23,col:59) : Copyright 2011
[WARNING] Missing translation in footer.xhtml (line:23,col:59) : IHE International
[WARNING] Missing translation in footer.xhtml (line:56,col:50) : IHE - Integrating the Heathcare Enterprise
[WARNING] Missing translation in footer.xhtml (line:57,col:50) : Changing the way healthcare connects
[WARNING] Missing translation in footer.xhtml (line:58,col:44) : www.ihe.net
[WARNING] Missing translation in footer.xhtml (line:64,col:28) : (UTC)
[WARNING] Missing translation in footer.xhtml (line:104,col:50) : IHE - Integrating the Heathcare Enterprise
[WARNING] Missing translation in footer.xhtml (line:105,col:50) : Changing the way healthcare connects
[WARNING] Missing translation in footer.xhtml (line:106,col:44) : www.ihe.net
[WARNING] Missing translation in codeSetAdministration.xhtml (line:33,col:31) : Code Set Administration
[WARNING] Missing translation in codeSetAdministration.xhtml (line:53,col:12) : Add a new Code Set
[WARNING] Missing translation in codeSetAdministration.xhtml (line:134,col:13) : Code Set Edition
[WARNING] Missing translation in codeSetAdministration.xhtml (line:201,col:13) : Code Set
[WARNING] Missing translation in LCSDSimulatorCodeSet.xhtml (line:33,col:39) : Codes set of the LCSD Simulator
[WARNING] Missing translation in LCSDSimulatorCodeSet.xhtml (line:39,col:13) : Code Set
[WARNING] Some translations are missing!
[WARNING] For automatic translation, execute in this module : 
[WARNING] mvn crowdin:pull crowdin:aggregate gazelle:xhtml-messages -DkeyPrefix=net.ihe.gazelle.simulators.LCSDSimulator
[INFO] No sources to compile
[debug] execute contextualize
[INFO] Using 'UTF-8' encoding to copy filtered resources.
[INFO] skip non existing resourceDirectory /home/jenkins/.hudson/jobs/LCSDSimulator-SNAPSHOT/workspace/LCSDSimulator-war/src/test/resources
[INFO] No sources to compile
[INFO] No tests to run.
[JENKINS] Recording test results
[INFO] Packaging webapp
[INFO] Assembling webapp [LCSDSimulator-war] in [/home/jenkins/.hudson/jobs/LCSDSimulator-SNAPSHOT/workspace/LCSDSimulator-war/target/LCSDSimulator-war-3.0.1-SNAPSHOT]
[INFO] Processing war project
[INFO] Copying webapp webResources [/home/jenkins/.hudson/jobs/LCSDSimulator-SNAPSHOT/workspace/LCSDSimulator-war/src/main/webapp] to [/home/jenkins/.hudson/jobs/LCSDSimulator-SNAPSHOT/workspace/LCSDSimulator-war/target/LCSDSimulator-war-3.0.1-SNAPSHOT]
[INFO] Copying webapp resources [/home/jenkins/.hudson/jobs/LCSDSimulator-SNAPSHOT/workspace/LCSDSimulator-war/src/main/webapp]
[INFO] Processing overlay [ id net.ihe.gazelle.simulators:simulator-common-war]
[INFO] Processing overlay [ id net.ihe.gazelle.simulator.hl7:HL7Common-war]
[INFO] Webapp assembled in [164 msecs]
[INFO] Building war: /home/jenkins/.hudson/jobs/LCSDSimulator-SNAPSHOT/workspace/LCSDSimulator-war/target/LCSDSimulator-war-3.0.1-SNAPSHOT.war
[INFO] WEB-INF/web.xml already added, skipping
[INFO] Installing /home/jenkins/.hudson/jobs/LCSDSimulator-SNAPSHOT/workspace/LCSDSimulator-war/target/LCSDSimulator-war-3.0.1-SNAPSHOT.war to /home/jenkins/.m2/repository/net/ihe/gazelle/simulators/LCSDSimulator/LCSDSimulator-war/3.0.1-SNAPSHOT/LCSDSimulator-war-3.0.1-SNAPSHOT.war
[INFO] Installing /home/jenkins/.hudson/jobs/LCSDSimulator-SNAPSHOT/workspace/LCSDSimulator-war/pom.xml to /home/jenkins/.m2/repository/net/ihe/gazelle/simulators/LCSDSimulator/LCSDSimulator-war/3.0.1-SNAPSHOT/LCSDSimulator-war-3.0.1-SNAPSHOT.pom
Started calculate disk usage of build
Finished Calculation of disk usage of build in 0 seconds
Started calculate disk usage of workspace
Finished Calculation of disk usage of workspace in 0 seconds
[INFO] Executing: /bin/sh -c cd /home/jenkins/.hudson/jobs/LCSDSimulator-SNAPSHOT/workspace/LCSDSimulator-ear && svn --non-interactive log -v -r '{2016-02-01 10:09:59 +0000}:{2016-03-03 10:09:59 +0000}' svn://scm.gforge.inria.fr/svn/gazelle/Maven/simulators/LCSDSimulator/trunk/LCSDSimulator-ear
[INFO] Working directory: /home/jenkins/.hudson/jobs/LCSDSimulator-SNAPSHOT/workspace/LCSDSimulator-ear
[INFO] Executing: /bin/sh -c cd /home/jenkins/.hudson/jobs/LCSDSimulator-SNAPSHOT/workspace/LCSDSimulator-ear && svn --non-interactive log -v -r '{2016-01-02 10:09:59 +0000}:{2016-03-03 10:09:59 +0000}' svn://scm.gforge.inria.fr/svn/gazelle/Maven/simulators/LCSDSimulator/trunk/LCSDSimulator-ear
[INFO] Working directory: /home/jenkins/.hudson/jobs/LCSDSimulator-SNAPSHOT/workspace/LCSDSimulator-ear
[INFO] Executing: /bin/sh -c cd /home/jenkins/.hudson/jobs/LCSDSimulator-SNAPSHOT/workspace/LCSDSimulator-ear && svn --non-interactive log -v -r '{2015-12-03 10:09:59 +0000}:{2016-03-03 10:09:59 +0000}' svn://scm.gforge.inria.fr/svn/gazelle/Maven/simulators/LCSDSimulator/trunk/LCSDSimulator-ear
[INFO] Working directory: /home/jenkins/.hudson/jobs/LCSDSimulator-SNAPSHOT/workspace/LCSDSimulator-ear
[INFO] Executing: /bin/sh -c cd /home/jenkins/.hudson/jobs/LCSDSimulator-SNAPSHOT/workspace/LCSDSimulator-ear && svn --non-interactive log -v -r '{2015-11-03 10:09:59 +0000}:{2016-03-03 10:09:59 +0000}' svn://scm.gforge.inria.fr/svn/gazelle/Maven/simulators/LCSDSimulator/trunk/LCSDSimulator-ear
[INFO] Working directory: /home/jenkins/.hudson/jobs/LCSDSimulator-SNAPSHOT/workspace/LCSDSimulator-ear
[INFO] Executing: /bin/sh -c cd /home/jenkins/.hudson/jobs/LCSDSimulator-SNAPSHOT/workspace/LCSDSimulator-ear && svn --non-interactive log -v -r '{2015-10-04 10:10:00 +0000}:{2016-03-03 10:10:00 +0000}' svn://scm.gforge.inria.fr/svn/gazelle/Maven/simulators/LCSDSimulator/trunk/LCSDSimulator-ear
[INFO] Working directory: /home/jenkins/.hudson/jobs/LCSDSimulator-SNAPSHOT/workspace/LCSDSimulator-ear
[INFO] Executing: /bin/sh -c cd /home/jenkins/.hudson/jobs/LCSDSimulator-SNAPSHOT/workspace/LCSDSimulator-ear && svn --non-interactive log -v -r '{2015-09-04 10:10:00 +0000}:{2016-03-03 10:10:00 +0000}' svn://scm.gforge.inria.fr/svn/gazelle/Maven/simulators/LCSDSimulator/trunk/LCSDSimulator-ear
[INFO] Working directory: /home/jenkins/.hudson/jobs/LCSDSimulator-SNAPSHOT/workspace/LCSDSimulator-ear
[INFO] Writing properties '/home/jenkins/.hudson/jobs/LCSDSimulator-SNAPSHOT/workspace/LCSDSimulator-ear/target/LCSDSimulator-ear-3.0.1-SNAPSHOT/META-INF/build.properties'...
[INFO] Writing XML report '/home/jenkins/.hudson/jobs/LCSDSimulator-SNAPSHOT/workspace/LCSDSimulator-ear/target/buildmetadata.xml'...
[INFO] Generating application.xml
[INFO] Generating jboss-app.xml
[debug] execute contextualize
[INFO] Using 'UTF-8' encoding to copy filtered resources.
[INFO] Copying 1 resource
[INFO] Copying 1 resource
[INFO] Copying artifact[war:net.ihe.gazelle.simulators.LCSDSimulator:LCSDSimulator-war:3.0.1-SNAPSHOT] to[LCSDSimulator-war-3.0.1-SNAPSHOT.war]
[INFO] Copying artifact[ejb:org.jboss.seam:jboss-seam:2.2.2.Final] to[jboss-seam-2.2.2.Final.jar]
[INFO] Copying artifact[ejb:net.ihe.gazelle.simulators:simulator-common-ejb:3.0.3] to[simulator-common-ejb.jar]
[INFO] Copying artifact[ejb:net.ihe.gazelle.simulators.LCSDSimulator:LCSDSimulator-ejb:3.0.1-SNAPSHOT] to[LCSDSimulator-ejb.jar]
[INFO] Copying artifact[ejb:net.ihe.gazelle.simulator.hl7:HL7Common-ejb:4.0.2] to[HL7Common-ejb.jar]
[INFO] Copying artifact[jar:org.apache:xmlsec:1.4.2] to[lib/xmlsec-1.4.2.jar]
[INFO] Copying artifact[jar:commons-lang:commons-lang:2.6] to[lib/commons-lang-2.6.jar]
[INFO] Copying artifact[jar:org.picketlink:picketlink-fed-core:1.0.4.final] to[lib/picketlink-fed-core-1.0.4.final.jar]
[INFO] Copying artifact[jar:org.picketlink:picketlink-fed-model:1.0.4.final] to[lib/picketlink-fed-model-1.0.4.final.jar]
[INFO] Copying artifact[jar:org.picketlink:picketlink-xmlsec-model:1.0.4.final] to[lib/picketlink-xmlsec-model-1.0.4.final.jar]
[INFO] Copying artifact[jar:org.jasig.cas:cas-client-core:3.1.10] to[lib/cas-client-core-3.1.10.jar]
[INFO] Copying artifact[jar:org.jboss.resteasy:resteasy-jaxrs:2.0-beta-2] to[lib/resteasy-jaxrs-2.0-beta-2.jar]
[INFO] Copying artifact[jar:org.jboss.resteasy:jaxrs-api:2.0-beta-2] to[lib/jaxrs-api-2.0-beta-2.jar]
[INFO] Copying artifact[jar:org.slf4j:jcl-over-slf4j:1.5.8] to[lib/jcl-over-slf4j-1.5.8.jar]
[INFO] Copying artifact[jar:org.apache.httpcomponents:httpclient:4.0] to[lib/httpclient-4.0.jar]
[INFO] Copying artifact[jar:org.apache.httpcomponents:httpcore:4.0.1] to[lib/httpcore-4.0.1.jar]
[INFO] Copying artifact[jar:net.jcip:jcip-annotations:1.0] to[lib/jcip-annotations-1.0.jar]
[INFO] Copying artifact[jar:org.jboss.resteasy:resteasy-jaxb-provider:2.0-beta-2] to[lib/resteasy-jaxb-provider-2.0-beta-2.jar]
[INFO] Copying artifact[jar:org.scannotation:scannotation:1.0.2] to[lib/scannotation-1.0.2.jar]
[INFO] Copying artifact[jar:commons-httpclient:commons-httpclient:3.1] to[lib/commons-httpclient-3.1.jar]
[INFO] Copying artifact[jar:commons-codec:commons-codec:1.3] to[lib/commons-codec-1.3.jar]
[INFO] Copying artifact[ejb:net.ihe.gazelle.maven:gazelle-seam-tools-jar:2.140] to[gazelle-seam-tools-jar-2.140.jar]
[INFO] Copying artifact[jar:net.ihe.gazelle.maven:gazelle-tools-jar:2.140] to[lib/gazelle-tools-jar-2.140.jar]
[INFO] Copying artifact[jar:net.ihe.gazelle.hql:gazelle-hql:1.54] to[lib/gazelle-hql-1.54.jar]
[INFO] Copying artifact[jar:commons-io:commons-io:2.1] to[lib/commons-io-2.1.jar]
[INFO] Copying artifact[jar:net.sf.ehcache:ehcache-core:2.6.3] to[lib/ehcache-core-2.6.3.jar]
[INFO] Copying artifact[jar:owasp-java-html-sanitizer:owasp-java-html-sanitizer:r113] to[lib/owasp-java-html-sanitizer-r113.jar]
[INFO] Copying artifact[jar:com.google.guava:guava:13.0.1] to[lib/guava-13.0.1.jar]
[INFO] Copying artifact[jar:commons-fileupload:commons-fileupload:1.2.2] to[lib/commons-fileupload-1.2.2.jar]
[INFO] Copying artifact[jar:javax.servlet:jstl:1.0] to[lib/jstl-1.0.jar]
[INFO] Copying artifact[jar:org.apache.poi:poi:3.8] to[lib/poi-3.8.jar]
[INFO] Copying artifact[jar:org.jsoup:jsoup:1.6.3] to[lib/jsoup-1.6.3.jar]
[INFO] Copying artifact[jar:org.richfaces.samples:laguna:3.3.3.Final] to[lib/laguna-3.3.3.Final.jar]
[INFO] Copying artifact[jar:nekohtml:nekohtml:0.9.1] to[lib/nekohtml-0.9.1.jar]
[INFO] Copying artifact[jar:org.kohsuke.metainf-services:metainf-services:1.1] to[lib/metainf-services-1.1.jar]
[INFO] Copying artifact[jar:net.ihe.gazelle.maven:gazelle-hl7-messagestructures:2.3.0] to[lib/gazelle-hl7-messagestructures-2.3.0.jar]
[INFO] Copying artifact[jar:ca.uhn.hapi:hapi-base:2.2] to[lib/hapi-base-2.2.jar]
[INFO] Copying artifact[jar:ca.uhn.hapi:hapi-structures-v23:2.2] to[lib/hapi-structures-v23-2.2.jar]
[INFO] Copying artifact[jar:ca.uhn.hapi:hapi-structures-v231:2.2] to[lib/hapi-structures-v231-2.2.jar]
[INFO] Copying artifact[jar:ca.uhn.hapi:hapi-structures-v24:2.2] to[lib/hapi-structures-v24-2.2.jar]
[INFO] Copying artifact[jar:ca.uhn.hapi:hapi-structures-v251:2.2] to[lib/hapi-structures-v251-2.2.jar]
[INFO] Copying artifact[jar:ca.uhn.hapi:hapi-structures-v26:2.2] to[lib/hapi-structures-v26-2.2.jar]
[INFO] Copying artifact[jar:ca.uhn.hapi:hapi-structures-v25:2.2] to[lib/hapi-structures-v25-2.2.jar]
[INFO] Copying artifact[ejb:net.ihe.gazelle.maven:version:1.0.0] to[version-1.0.0.jar]
[INFO] Copying artifact[jar:org.jboss.seam:jboss-seam-resteasy:2.2.2.Final] to[lib/jboss-seam-resteasy-2.2.2.Final.jar]
[INFO] Copying artifact[jar:org.jboss.resteasy:resteasy-jettison-provider:2.0-beta-2] to[lib/resteasy-jettison-provider-2.0-beta-2.jar]
[INFO] Copying artifact[jar:org.codehaus.jettison:jettison:1.1] to[lib/jettison-1.1.jar]
[INFO] Copying artifact[jar:org.jboss.resteasy:resteasy-atom-provider:2.0-beta-2] to[lib/resteasy-atom-provider-2.0-beta-2.jar]
[INFO] Copying artifact[jar:org.jdom:jdom:1.1] to[lib/jdom-1.1.jar]
[INFO] Copying artifact[jar:c3p0:c3p0:0.9.1.2] to[lib/c3p0-0.9.1.2.jar]
[INFO] Copying artifact[jar:org.hibernate:hibernate-c3p0:3.3.1.GA] to[lib/hibernate-c3p0-3.3.1.GA.jar]
[INFO] Copying artifact[jar:net.ihe.gazelle.modules:gazelle-ws-clients:1.19.0] to[lib/gazelle-ws-clients-1.19.0.jar]
[INFO] Copying artifact[jar:org.apache.axis2:axis2-adb:1.5.4] to[lib/axis2-adb-1.5.4.jar]
[INFO] Copying artifact[jar:org.apache.axis2:axis2-kernel:1.5.4] to[lib/axis2-kernel-1.5.4.jar]
[INFO] Copying artifact[jar:org.apache.ws.commons.axiom:axiom-api:1.2.10] to[lib/axiom-api-1.2.10.jar]
[INFO] Copying artifact[jar:org.apache.ws.commons.axiom:axiom-impl:1.2.10] to[lib/axiom-impl-1.2.10.jar]
[INFO] Copying artifact[jar:org.codehaus.woodstox:wstx-asl:3.2.9] to[lib/wstx-asl-3.2.9.jar]
[INFO] Copying artifact[jar:org.apache.ws.commons.axiom:axiom-dom:1.2.10] to[lib/axiom-dom-1.2.10.jar]
[INFO] Copying artifact[jar:wsdl4j:wsdl4j:1.6.1] to[lib/wsdl4j-1.6.1.jar]
[INFO] Copying artifact[jar:org.apache.ws.commons.schema:XmlSchema:1.4.3] to[lib/XmlSchema-1.4.3.jar]
[INFO] Copying artifact[jar:org.apache.neethi:neethi:2.0.4] to[lib/neethi-2.0.4.jar]
[INFO] Copying artifact[jar:org.apache.woden:woden-api:1.0M8] to[lib/woden-api-1.0M8.jar]
[INFO] Copying artifact[jar:org.apache.ant:ant:1.7.0] to[lib/ant-1.7.0.jar]
[INFO] Copying artifact[jar:org.apache.woden:woden-impl-dom:1.0M8.IHE] to[lib/woden-impl-dom-1.0M8.IHE.jar]
[INFO] Copying artifact[jar:org.apache.axis2:axis2-transport-local:1.5.4] to[lib/axis2-transport-local-1.5.4.jar]
[INFO] Copying artifact[jar:org.apache.axis2:axis2-transport-http:1.5.4] to[lib/axis2-transport-http-1.5.4.jar]
[INFO] Copying artifact[jar:org.apache.ant:ant-launcher:1.7.0] to[lib/ant-launcher-1.7.0.jar]
[INFO] Copying artifact[jar:com.uwyn:jhighlight:1.0] to[lib/jhighlight-1.0.jar]
[INFO] Copying artifact[jar:ca.uhn.hapi:hapi-hl7overhttp:2.2] to[lib/hapi-hl7overhttp-2.2.jar]
[INFO] Copying artifact[jar:org.bouncycastle:bcprov-jdk16:1.46] to[lib/bcprov-jdk16-1.46.jar]
[INFO] Copying artifact[jar:org.bouncycastle:bcmail-jdk16:1.46] to[lib/bcmail-jdk16-1.46.jar]
[INFO] Copying artifact[jar:com.thoughtworks.xstream:xstream:1.3.1] to[lib/xstream-1.3.1.jar]
[INFO] Copying artifact[jar:xpp3:xpp3_min:1.1.3.4.O] to[lib/xpp3_min-1.1.3.4.O.jar]
[INFO] Copying artifact[jar:org.jboss.el:jboss-el:1.0_02.CR5] to[lib/jboss-el-1.0_02.CR5.jar]
[INFO] Copying artifact[jar:org.jboss.seam:jboss-seam-remoting:2.2.2.Final] to[lib/jboss-seam-remoting-2.2.2.Final.jar]
[INFO] Copying artifact[jar:org.jboss.seam:jboss-seam-ui:2.2.2.Final] to[lib/jboss-seam-ui-2.2.2.Final.jar]
[INFO] Copying artifact[jar:commons-beanutils:commons-beanutils:1.7.0] to[lib/commons-beanutils-1.7.0.jar]
[INFO] Copying artifact[jar:org.jboss.seam:jboss-seam-mail:2.2.2.Final] to[lib/jboss-seam-mail-2.2.2.Final.jar]
[INFO] Copying artifact[jar:org.jboss.seam:jboss-seam-debug:2.2.2.Final] to[lib/jboss-seam-debug-2.2.2.Final.jar]
[INFO] Copying artifact[jar:org.jboss.seam:jboss-seam-pdf:2.2.2.Final] to[lib/jboss-seam-pdf-2.2.2.Final.jar]
[INFO] Copying artifact[jar:com.lowagie:itext:2.1.7] to[lib/itext-2.1.7.jar]
[INFO] Copying artifact[jar:com.lowagie:itext-rtf:2.1.2] to[lib/itext-rtf-2.1.2.jar]
[INFO] Copying artifact[jar:org.jboss.seam:jboss-seam-excel:2.2.2.Final] to[lib/jboss-seam-excel-2.2.2.Final.jar]
[INFO] Copying artifact[jar:net.sourceforge.jexcelapi:jxl:2.6.8-seam] to[lib/jxl-2.6.8-seam.jar]
[INFO] Copying artifact[jar:org.jboss.seam:jboss-seam-jul:2.2.2.Final] to[lib/jboss-seam-jul-2.2.2.Final.jar]
[INFO] Copying artifact[jar:org.richfaces.framework:richfaces-impl:3.3.3.3] to[lib/richfaces-impl-3.3.3.3.jar]
[INFO] Copying artifact[jar:commons-digester:commons-digester:1.7] to[lib/commons-digester-1.7.jar]
[INFO] Copying artifact[jar:org.richfaces.framework:richfaces-api:3.3.3.3] to[lib/richfaces-api-3.3.3.3.jar]
[INFO] Copying artifact[jar:org.richfaces.ui:richfaces-ui:3.3.3.3] to[lib/richfaces-ui-3.3.3.3.jar]
[INFO] Copying artifact[jar:com.sun.facelets:jsf-facelets:1.1.15.B1] to[lib/jsf-facelets-1.1.15.B1.jar]
[INFO] Copy ear sources to /home/jenkins/.hudson/jobs/LCSDSimulator-SNAPSHOT/workspace/LCSDSimulator-ear/target/LCSDSimulator-ear-3.0.1-SNAPSHOT
[INFO] Could not find manifest file: /home/jenkins/.hudson/jobs/LCSDSimulator-SNAPSHOT/workspace/LCSDSimulator-ear/target/LCSDSimulator-ear-3.0.1-SNAPSHOT/META-INF/MANIFEST.MF - Generating one
[INFO] Building jar: /home/jenkins/.hudson/jobs/LCSDSimulator-SNAPSHOT/workspace/LCSDSimulator-ear/target/LCSDSimulator.ear
[INFO] Building zip: /home/jenkins/.hudson/jobs/LCSDSimulator-SNAPSHOT/workspace/LCSDSimulator-ear/target/LCSDSimulator-ear-3.0.1-SNAPSHOT-sql.zip
[INFO] Installing /home/jenkins/.hudson/jobs/LCSDSimulator-SNAPSHOT/workspace/LCSDSimulator-ear/target/LCSDSimulator.ear to /home/jenkins/.m2/repository/net/ihe/gazelle/simulators/LCSDSimulator/LCSDSimulator-ear/3.0.1-SNAPSHOT/LCSDSimulator-ear-3.0.1-SNAPSHOT.ear
[INFO] Installing /home/jenkins/.hudson/jobs/LCSDSimulator-SNAPSHOT/workspace/LCSDSimulator-ear/pom.xml to /home/jenkins/.m2/repository/net/ihe/gazelle/simulators/LCSDSimulator/LCSDSimulator-ear/3.0.1-SNAPSHOT/LCSDSimulator-ear-3.0.1-SNAPSHOT.pom
[INFO] Installing /home/jenkins/.hudson/jobs/LCSDSimulator-SNAPSHOT/workspace/LCSDSimulator-ear/target/LCSDSimulator-ear-3.0.1-SNAPSHOT-sql.zip to /home/jenkins/.m2/repository/net/ihe/gazelle/simulators/LCSDSimulator/LCSDSimulator-ear/3.0.1-SNAPSHOT/LCSDSimulator-ear-3.0.1-SNAPSHOT-sql.zip
Started calculate disk usage of build
Finished Calculation of disk usage of build in 0 seconds
Started calculate disk usage of workspace
Finished Calculation of disk usage of workspace in 0 seconds
Waiting for Jenkins to finish collecting data
[JENKINS] Archiving /home/jenkins/.hudson/jobs/LCSDSimulator-SNAPSHOT/workspace/LCSDSimulator-war/pom.xml to net.ihe.gazelle.simulators.LCSDSimulator/LCSDSimulator-war/3.0.1-SNAPSHOT/LCSDSimulator-war-3.0.1-SNAPSHOT.pom
[JENKINS] Archiving /home/jenkins/.hudson/jobs/LCSDSimulator-SNAPSHOT/workspace/LCSDSimulator-war/target/LCSDSimulator-war-3.0.1-SNAPSHOT.war to net.ihe.gazelle.simulators.LCSDSimulator/LCSDSimulator-war/3.0.1-SNAPSHOT/LCSDSimulator-war-3.0.1-SNAPSHOT.war
[JENKINS] Archiving /home/jenkins/.hudson/jobs/LCSDSimulator-SNAPSHOT/workspace/LCSDSimulator-ejb/pom.xml to net.ihe.gazelle.simulators.LCSDSimulator/LCSDSimulator-ejb/3.0.1-SNAPSHOT/LCSDSimulator-ejb-3.0.1-SNAPSHOT.pom
[JENKINS] Archiving /home/jenkins/.hudson/jobs/LCSDSimulator-SNAPSHOT/workspace/LCSDSimulator-ejb/target/LCSDSimulator-ejb-3.0.1-SNAPSHOT.jar to net.ihe.gazelle.simulators.LCSDSimulator/LCSDSimulator-ejb/3.0.1-SNAPSHOT/LCSDSimulator-ejb-3.0.1-SNAPSHOT.jar
[JENKINS] Archiving /home/jenkins/.hudson/jobs/LCSDSimulator-SNAPSHOT/workspace/pom.xml to net.ihe.gazelle.simulators.LCSDSimulator/LCSDSimulator/3.0.1-SNAPSHOT/LCSDSimulator-3.0.1-SNAPSHOT.pom
[JENKINS] Archiving /home/jenkins/.hudson/jobs/LCSDSimulator-SNAPSHOT/workspace/target/LCSDSimulator-3.0.1-SNAPSHOT-metadata.zip to net.ihe.gazelle.simulators.LCSDSimulator/LCSDSimulator/3.0.1-SNAPSHOT/LCSDSimulator-3.0.1-SNAPSHOT-metadata.zip
[JENKINS] Archiving /home/jenkins/.hudson/jobs/LCSDSimulator-SNAPSHOT/workspace/LCSDSimulator-ear/pom.xml to net.ihe.gazelle.simulators.LCSDSimulator/LCSDSimulator-ear/3.0.1-SNAPSHOT/LCSDSimulator-ear-3.0.1-SNAPSHOT.pom
[JENKINS] Archiving /home/jenkins/.hudson/jobs/LCSDSimulator-SNAPSHOT/workspace/LCSDSimulator-ear/target/LCSDSimulator.ear to net.ihe.gazelle.simulators.LCSDSimulator/LCSDSimulator-ear/3.0.1-SNAPSHOT/LCSDSimulator-ear-3.0.1-SNAPSHOT.ear
[JENKINS] Archiving /home/jenkins/.hudson/jobs/LCSDSimulator-SNAPSHOT/workspace/LCSDSimulator-ear/target/LCSDSimulator-ear-3.0.1-SNAPSHOT-sql.zip to net.ihe.gazelle.simulators.LCSDSimulator/LCSDSimulator-ear/3.0.1-SNAPSHOT/LCSDSimulator-ear-3.0.1-SNAPSHOT-sql.zip
[workspace] $ /home/jenkins/.hudson/tools/hudson.tasks.Maven_MavenInstallation/Maven3/bin/mvn -f /home/jenkins/.hudson/jobs/LCSDSimulator-SNAPSHOT/workspace/pom.xml -e -B org.codehaus.mojo:sonar-maven-plugin:2.4:sonar -Dsonar.jdbc.url=jdbc:postgresql://ovh2.ihe-europe.net/sonar ******** ******** -Dsonar.host.url=https://gazelle.ihe.net/sonar ******** ********
[INFO] Error stacktraces are turned on.
[INFO] Scanning for projects...
[INFO] ------------------------------------------------------------------------
[INFO] Reactor Build Order:
[INFO] 
[INFO] LCSDSimulator
[INFO] LCSDSimulator - EJB - JAR
[INFO] LCSDSimulator - WAR
[INFO] LCSDSimulator - EAR
[INFO]                                                                         
[INFO] ------------------------------------------------------------------------
[INFO] Building LCSDSimulator 3.0.1-SNAPSHOT
[INFO] ------------------------------------------------------------------------
[INFO] 
[INFO] --- sonar-maven-plugin:2.4:sonar (default-cli) @ LCSDSimulator ---
[INFO] SonarQube version: 5.2
INFO: Default locale: "en_GB", source code encoding: "UTF-8"
INFO: Work directory: /home/jenkins/.hudson/jobs/LCSDSimulator-SNAPSHOT/workspace/target/sonar
INFO: SonarQube Server 5.2
[INFO] ------------------------------------------------------------------------
[INFO] Reactor Summary:
[INFO] 
[INFO] LCSDSimulator ..................................... FAILURE [1.252s]
[INFO] LCSDSimulator - EJB - JAR ......................... SKIPPED
[INFO] LCSDSimulator - WAR ............................... SKIPPED
[INFO] LCSDSimulator - EAR ............................... SKIPPED
[INFO] ------------------------------------------------------------------------
[INFO] BUILD FAILURE
[INFO] ------------------------------------------------------------------------
[INFO] Total time: 1.796s
[INFO] Finished at: Wed Mar 02 11:10:05 CET 2016
[INFO] Final Memory: 12M/480M
[INFO] ------------------------------------------------------------------------
[ERROR] Failed to execute goal org.codehaus.mojo:sonar-maven-plugin:2.4:sonar (default-cli) on project LCSDSimulator: Execution default-cli of goal org.codehaus.mojo:sonar-maven-plugin:2.4:sonar failed: An API incompatibility was encountered while executing org.codehaus.mojo:sonar-maven-plugin:2.4:sonar: java.lang.UnsupportedClassVersionError: org/sonar/api/utils/SonarException : Unsupported major.minor version 51.0
[ERROR] -----------------------------------------------------
[ERROR] realm =    plugin>org.codehaus.mojo:sonar-maven-plugin:2.4
[ERROR] strategy = org.codehaus.plexus.classworlds.strategy.SelfFirstStrategy
[ERROR] urls[0] = file:/home/jenkins/.m2/repository/org/codehaus/mojo/sonar-maven-plugin/2.4/sonar-maven-plugin-2.4.jar
[ERROR] urls[1] = file:/home/jenkins/.m2/repository/org/apache/maven/shared/maven-dependency-tree/2.1/maven-dependency-tree-2.1.jar
[ERROR] urls[2] = file:/home/jenkins/.m2/repository/backport-util-concurrent/backport-util-concurrent/3.1/backport-util-concurrent-3.1.jar
[ERROR] urls[3] = file:/home/jenkins/.m2/repository/org/codehaus/plexus/plexus-interpolation/1.11/plexus-interpolation-1.11.jar
[ERROR] urls[4] = file:/home/jenkins/.m2/repository/org/codehaus/plexus/plexus-component-annotations/1.5.5/plexus-component-annotations-1.5.5.jar
[ERROR] urls[5] = file:/home/jenkins/.m2/repository/org/eclipse/aether/aether-util/0.9.0.M2/aether-util-0.9.0.M2.jar
[ERROR] urls[6] = file:/home/jenkins/.m2/repository/org/sonatype/plexus/plexus-sec-dispatcher/1.4/plexus-sec-dispatcher-1.4.jar
[ERROR] urls[7] = file:/home/jenkins/.m2/repository/org/codehaus/plexus/plexus-utils/1.5.5/plexus-utils-1.5.5.jar
[ERROR] urls[8] = file:/home/jenkins/.m2/repository/org/sonatype/plexus/plexus-cipher/1.4/plexus-cipher-1.4.jar
[ERROR] urls[9] = file:/home/jenkins/.m2/repository/org/codehaus/sonar/runner/sonar-runner-api/2.4/sonar-runner-api-2.4.jar
[ERROR] urls[10] = file:/home/jenkins/.m2/repository/commons-lang/commons-lang/2.6/commons-lang-2.6.jar
[ERROR] urls[11] = file:/home/jenkins/.m2/repository/com/google/guava/guava/10.0.1/guava-10.0.1.jar
[ERROR] urls[12] = file:/home/jenkins/.m2/repository/com/google/code/findbugs/jsr305/2.0.3/jsr305-2.0.3.jar
[ERROR] Number of foreign imports: 1
[ERROR] import: Entry[import  from realm ClassRealm[maven.api, parent: null]]
[ERROR] 
[ERROR] -----------------------------------------------------
[ERROR] -> [Help 1]
org.apache.maven.lifecycle.LifecycleExecutionException: Failed to execute goal org.codehaus.mojo:sonar-maven-plugin:2.4:sonar (default-cli) on project LCSDSimulator: Execution default-cli of goal org.codehaus.mojo:sonar-maven-plugin:2.4:sonar failed: An API incompatibility was encountered while executing org.codehaus.mojo:sonar-maven-plugin:2.4:sonar: java.lang.UnsupportedClassVersionError: org/sonar/api/utils/SonarException : Unsupported major.minor version 51.0
-----------------------------------------------------
realm =    plugin>org.codehaus.mojo:sonar-maven-plugin:2.4
strategy = org.codehaus.plexus.classworlds.strategy.SelfFirstStrategy
urls[0] = file:/home/jenkins/.m2/repository/org/codehaus/mojo/sonar-maven-plugin/2.4/sonar-maven-plugin-2.4.jar
urls[1] = file:/home/jenkins/.m2/repository/org/apache/maven/shared/maven-dependency-tree/2.1/maven-dependency-tree-2.1.jar
urls[2] = file:/home/jenkins/.m2/repository/backport-util-concurrent/backport-util-concurrent/3.1/backport-util-concurrent-3.1.jar
urls[3] = file:/home/jenkins/.m2/repository/org/codehaus/plexus/plexus-interpolation/1.11/plexus-interpolation-1.11.jar
urls[4] = file:/home/jenkins/.m2/repository/org/codehaus/plexus/plexus-component-annotations/1.5.5/plexus-component-annotations-1.5.5.jar
urls[5] = file:/home/jenkins/.m2/repository/org/eclipse/aether/aether-util/0.9.0.M2/aether-util-0.9.0.M2.jar
urls[6] = file:/home/jenkins/.m2/repository/org/sonatype/plexus/plexus-sec-dispatcher/1.4/plexus-sec-dispatcher-1.4.jar
urls[7] = file:/home/jenkins/.m2/repository/org/codehaus/plexus/plexus-utils/1.5.5/plexus-utils-1.5.5.jar
urls[8] = file:/home/jenkins/.m2/repository/org/sonatype/plexus/plexus-cipher/1.4/plexus-cipher-1.4.jar
urls[9] = file:/home/jenkins/.m2/repository/org/codehaus/sonar/runner/sonar-runner-api/2.4/sonar-runner-api-2.4.jar
urls[10] = file:/home/jenkins/.m2/repository/commons-lang/commons-lang/2.6/commons-lang-2.6.jar
urls[11] = file:/home/jenkins/.m2/repository/com/google/guava/guava/10.0.1/guava-10.0.1.jar
urls[12] = file:/home/jenkins/.m2/repository/com/google/code/findbugs/jsr305/2.0.3/jsr305-2.0.3.jar
Number of foreign imports: 1
import: Entry[import  from realm ClassRealm[maven.api, parent: null]]

-----------------------------------------------------

	at org.apache.maven.lifecycle.internal.MojoExecutor.execute(MojoExecutor.java:225)
	at org.apache.maven.lifecycle.internal.MojoExecutor.execute(MojoExecutor.java:153)
	at org.apache.maven.lifecycle.internal.MojoExecutor.execute(MojoExecutor.java:145)
	at org.apache.maven.lifecycle.internal.LifecycleModuleBuilder.buildProject(LifecycleModuleBuilder.java:84)
	at org.apache.maven.lifecycle.internal.LifecycleModuleBuilder.buildProject(LifecycleModuleBuilder.java:59)
	at org.apache.maven.lifecycle.internal.LifecycleStarter.singleThreadedBuild(LifecycleStarter.java:183)
	at org.apache.maven.lifecycle.internal.LifecycleStarter.execute(LifecycleStarter.java:161)
	at org.apache.maven.DefaultMaven.doExecute(DefaultMaven.java:320)
	at org.apache.maven.DefaultMaven.execute(DefaultMaven.java:156)
	at org.apache.maven.cli.MavenCli.execute(MavenCli.java:537)
	at org.apache.maven.cli.MavenCli.doMain(MavenCli.java:196)
	at org.apache.maven.cli.MavenCli.main(MavenCli.java:141)
	at sun.reflect.NativeMethodAccessorImpl.invoke0(Native Method)
	at sun.reflect.NativeMethodAccessorImpl.invoke(NativeMethodAccessorImpl.java:39)
	at sun.reflect.DelegatingMethodAccessorImpl.invoke(DelegatingMethodAccessorImpl.java:25)
	at java.lang.reflect.Method.invoke(Method.java:597)
	at org.codehaus.plexus.classworlds.launcher.Launcher.launchEnhanced(Launcher.java:290)
	at org.codehaus.plexus.classworlds.launcher.Launcher.launch(Launcher.java:230)
	at org.codehaus.plexus.classworlds.launcher.Launcher.mainWithExitCode(Launcher.java:409)
	at org.codehaus.plexus.classworlds.launcher.Launcher.main(Launcher.java:352)
Caused by: org.apache.maven.plugin.PluginExecutionException: Execution default-cli of goal org.codehaus.mojo:sonar-maven-plugin:2.4:sonar failed: An API incompatibility was encountered while executing org.codehaus.mojo:sonar-maven-plugin:2.4:sonar: java.lang.UnsupportedClassVersionError: org/sonar/api/utils/SonarException : Unsupported major.minor version 51.0
-----------------------------------------------------
realm =    plugin>org.codehaus.mojo:sonar-maven-plugin:2.4
strategy = org.codehaus.plexus.classworlds.strategy.SelfFirstStrategy
urls[0] = file:/home/jenkins/.m2/repository/org/codehaus/mojo/sonar-maven-plugin/2.4/sonar-maven-plugin-2.4.jar
urls[1] = file:/home/jenkins/.m2/repository/org/apache/maven/shared/maven-dependency-tree/2.1/maven-dependency-tree-2.1.jar
urls[2] = file:/home/jenkins/.m2/repository/backport-util-concurrent/backport-util-concurrent/3.1/backport-util-concurrent-3.1.jar
urls[3] = file:/home/jenkins/.m2/repository/org/codehaus/plexus/plexus-interpolation/1.11/plexus-interpolation-1.11.jar
urls[4] = file:/home/jenkins/.m2/repository/org/codehaus/plexus/plexus-component-annotations/1.5.5/plexus-component-annotations-1.5.5.jar
urls[5] = file:/home/jenkins/.m2/repository/org/eclipse/aether/aether-util/0.9.0.M2/aether-util-0.9.0.M2.jar
urls[6] = file:/home/jenkins/.m2/repository/org/sonatype/plexus/plexus-sec-dispatcher/1.4/plexus-sec-dispatcher-1.4.jar
urls[7] = file:/home/jenkins/.m2/repository/org/codehaus/plexus/plexus-utils/1.5.5/plexus-utils-1.5.5.jar
urls[8] = file:/home/jenkins/.m2/repository/org/sonatype/plexus/plexus-cipher/1.4/plexus-cipher-1.4.jar
urls[9] = file:/home/jenkins/.m2/repository/org/codehaus/sonar/runner/sonar-runner-api/2.4/sonar-runner-api-2.4.jar
urls[10] = file:/home/jenkins/.m2/repository/commons-lang/commons-lang/2.6/commons-lang-2.6.jar
urls[11] = file:/home/jenkins/.m2/repository/com/google/guava/guava/10.0.1/guava-10.0.1.jar
urls[12] = file:/home/jenkins/.m2/repository/com/google/code/findbugs/jsr305/2.0.3/jsr305-2.0.3.jar
Number of foreign imports: 1
import: Entry[import  from realm ClassRealm[maven.api, parent: null]]

-----------------------------------------------------

	at org.apache.maven.plugin.DefaultBuildPluginManager.executeMojo(DefaultBuildPluginManager.java:139)
	at org.apache.maven.lifecycle.internal.MojoExecutor.execute(MojoExecutor.java:209)
	... 19 more
Caused by: org.apache.maven.plugin.PluginContainerException: An API incompatibility was encountered while executing org.codehaus.mojo:sonar-maven-plugin:2.4:sonar: java.lang.UnsupportedClassVersionError: org/sonar/api/utils/SonarException : Unsupported major.minor version 51.0
-----------------------------------------------------
realm =    plugin>org.codehaus.mojo:sonar-maven-plugin:2.4
strategy = org.codehaus.plexus.classworlds.strategy.SelfFirstStrategy
urls[0] = file:/home/jenkins/.m2/repository/org/codehaus/mojo/sonar-maven-plugin/2.4/sonar-maven-plugin-2.4.jar
urls[1] = file:/home/jenkins/.m2/repository/org/apache/maven/shared/maven-dependency-tree/2.1/maven-dependency-tree-2.1.jar
urls[2] = file:/home/jenkins/.m2/repository/backport-util-concurrent/backport-util-concurrent/3.1/backport-util-concurrent-3.1.jar
urls[3] = file:/home/jenkins/.m2/repository/org/codehaus/plexus/plexus-interpolation/1.11/plexus-interpolation-1.11.jar
urls[4] = file:/home/jenkins/.m2/repository/org/codehaus/plexus/plexus-component-annotations/1.5.5/plexus-component-annotations-1.5.5.jar
urls[5] = file:/home/jenkins/.m2/repository/org/eclipse/aether/aether-util/0.9.0.M2/aether-util-0.9.0.M2.jar
urls[6] = file:/home/jenkins/.m2/repository/org/sonatype/plexus/plexus-sec-dispatcher/1.4/plexus-sec-dispatcher-1.4.jar
urls[7] = file:/home/jenkins/.m2/repository/org/codehaus/plexus/plexus-utils/1.5.5/plexus-utils-1.5.5.jar
urls[8] = file:/home/jenkins/.m2/repository/org/sonatype/plexus/plexus-cipher/1.4/plexus-cipher-1.4.jar
urls[9] = file:/home/jenkins/.m2/repository/org/codehaus/sonar/runner/sonar-runner-api/2.4/sonar-runner-api-2.4.jar
urls[10] = file:/home/jenkins/.m2/repository/commons-lang/commons-lang/2.6/commons-lang-2.6.jar
urls[11] = file:/home/jenkins/.m2/repository/com/google/guava/guava/10.0.1/guava-10.0.1.jar
urls[12] = file:/home/jenkins/.m2/repository/com/google/code/findbugs/jsr305/2.0.3/jsr305-2.0.3.jar
Number of foreign imports: 1
import: Entry[import  from realm ClassRealm[maven.api, parent: null]]

-----------------------------------------------------

	at org.apache.maven.plugin.DefaultBuildPluginManager.executeMojo(DefaultBuildPluginManager.java:137)
	... 20 more
Caused by: java.lang.UnsupportedClassVersionError: org/sonar/api/utils/SonarException : Unsupported major.minor version 51.0
	at java.lang.ClassLoader.defineClass1(Native Method)
	at java.lang.ClassLoader.defineClassCond(ClassLoader.java:631)
	at java.lang.ClassLoader.defineClass(ClassLoader.java:615)
	at java.security.SecureClassLoader.defineClass(SecureClassLoader.java:141)
	at java.net.URLClassLoader.defineClass(URLClassLoader.java:283)
	at java.net.URLClassLoader.access$000(URLClassLoader.java:58)
	at java.net.URLClassLoader$1.run(URLClassLoader.java:197)
	at java.security.AccessController.doPrivileged(Native Method)
	at java.net.URLClassLoader.findClass(URLClassLoader.java:190)
	at org.sonar.runner.impl.IsolatedClassloader.loadClass(IsolatedClassloader.java:94)
	at java.lang.ClassLoader.loadClass(ClassLoader.java:247)
	at java.lang.Class.getDeclaredMethods0(Native Method)
	at java.lang.Class.privateGetDeclaredMethods(Class.java:2436)
	at java.lang.Class.getMethod0(Class.java:2679)
	at java.lang.Class.getMethod(Class.java:1605)
	at org.sonar.runner.impl.BatchLauncher$1.delegateExecution(BatchLauncher.java:85)
	at org.sonar.runner.impl.BatchLauncher$1.run(BatchLauncher.java:75)
	at java.security.AccessController.doPrivileged(Native Method)
	at org.sonar.runner.impl.BatchLauncher.doExecute(BatchLauncher.java:69)
	at org.sonar.runner.impl.BatchLauncher.execute(BatchLauncher.java:50)
	at org.sonar.runner.api.EmbeddedRunner.doExecute(EmbeddedRunner.java:102)
	at org.sonar.runner.api.Runner.execute(Runner.java:100)
	at org.codehaus.mojo.sonar.bootstrap.RunnerBootstraper.execute(RunnerBootstraper.java:131)
	at org.codehaus.mojo.sonar.SonarMojo.execute(SonarMojo.java:136)
	at org.apache.maven.plugin.DefaultBuildPluginManager.executeMojo(DefaultBuildPluginManager.java:101)
	... 20 more
[ERROR] 
[ERROR] Re-run Maven using the -X switch to enable full debug logging.
[ERROR] 
[ERROR] For more information about the errors and possible solutions, please read the following articles:
[ERROR] [Help 1] http://cwiki.apache.org/confluence/display/MAVEN/PluginContainerException
SonarQube analysis completed: FAILURE
Build step 'SonarQube' changed build result to FAILURE
Build step 'SonarQube' marked build as failure
Started calculate disk usage of build
Finished Calculation of disk usage of build in 0 seconds
Started calculate disk usage of workspace
Finished Calculation of disk usage of workspace in 0 seconds
Sending e-mails to: abderrazek.boufahja@ihe-europe.net anne-gaelle.berge@ihe-europe.net eric.poiseau@inria.fr guillaume.thomazon@ihe-europe.net jean-francois.labbe@ihe-europe.net
Finished: FAILURE