FailedConsole Output

Started by user Guillaume T
[EnvInject] - Loading node environment variables.
Building on master in workspace /home/jenkins/.hudson/jobs/Picketlink-sts/workspace
Updating https://scm.gforge.inria.fr/authscm/poiseau/svn/gazelle/Maven/picketlink-sts/trunk at revision '2017-02-14T17:13:06.821 +0100'
A         ws-trust/picketlink-sts/gazelle-sts-soapui-project.xml
At revision 56002

Parsing POMs
Established TCP socket on 42591
[workspace] $ /usr/lib/jvm/java-8-oracle//bin/java -Djava.net.preferIPv4Stack=true -Dfile.encoding=UTF8 -Xmx4096m -XX:MaxPermSize=1024m -cp /home/jenkins/.hudson/plugins/maven-plugin/WEB-INF/lib/maven33-agent-1.8.1.jar:/home/jenkins/.hudson/tools/hudson.tasks.Maven_MavenInstallation/Maven3/boot/plexus-classworlds-2.5.2.jar:/home/jenkins/.hudson/tools/hudson.tasks.Maven_MavenInstallation/Maven3/conf/logging jenkins.maven3.agent.Maven33Main /home/jenkins/.hudson/tools/hudson.tasks.Maven_MavenInstallation/Maven3 /home/jenkins/.hudson/war/WEB-INF/lib/remoting-3.4.1.jar /home/jenkins/.hudson/plugins/maven-plugin/WEB-INF/lib/maven33-interceptor-1.8.1.jar /home/jenkins/.hudson/plugins/maven-plugin/WEB-INF/lib/maven3-interceptor-commons-1.8.1.jar 42591
Java HotSpot(TM) 64-Bit Server VM warning: ignoring option MaxPermSize=1024m; support was removed in 8.0
<===[JENKINS REMOTING CAPACITY]===>channel started
Executing Maven:  -B -f /home/jenkins/.hudson/jobs/Picketlink-sts/workspace/pom.xml -Dbinding=jboss -Dbinding-version=as7 -pl ws-trust/picketlink-sts clean install -U
[INFO] Scanning for projects...
[BFA] Scanning build for known causes...
[BFA] No failure causes found
[BFA] Done. 0s
Started calculate disk usage of build
Finished Calculation of disk usage of build in 0 seconds
Started calculate disk usage of workspace
Finished Calculation of disk usage of workspace in 0 seconds
[BFA] Scanning build for known causes...
[BFA] No failure causes found
[BFA] Done. 0s
Started calculate disk usage of build
Finished Calculation of disk usage of build in 0 seconds
Started calculate disk usage of workspace
Finished Calculation of disk usage of workspace in 0 seconds
[BFA] Scanning build for known causes...
[BFA] No failure causes found
[BFA] Done. 0s
Started calculate disk usage of build
Finished Calculation of disk usage of build in 0 seconds
Started calculate disk usage of workspace
Finished Calculation of disk usage of workspace in 0 seconds
[BFA] Scanning build for known causes...
[BFA] No failure causes found
[BFA] Done. 0s
Started calculate disk usage of build
Finished Calculation of disk usage of build in 0 seconds
Started calculate disk usage of workspace
Finished Calculation of disk usage of workspace in 0 seconds
[BFA] Scanning build for known causes...
[BFA] No failure causes found
[BFA] Done. 0s
Started calculate disk usage of build
Finished Calculation of disk usage of build in 0 seconds
Started calculate disk usage of workspace
Finished Calculation of disk usage of workspace in 0 seconds
[BFA] Scanning build for known causes...
[BFA] No failure causes found
[BFA] Done. 0s
Started calculate disk usage of build
Finished Calculation of disk usage of build in 0 seconds
Started calculate disk usage of workspace
Finished Calculation of disk usage of workspace in 0 seconds
[BFA] Scanning build for known causes...
[BFA] No failure causes found
[BFA] Done. 0s
Started calculate disk usage of build
Finished Calculation of disk usage of build in 0 seconds
Started calculate disk usage of workspace
Finished Calculation of disk usage of workspace in 0 seconds
[BFA] Scanning build for known causes...
[BFA] No failure causes found
[BFA] Done. 0s
Started calculate disk usage of build
Finished Calculation of disk usage of build in 0 seconds
Started calculate disk usage of workspace
Finished Calculation of disk usage of workspace in 0 seconds
[BFA] Scanning build for known causes...
[BFA] No failure causes found
[BFA] Done. 0s
Started calculate disk usage of build
Finished Calculation of disk usage of build in 0 seconds
Started calculate disk usage of workspace
Finished Calculation of disk usage of workspace in 0 seconds
[BFA] Scanning build for known causes...
[BFA] No failure causes found
[BFA] Done. 0s
Started calculate disk usage of build
Finished Calculation of disk usage of build in 0 seconds
Started calculate disk usage of workspace
Finished Calculation of disk usage of workspace in 0 seconds
[BFA] Scanning build for known causes...
[BFA] No failure causes found
[BFA] Done. 0s
Started calculate disk usage of build
Finished Calculation of disk usage of build in 0 seconds
Started calculate disk usage of workspace
Finished Calculation of disk usage of workspace in 0 seconds
[BFA] Scanning build for known causes...
[BFA] No failure causes found
[BFA] Done. 0s
Started calculate disk usage of build
Finished Calculation of disk usage of build in 0 seconds
Started calculate disk usage of workspace
Finished Calculation of disk usage of workspace in 0 seconds
[BFA] Scanning build for known causes...
[BFA] No failure causes found
[BFA] Done. 0s
Started calculate disk usage of build
Finished Calculation of disk usage of build in 0 seconds
Started calculate disk usage of workspace
Finished Calculation of disk usage of workspace in 0 seconds
[BFA] Scanning build for known causes...
[BFA] No failure causes found
[BFA] Done. 0s
Started calculate disk usage of build
Finished Calculation of disk usage of build in 0 seconds
Started calculate disk usage of workspace
Finished Calculation of disk usage of workspace in 0 seconds
[BFA] Scanning build for known causes...
[BFA] No failure causes found
[BFA] Done. 0s
Started calculate disk usage of build
Finished Calculation of disk usage of build in 0 seconds
Started calculate disk usage of workspace
Finished Calculation of disk usage of workspace in 0 seconds
[BFA] Scanning build for known causes...
[BFA] No failure causes found
[BFA] Done. 0s
Started calculate disk usage of build
Finished Calculation of disk usage of build in 0 seconds
Started calculate disk usage of workspace
Finished Calculation of disk usage of workspace in 0 seconds
[BFA] Scanning build for known causes...
[BFA] No failure causes found
[BFA] Done. 0s
Started calculate disk usage of build
Finished Calculation of disk usage of build in 0 seconds
Started calculate disk usage of workspace
Finished Calculation of disk usage of workspace in 0 seconds
[INFO]                                                                         
[INFO] ------------------------------------------------------------------------
[INFO] Building PicketLink Federation: WS-Trust Security Token Service 2.1.8.Final
[INFO] ------------------------------------------------------------------------
[INFO] Downloading: https://gazelle.ihe.net/nexus/content/groups/public/org/apache/maven/plugins/maven-compiler-plugin/2.3.1/maven-compiler-plugin-2.3.1.pom
[INFO] Downloaded: https://gazelle.ihe.net/nexus/content/groups/public/org/apache/maven/plugins/maven-compiler-plugin/2.3.1/maven-compiler-plugin-2.3.1.pom (6 KB at 4.1 KB/sec)
[INFO] Downloading: https://gazelle.ihe.net/nexus/content/groups/public/org/apache/maven/plugins/maven-compiler-plugin/2.3.1/maven-compiler-plugin-2.3.1.jar
[INFO] Downloaded: https://gazelle.ihe.net/nexus/content/groups/public/org/apache/maven/plugins/maven-compiler-plugin/2.3.1/maven-compiler-plugin-2.3.1.jar (30 KB at 22.2 KB/sec)
[INFO] Downloading: https://gazelle.ihe.net/nexus/content/groups/public/org/picketlink/picketlink-federation/2.7.0.Final/picketlink-federation-2.7.0.Final.pom
[INFO] Downloaded: https://gazelle.ihe.net/nexus/content/groups/public/org/picketlink/picketlink-federation/2.7.0.Final/picketlink-federation-2.7.0.Final.pom (5 KB at 4.6 KB/sec)
[INFO] Downloading: https://gazelle.ihe.net/nexus/content/groups/public/org/picketlink/picketlink-parent/2.7.0.Final/picketlink-parent-2.7.0.Final.pom
[INFO] Downloaded: https://gazelle.ihe.net/nexus/content/groups/public/org/picketlink/picketlink-parent/2.7.0.Final/picketlink-parent-2.7.0.Final.pom (17 KB at 29.3 KB/sec)
[INFO] Downloading: https://gazelle.ihe.net/nexus/content/groups/public/org/jboss/spec/jboss-javaee-6.0/2.0.0.Final/jboss-javaee-6.0-2.0.0.Final.pom
[INFO] Downloaded: https://gazelle.ihe.net/nexus/content/groups/public/org/jboss/spec/jboss-javaee-6.0/2.0.0.Final/jboss-javaee-6.0-2.0.0.Final.pom (7 KB at 102.8 KB/sec)
[INFO] Downloading: https://gazelle.ihe.net/nexus/content/groups/public/org/jboss/spec/jboss-javaee6-specs-bom/2.0.0.Final/jboss-javaee6-specs-bom-2.0.0.Final.pom
[INFO] Downloaded: https://gazelle.ihe.net/nexus/content/groups/public/org/jboss/spec/jboss-javaee6-specs-bom/2.0.0.Final/jboss-javaee6-specs-bom-2.0.0.Final.pom (9 KB at 152.2 KB/sec)
[INFO] Downloading: https://gazelle.ihe.net/nexus/content/groups/public/org/drools/drools-bom/6.0.0.CR4/drools-bom-6.0.0.CR4.pom
[INFO] Downloaded: https://gazelle.ihe.net/nexus/content/groups/public/org/drools/drools-bom/6.0.0.CR4/drools-bom-6.0.0.CR4.pom (35 KB at 479.5 KB/sec)
[INFO] Downloading: https://gazelle.ihe.net/nexus/content/groups/public/org/kie/kie-parent-metadata/6.0.0.CR4/kie-parent-metadata-6.0.0.CR4.pom
[INFO] Downloaded: https://gazelle.ihe.net/nexus/content/groups/public/org/kie/kie-parent-metadata/6.0.0.CR4/kie-parent-metadata-6.0.0.CR4.pom (28 KB at 386.0 KB/sec)
[INFO] Downloading: https://gazelle.ihe.net/nexus/content/groups/public/org/kie/kie-bom/6.0.0.CR4/kie-bom-6.0.0.CR4.pom
[INFO] Downloaded: https://gazelle.ihe.net/nexus/content/groups/public/org/kie/kie-bom/6.0.0.CR4/kie-bom-6.0.0.CR4.pom (25 KB at 432.4 KB/sec)
[INFO] Downloading: https://gazelle.ihe.net/nexus/content/groups/public/org/picketlink/picketlink-common/2.7.0.Final/picketlink-common-2.7.0.Final.pom
[INFO] Downloaded: https://gazelle.ihe.net/nexus/content/groups/public/org/picketlink/picketlink-common/2.7.0.Final/picketlink-common-2.7.0.Final.pom (2 KB at 1.6 KB/sec)
[INFO] Downloading: https://gazelle.ihe.net/nexus/content/groups/public/org/picketlink/picketlink-config/2.7.0.Final/picketlink-config-2.7.0.Final.pom
[INFO] Downloaded: https://gazelle.ihe.net/nexus/content/groups/public/org/picketlink/picketlink-config/2.7.0.Final/picketlink-config-2.7.0.Final.pom (2 KB at 2.2 KB/sec)
[INFO] Downloading: https://gazelle.ihe.net/nexus/content/groups/public/org/picketlink/picketlink-idm-impl/2.7.0.Final/picketlink-idm-impl-2.7.0.Final.pom
[INFO] Downloaded: https://gazelle.ihe.net/nexus/content/groups/public/org/picketlink/picketlink-idm-impl/2.7.0.Final/picketlink-idm-impl-2.7.0.Final.pom (2 KB at 1.8 KB/sec)
[INFO] Downloading: https://gazelle.ihe.net/nexus/content/groups/public/org/picketlink/picketlink-idm-parent/2.7.0.Final/picketlink-idm-parent-2.7.0.Final.pom
[INFO] Downloaded: https://gazelle.ihe.net/nexus/content/groups/public/org/picketlink/picketlink-idm-parent/2.7.0.Final/picketlink-idm-parent-2.7.0.Final.pom (2 KB at 1.7 KB/sec)
[INFO] Downloading: https://gazelle.ihe.net/nexus/content/groups/public/org/picketlink/picketlink-idm-api/2.7.0.Final/picketlink-idm-api-2.7.0.Final.pom
[INFO] Downloaded: https://gazelle.ihe.net/nexus/content/groups/public/org/picketlink/picketlink-idm-api/2.7.0.Final/picketlink-idm-api-2.7.0.Final.pom (743 B at 1.3 KB/sec)
[INFO] Downloading: https://gazelle.ihe.net/nexus/content/groups/public/org/apache/santuario/xmlsec/1.5.1/xmlsec-1.5.1.pom
[INFO] Downloaded: https://gazelle.ihe.net/nexus/content/groups/public/org/apache/santuario/xmlsec/1.5.1/xmlsec-1.5.1.pom (15 KB at 25.1 KB/sec)
[INFO] Downloading: https://gazelle.ihe.net/nexus/content/groups/public/org/jboss/security/jbossxacml/2.0.8.Final/jbossxacml-2.0.8.Final.pom
[INFO] Downloaded: https://gazelle.ihe.net/nexus/content/groups/public/org/jboss/security/jbossxacml/2.0.8.Final/jbossxacml-2.0.8.Final.pom (3 KB at 1.4 KB/sec)
[INFO] Downloading: https://gazelle.ihe.net/nexus/content/groups/public/org/jboss/security/jboss-xacml-project/2.0.8.Final/jboss-xacml-project-2.0.8.Final.pom
[INFO] Downloaded: https://gazelle.ihe.net/nexus/content/groups/public/org/jboss/security/jboss-xacml-project/2.0.8.Final/jboss-xacml-project-2.0.8.Final.pom (2 KB at 2.1 KB/sec)
[INFO] Downloading: https://gazelle.ihe.net/nexus/content/groups/public/org/picketbox/picketbox/4.0.20.Final/picketbox-4.0.20.Final.pom
[INFO] Downloaded: https://gazelle.ihe.net/nexus/content/groups/public/org/picketbox/picketbox/4.0.20.Final/picketbox-4.0.20.Final.pom (4 KB at 4.7 KB/sec)
[INFO] Downloading: https://gazelle.ihe.net/nexus/content/groups/public/org/picketbox/picketbox-parent/4.0.20.Final/picketbox-parent-4.0.20.Final.pom
[INFO] Downloaded: https://gazelle.ihe.net/nexus/content/groups/public/org/picketbox/picketbox-parent/4.0.20.Final/picketbox-parent-4.0.20.Final.pom (4 KB at 5.9 KB/sec)
[INFO] Downloading: https://gazelle.ihe.net/nexus/content/groups/public/org/opensaml/opensaml/2.6.4/opensaml-2.6.4.pom
[INFO] Downloaded: https://gazelle.ihe.net/nexus/content/groups/public/org/opensaml/opensaml/2.6.4/opensaml-2.6.4.pom (14 KB at 26.3 KB/sec)
[INFO] Downloading: https://gazelle.ihe.net/nexus/content/groups/public/org/opensaml/openws/1.5.4/openws-1.5.4.pom
[INFO] Downloaded: https://gazelle.ihe.net/nexus/content/groups/public/org/opensaml/openws/1.5.4/openws-1.5.4.pom (13 KB at 26.3 KB/sec)
[INFO] Downloading: https://gazelle.ihe.net/nexus/content/groups/public/org/opensaml/xmltooling/1.4.4/xmltooling-1.4.4.pom
[INFO] Downloaded: https://gazelle.ihe.net/nexus/content/groups/public/org/opensaml/xmltooling/1.4.4/xmltooling-1.4.4.pom (9 KB at 15.8 KB/sec)
[INFO] Downloading: https://gazelle.ihe.net/nexus/content/groups/public/org/bouncycastle/bcprov-jdk15on/1.51/bcprov-jdk15on-1.51.pom
[INFO] Downloaded: https://gazelle.ihe.net/nexus/content/groups/public/org/bouncycastle/bcprov-jdk15on/1.51/bcprov-jdk15on-1.51.pom (2 KB at 1.9 KB/sec)
[INFO] Downloading: https://gazelle.ihe.net/nexus/content/groups/public/commons-codec/commons-codec/1.7/commons-codec-1.7.pom
[INFO] Downloaded: https://gazelle.ihe.net/nexus/content/groups/public/commons-codec/commons-codec/1.7/commons-codec-1.7.pom (11 KB at 15.2 KB/sec)
[INFO] Downloading: https://gazelle.ihe.net/nexus/content/groups/public/org/apache/commons/commons-parent/26/commons-parent-26.pom
[INFO] Downloaded: https://gazelle.ihe.net/nexus/content/groups/public/org/apache/commons/commons-parent/26/commons-parent-26.pom (47 KB at 67.0 KB/sec)
[INFO] Downloading: https://gazelle.ihe.net/nexus/content/groups/public/joda-time/joda-time/2.2/joda-time-2.2.pom
[INFO] Downloaded: https://gazelle.ihe.net/nexus/content/groups/public/joda-time/joda-time/2.2/joda-time-2.2.pom (16 KB at 24.0 KB/sec)
[INFO] Downloading: https://gazelle.ihe.net/nexus/content/groups/public/ca/juliusdavies/not-yet-commons-ssl/0.3.9/not-yet-commons-ssl-0.3.9.pom
[INFO] Downloaded: https://gazelle.ihe.net/nexus/content/groups/public/ca/juliusdavies/not-yet-commons-ssl/0.3.9/not-yet-commons-ssl-0.3.9.pom (3 KB at 3.3 KB/sec)
[INFO] Downloading: https://gazelle.ihe.net/nexus/content/groups/public/org/apache/santuario/xmlsec/1.5.7/xmlsec-1.5.7.pom
[INFO] Downloaded: https://gazelle.ihe.net/nexus/content/groups/public/org/apache/santuario/xmlsec/1.5.7/xmlsec-1.5.7.pom (16 KB at 31.8 KB/sec)
[INFO] Downloading: https://gazelle.ihe.net/nexus/content/groups/public/org/owasp/esapi/esapi/2.0.1/esapi-2.0.1.pom
[INFO] Downloaded: https://gazelle.ihe.net/nexus/content/groups/public/org/owasp/esapi/esapi/2.0.1/esapi-2.0.1.pom (21 KB at 31.5 KB/sec)
[INFO] Downloading: https://gazelle.ihe.net/nexus/content/groups/public/com/sun/jdmk/jmxtools/1.2.1/jmxtools-1.2.1.pom
[INFO] Downloaded: https://gazelle.ihe.net/nexus/content/groups/public/com/sun/jdmk/jmxtools/1.2.1/jmxtools-1.2.1.pom (409 B at 0.5 KB/sec)
[INFO] Downloading: https://gazelle.ihe.net/nexus/content/groups/public/com/sun/jmx/jmxri/1.2.1/jmxri-1.2.1.pom
[INFO] Downloaded: https://gazelle.ihe.net/nexus/content/groups/public/com/sun/jmx/jmxri/1.2.1/jmxri-1.2.1.pom (155 B at 0.2 KB/sec)
[INFO] Downloading: https://gazelle.ihe.net/nexus/content/groups/public/org/postgresql/postgresql/9.3-1102-jdbc4/postgresql-9.3-1102-jdbc4.pom
[INFO] Downloaded: https://gazelle.ihe.net/nexus/content/groups/public/org/postgresql/postgresql/9.3-1102-jdbc4/postgresql-9.3-1102-jdbc4.pom (2 KB at 2.3 KB/sec)
[INFO] Downloading: https://gazelle.ihe.net/nexus/content/groups/public/ant-contrib/ant-contrib/1.0b3/ant-contrib-1.0b3.pom
[INFO] Downloaded: https://gazelle.ihe.net/nexus/content/groups/public/ant-contrib/ant-contrib/1.0b3/ant-contrib-1.0b3.pom (761 B at 2.8 KB/sec)
[INFO] Downloading: https://gazelle.ihe.net/nexus/content/groups/public/org/picketlink/picketlink-federation/2.7.0.Final/picketlink-federation-2.7.0.Final.jar
[INFO] Downloading: https://gazelle.ihe.net/nexus/content/groups/public/org/picketlink/picketlink-common/2.7.0.Final/picketlink-common-2.7.0.Final.jar
[INFO] Downloading: https://gazelle.ihe.net/nexus/content/groups/public/org/picketlink/picketlink-config/2.7.0.Final/picketlink-config-2.7.0.Final.jar
[INFO] Downloading: https://gazelle.ihe.net/nexus/content/groups/public/org/picketlink/picketlink-idm-impl/2.7.0.Final/picketlink-idm-impl-2.7.0.Final.jar
[INFO] Downloading: https://gazelle.ihe.net/nexus/content/groups/public/org/picketlink/picketlink-idm-api/2.7.0.Final/picketlink-idm-api-2.7.0.Final.jar
[INFO] Downloaded: https://gazelle.ihe.net/nexus/content/groups/public/org/picketlink/picketlink-common/2.7.0.Final/picketlink-common-2.7.0.Final.jar (143 KB at 112.5 KB/sec)
[INFO] Downloading: https://gazelle.ihe.net/nexus/content/groups/public/org/apache/santuario/xmlsec/1.5.1/xmlsec-1.5.1.jar
[INFO] Downloaded: https://gazelle.ihe.net/nexus/content/groups/public/org/picketlink/picketlink-federation/2.7.0.Final/picketlink-federation-2.7.0.Final.jar (1183 KB at 812.5 KB/sec)
[INFO] Downloading: https://gazelle.ihe.net/nexus/content/groups/public/org/jboss/security/jbossxacml/2.0.8.Final/jbossxacml-2.0.8.Final.jar
[INFO] Downloaded: https://gazelle.ihe.net/nexus/content/groups/public/org/picketlink/picketlink-config/2.7.0.Final/picketlink-config-2.7.0.Final.jar (49 KB at 32.4 KB/sec)
[INFO] Downloading: https://gazelle.ihe.net/nexus/content/groups/public/org/picketbox/picketbox/4.0.20.Final/picketbox-4.0.20.Final.jar
[INFO] Downloaded: https://gazelle.ihe.net/nexus/content/groups/public/org/picketlink/picketlink-idm-impl/2.7.0.Final/picketlink-idm-impl-2.7.0.Final.jar (274 KB at 171.5 KB/sec)
[INFO] Downloading: https://gazelle.ihe.net/nexus/content/groups/public/org/opensaml/opensaml/2.6.4/opensaml-2.6.4.jar
[INFO] Downloaded: https://gazelle.ihe.net/nexus/content/groups/public/org/picketlink/picketlink-idm-api/2.7.0.Final/picketlink-idm-api-2.7.0.Final.jar (225 KB at 137.5 KB/sec)
[INFO] Downloading: https://gazelle.ihe.net/nexus/content/groups/public/org/opensaml/openws/1.5.4/openws-1.5.4.jar
[INFO] Downloaded: https://gazelle.ihe.net/nexus/content/groups/public/org/apache/santuario/xmlsec/1.5.1/xmlsec-1.5.1.jar (593 KB at 180.2 KB/sec)
[INFO] Downloading: https://gazelle.ihe.net/nexus/content/groups/public/org/opensaml/xmltooling/1.4.4/xmltooling-1.4.4.jar
[INFO] Downloaded: https://gazelle.ihe.net/nexus/content/groups/public/org/jboss/security/jbossxacml/2.0.8.Final/jbossxacml-2.0.8.Final.jar (493 KB at 145.6 KB/sec)
[INFO] Downloading: https://gazelle.ihe.net/nexus/content/groups/public/org/bouncycastle/bcprov-jdk15on/1.51/bcprov-jdk15on-1.51.jar
[INFO] Downloaded: https://gazelle.ihe.net/nexus/content/groups/public/org/picketbox/picketbox/4.0.20.Final/picketbox-4.0.20.Final.jar (895 KB at 256.2 KB/sec)
[INFO] Downloading: https://gazelle.ihe.net/nexus/content/groups/public/ca/juliusdavies/not-yet-commons-ssl/0.3.9/not-yet-commons-ssl-0.3.9.jar
[INFO] Downloaded: https://gazelle.ihe.net/nexus/content/groups/public/org/opensaml/openws/1.5.4/openws-1.5.4.jar (561 KB at 148.7 KB/sec)
[INFO] Downloading: https://gazelle.ihe.net/nexus/content/groups/public/commons-codec/commons-codec/1.7/commons-codec-1.7.jar
[INFO] Downloaded: https://gazelle.ihe.net/nexus/content/groups/public/org/opensaml/opensaml/2.6.4/opensaml-2.6.4.jar (1381 KB at 349.9 KB/sec)
[INFO] Downloading: https://gazelle.ihe.net/nexus/content/groups/public/org/owasp/esapi/esapi/2.0.1/esapi-2.0.1.jar
[INFO] Downloaded: https://gazelle.ihe.net/nexus/content/groups/public/org/opensaml/xmltooling/1.4.4/xmltooling-1.4.4.jar (657 KB at 142.6 KB/sec)
[INFO] Downloading: https://gazelle.ihe.net/nexus/content/groups/public/joda-time/joda-time/2.2/joda-time-2.2.jar
[INFO] Downloaded: https://gazelle.ihe.net/nexus/content/groups/public/ca/juliusdavies/not-yet-commons-ssl/0.3.9/not-yet-commons-ssl-0.3.9.jar (253 KB at 52.4 KB/sec)
[INFO] Downloading: https://gazelle.ihe.net/nexus/content/groups/public/com/sun/jdmk/jmxtools/1.2.1/jmxtools-1.2.1.jar
[INFO] Downloaded: https://gazelle.ihe.net/nexus/content/groups/public/org/bouncycastle/bcprov-jdk15on/1.51/bcprov-jdk15on-1.51.jar (2777 KB at 539.1 KB/sec)
[INFO] Downloading: https://gazelle.ihe.net/nexus/content/groups/public/com/sun/jmx/jmxri/1.2.1/jmxri-1.2.1.jar
[INFO] Downloaded: https://gazelle.ihe.net/nexus/content/groups/public/commons-codec/commons-codec/1.7/commons-codec-1.7.jar (254 KB at 48.8 KB/sec)
[INFO] Downloading: https://gazelle.ihe.net/nexus/content/groups/public/org/postgresql/postgresql/9.3-1102-jdbc4/postgresql-9.3-1102-jdbc4.jar
[INFO] Downloaded: https://gazelle.ihe.net/nexus/content/groups/public/org/owasp/esapi/esapi/2.0.1/esapi-2.0.1.jar (359 KB at 68.9 KB/sec)
[INFO] Downloading: https://gazelle.ihe.net/nexus/content/groups/public/ant-contrib/ant-contrib/1.0b3/ant-contrib-1.0b3.jar
[INFO] Downloaded: https://gazelle.ihe.net/nexus/content/groups/public/joda-time/joda-time/2.2/joda-time-2.2.jar (561 KB at 103.9 KB/sec)
[INFO] Downloaded: https://gazelle.ihe.net/nexus/content/groups/public/org/postgresql/postgresql/9.3-1102-jdbc4/postgresql-9.3-1102-jdbc4.jar (579 KB at 88.6 KB/sec)
[INFO] Downloaded: https://gazelle.ihe.net/nexus/content/groups/public/ant-contrib/ant-contrib/1.0b3/ant-contrib-1.0b3.jar (220 KB at 33.5 KB/sec)
[WARNING] Could not validate integrity of download from https://gazelle.ihe.net/nexus/content/groups/public/com/sun/jmx/jmxri/1.2.1/jmxri-1.2.1.jar: Checksum validation failed, no checksums available
[WARNING] Checksum validation failed, no checksums available for https://gazelle.ihe.net/nexus/content/groups/public/com/sun/jmx/jmxri/1.2.1/jmxri-1.2.1.jar
[INFO] Downloaded: https://gazelle.ihe.net/nexus/content/groups/public/com/sun/jmx/jmxri/1.2.1/jmxri-1.2.1.jar (358 KB at 32.2 KB/sec)
[WARNING] Could not validate integrity of download from https://gazelle.ihe.net/nexus/content/groups/public/com/sun/jdmk/jmxtools/1.2.1/jmxtools-1.2.1.jar: Checksum validation failed, no checksums available
[WARNING] Checksum validation failed, no checksums available for https://gazelle.ihe.net/nexus/content/groups/public/com/sun/jdmk/jmxtools/1.2.1/jmxtools-1.2.1.jar
[INFO] Downloaded: https://gazelle.ihe.net/nexus/content/groups/public/com/sun/jdmk/jmxtools/1.2.1/jmxtools-1.2.1.jar (100 KB at 8.9 KB/sec)
[INFO] 
[INFO] --- maven-clean-plugin:2.5:clean (default-clean) @ picketlink-sts ---
[INFO] Deleting /home/jenkins/.hudson/jobs/Picketlink-sts/workspace/ws-trust/picketlink-sts/target
[INFO] 
[INFO] --- maven-resources-plugin:2.6:resources (default-resources) @ picketlink-sts ---
[WARNING] Using platform encoding (UTF8 actually) to copy filtered resources, i.e. build is platform dependent!
[INFO] Copying 11 resources
[INFO] 
[INFO] --- maven-compiler-plugin:2.3.1:compile (default-compile) @ picketlink-sts ---
[INFO] Downloading: https://gazelle.ihe.net/nexus/content/groups/public/org/codehaus/plexus/plexus-compiler-api/1.8/plexus-compiler-api-1.8.pom
[INFO] Downloaded: https://gazelle.ihe.net/nexus/content/groups/public/org/codehaus/plexus/plexus-compiler-api/1.8/plexus-compiler-api-1.8.pom (778 B at 1.1 KB/sec)
[INFO] Downloading: https://gazelle.ihe.net/nexus/content/groups/public/org/codehaus/plexus/plexus-compiler/1.8/plexus-compiler-1.8.pom
[INFO] Downloaded: https://gazelle.ihe.net/nexus/content/groups/public/org/codehaus/plexus/plexus-compiler/1.8/plexus-compiler-1.8.pom (4 KB at 4.7 KB/sec)
[INFO] Downloading: https://gazelle.ihe.net/nexus/content/groups/public/org/codehaus/plexus/plexus-compiler-manager/1.8/plexus-compiler-manager-1.8.pom
[INFO] Downloaded: https://gazelle.ihe.net/nexus/content/groups/public/org/codehaus/plexus/plexus-compiler-manager/1.8/plexus-compiler-manager-1.8.pom (690 B at 1.0 KB/sec)
[INFO] Downloading: https://gazelle.ihe.net/nexus/content/groups/public/org/codehaus/plexus/plexus-compiler-javac/1.8/plexus-compiler-javac-1.8.pom
[INFO] Downloaded: https://gazelle.ihe.net/nexus/content/groups/public/org/codehaus/plexus/plexus-compiler-javac/1.8/plexus-compiler-javac-1.8.pom (686 B at 1.0 KB/sec)
[INFO] Downloading: https://gazelle.ihe.net/nexus/content/groups/public/org/codehaus/plexus/plexus-compilers/1.8/plexus-compilers-1.8.pom
[INFO] Downloaded: https://gazelle.ihe.net/nexus/content/groups/public/org/codehaus/plexus/plexus-compilers/1.8/plexus-compilers-1.8.pom (2 KB at 2.2 KB/sec)
[INFO] Downloading: https://gazelle.ihe.net/nexus/content/groups/public/org/codehaus/plexus/plexus-compiler-api/1.8/plexus-compiler-api-1.8.jar
[INFO] Downloading: https://gazelle.ihe.net/nexus/content/groups/public/org/codehaus/plexus/plexus-compiler-manager/1.8/plexus-compiler-manager-1.8.jar
[INFO] Downloading: https://gazelle.ihe.net/nexus/content/groups/public/org/codehaus/plexus/plexus-compiler-javac/1.8/plexus-compiler-javac-1.8.jar
[INFO] Downloaded: https://gazelle.ihe.net/nexus/content/groups/public/org/codehaus/plexus/plexus-compiler-manager/1.8/plexus-compiler-manager-1.8.jar (6 KB at 6.1 KB/sec)
[INFO] Downloaded: https://gazelle.ihe.net/nexus/content/groups/public/org/codehaus/plexus/plexus-compiler-javac/1.8/plexus-compiler-javac-1.8.jar (12 KB at 12.5 KB/sec)
[INFO] Downloaded: https://gazelle.ihe.net/nexus/content/groups/public/org/codehaus/plexus/plexus-compiler-api/1.8/plexus-compiler-api-1.8.jar (20 KB at 19.0 KB/sec)
[WARNING] File encoding has not been set, using platform encoding UTF8, i.e. build is platform dependent!
[INFO] Compiling 12 source files to /home/jenkins/.hudson/jobs/Picketlink-sts/workspace/ws-trust/picketlink-sts/target/classes
[INFO] -------------------------------------------------------------
[ERROR] COMPILATION ERROR : 
[INFO] -------------------------------------------------------------
[ERROR] /home/jenkins/.hudson/jobs/Picketlink-sts/workspace/ws-trust/picketlink-sts/src/main/java/org/picketlink/identity/federation/app/sts/Role.java:[3,62] error: cannot find symbol

[ERROR]  package org.picketlink.identity.federation.core.saml.v2.writers
/home/jenkins/.hudson/jobs/Picketlink-sts/workspace/ws-trust/picketlink-sts/src/main/java/org/picketlink/identity/federation/app/sts/Role.java:[5,29] error: cannot find symbol

[ERROR]  class RoleInterface
/home/jenkins/.hudson/jobs/Picketlink-sts/workspace/ws-trust/picketlink-sts/src/main/java/org/picketlink/identity/federation/app/sts/Purposeofuse.java:[3,62] error: cannot find symbol

[ERROR]  package org.picketlink.identity.federation.core.saml.v2.writers
/home/jenkins/.hudson/jobs/Picketlink-sts/workspace/ws-trust/picketlink-sts/src/main/java/org/picketlink/identity/federation/app/sts/Purposeofuse.java:[5,37] error: cannot find symbol

[ERROR]  class PurposeofuseInterface
/home/jenkins/.hudson/jobs/Picketlink-sts/workspace/ws-trust/picketlink-sts/src/main/java/org/picketlink/identity/federation/app/sts/SAML20TokenRoleAttributeProvider.java:[4,62] error: cannot find symbol

[ERROR]  package org.picketlink.identity.federation.core.saml.v2.writers
/home/jenkins/.hudson/jobs/Picketlink-sts/workspace/ws-trust/picketlink-sts/src/main/java/org/picketlink/identity/federation/app/sts/SAML20TokenRoleAttributeProvider.java:[5,62] error: cannot find symbol

[ERROR]  package org.picketlink.identity.federation.core.saml.v2.writers
/home/jenkins/.hudson/jobs/Picketlink-sts/workspace/ws-trust/picketlink-sts/src/main/java/org/picketlink/identity/federation/app/sts/SAML20TokenRoleAttributeProvider.java:[6,62] error: cannot find symbol

[ERROR]  package org.picketlink.identity.federation.core.saml.v2.writers
/home/jenkins/.hudson/jobs/Picketlink-sts/workspace/ws-trust/picketlink-sts/src/main/java/org/picketlink/identity/federation/app/sts/Role.java:[20,1] error: method does not override or implement a method from a supertype

[ERROR] /home/jenkins/.hudson/jobs/Picketlink-sts/workspace/ws-trust/picketlink-sts/src/main/java/org/picketlink/identity/federation/app/sts/Role.java:[27,1] error: method does not override or implement a method from a supertype

[ERROR] /home/jenkins/.hudson/jobs/Picketlink-sts/workspace/ws-trust/picketlink-sts/src/main/java/org/picketlink/identity/federation/app/sts/Role.java:[34,1] error: method does not override or implement a method from a supertype

[ERROR] /home/jenkins/.hudson/jobs/Picketlink-sts/workspace/ws-trust/picketlink-sts/src/main/java/org/picketlink/identity/federation/app/sts/Role.java:[41,1] error: method does not override or implement a method from a supertype

[ERROR] /home/jenkins/.hudson/jobs/Picketlink-sts/workspace/ws-trust/picketlink-sts/src/main/java/org/picketlink/identity/federation/app/sts/Role.java:[48,1] error: method does not override or implement a method from a supertype

[ERROR] /home/jenkins/.hudson/jobs/Picketlink-sts/workspace/ws-trust/picketlink-sts/src/main/java/org/picketlink/identity/federation/app/sts/Role.java:[55,1] error: method does not override or implement a method from a supertype

[ERROR] /home/jenkins/.hudson/jobs/Picketlink-sts/workspace/ws-trust/picketlink-sts/src/main/java/org/picketlink/identity/federation/app/sts/Role.java:[62,1] error: method does not override or implement a method from a supertype

[ERROR] /home/jenkins/.hudson/jobs/Picketlink-sts/workspace/ws-trust/picketlink-sts/src/main/java/org/picketlink/identity/federation/app/sts/Role.java:[69,1] error: method does not override or implement a method from a supertype

[ERROR] /home/jenkins/.hudson/jobs/Picketlink-sts/workspace/ws-trust/picketlink-sts/src/main/java/org/picketlink/identity/federation/app/sts/Role.java:[76,1] error: method does not override or implement a method from a supertype

[ERROR] /home/jenkins/.hudson/jobs/Picketlink-sts/workspace/ws-trust/picketlink-sts/src/main/java/org/picketlink/identity/federation/app/sts/Role.java:[83,1] error: method does not override or implement a method from a supertype

[ERROR] /home/jenkins/.hudson/jobs/Picketlink-sts/workspace/ws-trust/picketlink-sts/src/main/java/org/picketlink/identity/federation/app/sts/Role.java:[89,1] error: method does not override or implement a method from a supertype

[ERROR] /home/jenkins/.hudson/jobs/Picketlink-sts/workspace/ws-trust/picketlink-sts/src/main/java/org/picketlink/identity/federation/app/sts/Role.java:[94,1] error: method does not override or implement a method from a supertype

[ERROR] /home/jenkins/.hudson/jobs/Picketlink-sts/workspace/ws-trust/picketlink-sts/src/main/java/org/picketlink/identity/federation/app/sts/Purposeofuse.java:[17,1] error: method does not override or implement a method from a supertype

[ERROR] /home/jenkins/.hudson/jobs/Picketlink-sts/workspace/ws-trust/picketlink-sts/src/main/java/org/picketlink/identity/federation/app/sts/Purposeofuse.java:[22,1] error: method does not override or implement a method from a supertype

[ERROR] /home/jenkins/.hudson/jobs/Picketlink-sts/workspace/ws-trust/picketlink-sts/src/main/java/org/picketlink/identity/federation/app/sts/Purposeofuse.java:[27,1] error: method does not override or implement a method from a supertype

[ERROR] /home/jenkins/.hudson/jobs/Picketlink-sts/workspace/ws-trust/picketlink-sts/src/main/java/org/picketlink/identity/federation/app/sts/Purposeofuse.java:[32,1] error: method does not override or implement a method from a supertype

[ERROR] /home/jenkins/.hudson/jobs/Picketlink-sts/workspace/ws-trust/picketlink-sts/src/main/java/org/picketlink/identity/federation/app/sts/Purposeofuse.java:[37,1] error: method does not override or implement a method from a supertype

[ERROR] /home/jenkins/.hudson/jobs/Picketlink-sts/workspace/ws-trust/picketlink-sts/src/main/java/org/picketlink/identity/federation/app/sts/Purposeofuse.java:[42,1] error: method does not override or implement a method from a supertype

[ERROR] /home/jenkins/.hudson/jobs/Picketlink-sts/workspace/ws-trust/picketlink-sts/src/main/java/org/picketlink/identity/federation/app/sts/Purposeofuse.java:[47,1] error: method does not override or implement a method from a supertype

[ERROR] /home/jenkins/.hudson/jobs/Picketlink-sts/workspace/ws-trust/picketlink-sts/src/main/java/org/picketlink/identity/federation/app/sts/Purposeofuse.java:[52,1] error: method does not override or implement a method from a supertype

[ERROR] /home/jenkins/.hudson/jobs/Picketlink-sts/workspace/ws-trust/picketlink-sts/src/main/java/org/picketlink/identity/federation/app/sts/Purposeofuse.java:[57,1] error: method does not override or implement a method from a supertype

[ERROR] /home/jenkins/.hudson/jobs/Picketlink-sts/workspace/ws-trust/picketlink-sts/src/main/java/org/picketlink/identity/federation/app/sts/Purposeofuse.java:[62,1] error: method does not override or implement a method from a supertype

[ERROR] /home/jenkins/.hudson/jobs/Picketlink-sts/workspace/ws-trust/picketlink-sts/src/main/java/org/picketlink/identity/federation/app/sts/Purposeofuse.java:[67,1] error: method does not override or implement a method from a supertype

[ERROR] /home/jenkins/.hudson/jobs/Picketlink-sts/workspace/ws-trust/picketlink-sts/src/main/java/org/picketlink/identity/federation/app/sts/Purposeofuse.java:[72,1] error: method does not override or implement a method from a supertype

[ERROR] /home/jenkins/.hudson/jobs/Picketlink-sts/workspace/ws-trust/picketlink-sts/src/main/java/org/picketlink/identity/federation/app/sts/SAML20TokenRoleAttributeProvider.java:[115,2] error: cannot find symbol

[ERROR]  class SAML20TokenRoleAttributeProvider
/home/jenkins/.hudson/jobs/Picketlink-sts/workspace/ws-trust/picketlink-sts/src/main/java/org/picketlink/identity/federation/app/sts/SAML20TokenRoleAttributeProvider.java:[115,31] error: cannot find symbol

[ERROR]  class SAML20TokenRoleAttributeProvider
/home/jenkins/.hudson/jobs/Picketlink-sts/workspace/ws-trust/picketlink-sts/src/main/java/org/picketlink/identity/federation/app/sts/SAML20TokenRoleAttributeProvider.java:[180,2] error: cannot find symbol

[ERROR]  class SAML20TokenRoleAttributeProvider
/home/jenkins/.hudson/jobs/Picketlink-sts/workspace/ws-trust/picketlink-sts/src/main/java/org/picketlink/identity/federation/app/sts/SAML20TokenRoleAttributeProvider.java:[180,31] error: cannot find symbol

[ERROR]  class SAML20TokenRoleAttributeProvider
/home/jenkins/.hudson/jobs/Picketlink-sts/workspace/ws-trust/picketlink-sts/src/main/java/org/picketlink/identity/federation/app/sts/SAML20TokenRoleAttributeProvider.java:[183,20] error: cannot find symbol

[ERROR]  class PicketLinkSTS
/home/jenkins/.hudson/jobs/Picketlink-sts/workspace/ws-trust/picketlink-sts/src/main/java/org/picketlink/identity/federation/app/sts/SAML20TokenRoleAttributeProvider.java:[204,20] error: cannot find symbol

[ERROR]  class PicketLinkSTS
/home/jenkins/.hudson/jobs/Picketlink-sts/workspace/ws-trust/picketlink-sts/src/main/java/org/picketlink/identity/federation/app/sts/SAML20TokenRoleAttributeProvider.java:[251,2] error: cannot find symbol

[ERROR]  class SAML20TokenRoleAttributeProvider
/home/jenkins/.hudson/jobs/Picketlink-sts/workspace/ws-trust/picketlink-sts/src/main/java/org/picketlink/identity/federation/app/sts/SAML20TokenRoleAttributeProvider.java:[262,2] error: cannot find symbol

[ERROR]  class SAML20TokenRoleAttributeProvider
/home/jenkins/.hudson/jobs/Picketlink-sts/workspace/ws-trust/picketlink-sts/src/main/java/org/picketlink/identity/federation/app/sts/SAML20TokenRoleAttributeProvider.java:[272,19] error: cannot find symbol

[INFO] 40 errors 
[INFO] -------------------------------------------------------------
[BFA] Scanning build for known causes...
[BFA] No failure causes found
[BFA] Done. 0s
Started calculate disk usage of build
Finished Calculation of disk usage of build in 0 seconds
Started calculate disk usage of workspace
Finished Calculation of disk usage of workspace in 0 seconds
[INFO] ------------------------------------------------------------------------
[INFO] BUILD FAILURE
[INFO] ------------------------------------------------------------------------
[INFO] Total time: 39.133 s
[INFO] Finished at: 2017-02-14T17:13:50+01:00
[INFO] Final Memory: 27M/397M
[INFO] ------------------------------------------------------------------------
[ERROR] Failed to execute goal org.apache.maven.plugins:maven-compiler-plugin:2.3.1:compile (default-compile) on project picketlink-sts: Compilation failure: Compilation failure:
[ERROR] /home/jenkins/.hudson/jobs/Picketlink-sts/workspace/ws-trust/picketlink-sts/src/main/java/org/picketlink/identity/federation/app/sts/Role.java:[3,62] error: cannot find symbol
[ERROR] 
[ERROR] package org.picketlink.identity.federation.core.saml.v2.writers
[ERROR] /home/jenkins/.hudson/jobs/Picketlink-sts/workspace/ws-trust/picketlink-sts/src/main/java/org/picketlink/identity/federation/app/sts/Role.java:[5,29] error: cannot find symbol
[ERROR] 
[ERROR] class RoleInterface
[ERROR] /home/jenkins/.hudson/jobs/Picketlink-sts/workspace/ws-trust/picketlink-sts/src/main/java/org/picketlink/identity/federation/app/sts/Purposeofuse.java:[3,62] error: cannot find symbol
[ERROR] 
[ERROR] package org.picketlink.identity.federation.core.saml.v2.writers
[ERROR] /home/jenkins/.hudson/jobs/Picketlink-sts/workspace/ws-trust/picketlink-sts/src/main/java/org/picketlink/identity/federation/app/sts/Purposeofuse.java:[5,37] error: cannot find symbol
[ERROR] 
[ERROR] class PurposeofuseInterface
[ERROR] /home/jenkins/.hudson/jobs/Picketlink-sts/workspace/ws-trust/picketlink-sts/src/main/java/org/picketlink/identity/federation/app/sts/SAML20TokenRoleAttributeProvider.java:[4,62] error: cannot find symbol
[ERROR] 
[ERROR] package org.picketlink.identity.federation.core.saml.v2.writers
[ERROR] /home/jenkins/.hudson/jobs/Picketlink-sts/workspace/ws-trust/picketlink-sts/src/main/java/org/picketlink/identity/federation/app/sts/SAML20TokenRoleAttributeProvider.java:[5,62] error: cannot find symbol
[ERROR] 
[ERROR] package org.picketlink.identity.federation.core.saml.v2.writers
[ERROR] /home/jenkins/.hudson/jobs/Picketlink-sts/workspace/ws-trust/picketlink-sts/src/main/java/org/picketlink/identity/federation/app/sts/SAML20TokenRoleAttributeProvider.java:[6,62] error: cannot find symbol
[ERROR] 
[ERROR] package org.picketlink.identity.federation.core.saml.v2.writers
[ERROR] /home/jenkins/.hudson/jobs/Picketlink-sts/workspace/ws-trust/picketlink-sts/src/main/java/org/picketlink/identity/federation/app/sts/Role.java:[20,1] error: method does not override or implement a method from a supertype
[ERROR] 
[ERROR] /home/jenkins/.hudson/jobs/Picketlink-sts/workspace/ws-trust/picketlink-sts/src/main/java/org/picketlink/identity/federation/app/sts/Role.java:[27,1] error: method does not override or implement a method from a supertype
[ERROR] 
[ERROR] /home/jenkins/.hudson/jobs/Picketlink-sts/workspace/ws-trust/picketlink-sts/src/main/java/org/picketlink/identity/federation/app/sts/Role.java:[34,1] error: method does not override or implement a method from a supertype
[ERROR] 
[ERROR] /home/jenkins/.hudson/jobs/Picketlink-sts/workspace/ws-trust/picketlink-sts/src/main/java/org/picketlink/identity/federation/app/sts/Role.java:[41,1] error: method does not override or implement a method from a supertype
[ERROR] 
[ERROR] /home/jenkins/.hudson/jobs/Picketlink-sts/workspace/ws-trust/picketlink-sts/src/main/java/org/picketlink/identity/federation/app/sts/Role.java:[48,1] error: method does not override or implement a method from a supertype
[ERROR] 
[ERROR] /home/jenkins/.hudson/jobs/Picketlink-sts/workspace/ws-trust/picketlink-sts/src/main/java/org/picketlink/identity/federation/app/sts/Role.java:[55,1] error: method does not override or implement a method from a supertype
[ERROR] 
[ERROR] /home/jenkins/.hudson/jobs/Picketlink-sts/workspace/ws-trust/picketlink-sts/src/main/java/org/picketlink/identity/federation/app/sts/Role.java:[62,1] error: method does not override or implement a method from a supertype
[ERROR] 
[ERROR] /home/jenkins/.hudson/jobs/Picketlink-sts/workspace/ws-trust/picketlink-sts/src/main/java/org/picketlink/identity/federation/app/sts/Role.java:[69,1] error: method does not override or implement a method from a supertype
[ERROR] 
[ERROR] /home/jenkins/.hudson/jobs/Picketlink-sts/workspace/ws-trust/picketlink-sts/src/main/java/org/picketlink/identity/federation/app/sts/Role.java:[76,1] error: method does not override or implement a method from a supertype
[ERROR] 
[ERROR] /home/jenkins/.hudson/jobs/Picketlink-sts/workspace/ws-trust/picketlink-sts/src/main/java/org/picketlink/identity/federation/app/sts/Role.java:[83,1] error: method does not override or implement a method from a supertype
[ERROR] 
[ERROR] /home/jenkins/.hudson/jobs/Picketlink-sts/workspace/ws-trust/picketlink-sts/src/main/java/org/picketlink/identity/federation/app/sts/Role.java:[89,1] error: method does not override or implement a method from a supertype
[ERROR] 
[ERROR] /home/jenkins/.hudson/jobs/Picketlink-sts/workspace/ws-trust/picketlink-sts/src/main/java/org/picketlink/identity/federation/app/sts/Role.java:[94,1] error: method does not override or implement a method from a supertype
[ERROR] 
[ERROR] /home/jenkins/.hudson/jobs/Picketlink-sts/workspace/ws-trust/picketlink-sts/src/main/java/org/picketlink/identity/federation/app/sts/Purposeofuse.java:[17,1] error: method does not override or implement a method from a supertype
[ERROR] 
[JENKINS] Archiving /home/jenkins/.hudson/jobs/Picketlink-sts/workspace/ws-trust/picketlink-sts/pom.xml to org.picketlink.quickstarts/picketlink-sts/2.1.8.Final/picketlink-sts-2.1.8.Final.pom
[ERROR] /home/jenkins/.hudson/jobs/Picketlink-sts/workspace/ws-trust/picketlink-sts/src/main/java/org/picketlink/identity/federation/app/sts/Purposeofuse.java:[22,1] error: method does not override or implement a method from a supertype
[ERROR] 
[ERROR] /home/jenkins/.hudson/jobs/Picketlink-sts/workspace/ws-trust/picketlink-sts/src/main/java/org/picketlink/identity/federation/app/sts/Purposeofuse.java:[27,1] error: method does not override or implement a method from a supertype
[ERROR] 
[ERROR] /home/jenkins/.hudson/jobs/Picketlink-sts/workspace/ws-trust/picketlink-sts/src/main/java/org/picketlink/identity/federation/app/sts/Purposeofuse.java:[32,1] error: method does not override or implement a method from a supertype
[ERROR] 
[ERROR] /home/jenkins/.hudson/jobs/Picketlink-sts/workspace/ws-trust/picketlink-sts/src/main/java/org/picketlink/identity/federation/app/sts/Purposeofuse.java:[37,1] error: method does not override or implement a method from a supertype
[ERROR] 
[ERROR] /home/jenkins/.hudson/jobs/Picketlink-sts/workspace/ws-trust/picketlink-sts/src/main/java/org/picketlink/identity/federation/app/sts/Purposeofuse.java:[42,1] error: method does not override or implement a method from a supertype
[ERROR] 
[ERROR] /home/jenkins/.hudson/jobs/Picketlink-sts/workspace/ws-trust/picketlink-sts/src/main/java/org/picketlink/identity/federation/app/sts/Purposeofuse.java:[47,1] error: method does not override or implement a method from a supertype
[ERROR] 
[ERROR] /home/jenkins/.hudson/jobs/Picketlink-sts/workspace/ws-trust/picketlink-sts/src/main/java/org/picketlink/identity/federation/app/sts/Purposeofuse.java:[52,1] error: method does not override or implement a method from a supertype
[ERROR] 
[ERROR] /home/jenkins/.hudson/jobs/Picketlink-sts/workspace/ws-trust/picketlink-sts/src/main/java/org/picketlink/identity/federation/app/sts/Purposeofuse.java:[57,1] error: method does not override or implement a method from a supertype
[ERROR] 
[ERROR] /home/jenkins/.hudson/jobs/Picketlink-sts/workspace/ws-trust/picketlink-sts/src/main/java/org/picketlink/identity/federation/app/sts/Purposeofuse.java:[62,1] error: method does not override or implement a method from a supertype
[ERROR] 
[ERROR] /home/jenkins/.hudson/jobs/Picketlink-sts/workspace/ws-trust/picketlink-sts/src/main/java/org/picketlink/identity/federation/app/sts/Purposeofuse.java:[67,1] error: method does not override or implement a method from a supertype
[ERROR] 
[ERROR] /home/jenkins/.hudson/jobs/Picketlink-sts/workspace/ws-trust/picketlink-sts/src/main/java/org/picketlink/identity/federation/app/sts/Purposeofuse.java:[72,1] error: method does not override or implement a method from a supertype
[ERROR] 
[ERROR] /home/jenkins/.hudson/jobs/Picketlink-sts/workspace/ws-trust/picketlink-sts/src/main/java/org/picketlink/identity/federation/app/sts/SAML20TokenRoleAttributeProvider.java:[115,2] error: cannot find symbol
[ERROR] 
[ERROR] class SAML20TokenRoleAttributeProvider
[ERROR] /home/jenkins/.hudson/jobs/Picketlink-sts/workspace/ws-trust/picketlink-sts/src/main/java/org/picketlink/identity/federation/app/sts/SAML20TokenRoleAttributeProvider.java:[115,31] error: cannot find symbol
[ERROR] 
[ERROR] class SAML20TokenRoleAttributeProvider
[ERROR] /home/jenkins/.hudson/jobs/Picketlink-sts/workspace/ws-trust/picketlink-sts/src/main/java/org/picketlink/identity/federation/app/sts/SAML20TokenRoleAttributeProvider.java:[180,2] error: cannot find symbol
[ERROR] 
[ERROR] class SAML20TokenRoleAttributeProvider
[ERROR] /home/jenkins/.hudson/jobs/Picketlink-sts/workspace/ws-trust/picketlink-sts/src/main/java/org/picketlink/identity/federation/app/sts/SAML20TokenRoleAttributeProvider.java:[180,31] error: cannot find symbol
[ERROR] 
[ERROR] class SAML20TokenRoleAttributeProvider
[ERROR] /home/jenkins/.hudson/jobs/Picketlink-sts/workspace/ws-trust/picketlink-sts/src/main/java/org/picketlink/identity/federation/app/sts/SAML20TokenRoleAttributeProvider.java:[183,20] error: cannot find symbol
[ERROR] 
[ERROR] class PicketLinkSTS
[ERROR] /home/jenkins/.hudson/jobs/Picketlink-sts/workspace/ws-trust/picketlink-sts/src/main/java/org/picketlink/identity/federation/app/sts/SAML20TokenRoleAttributeProvider.java:[204,20] error: cannot find symbol
[ERROR] 
[ERROR] class PicketLinkSTS
[ERROR] /home/jenkins/.hudson/jobs/Picketlink-sts/workspace/ws-trust/picketlink-sts/src/main/java/org/picketlink/identity/federation/app/sts/SAML20TokenRoleAttributeProvider.java:[251,2] error: cannot find symbol
[ERROR] 
[ERROR] class SAML20TokenRoleAttributeProvider
[ERROR] /home/jenkins/.hudson/jobs/Picketlink-sts/workspace/ws-trust/picketlink-sts/src/main/java/org/picketlink/identity/federation/app/sts/SAML20TokenRoleAttributeProvider.java:[262,2] error: cannot find symbol
[ERROR] 
[ERROR] class SAML20TokenRoleAttributeProvider
[ERROR] /home/jenkins/.hudson/jobs/Picketlink-sts/workspace/ws-trust/picketlink-sts/src/main/java/org/picketlink/identity/federation/app/sts/SAML20TokenRoleAttributeProvider.java:[272,19] error: cannot find symbol
[ERROR] -> [Help 1]
[ERROR] 
[ERROR] To see the full stack trace of the errors, re-run Maven with the -e switch.
[ERROR] Re-run Maven using the -X switch to enable full debug logging.
[ERROR] 
[ERROR] For more information about the errors and possible solutions, please read the following articles:
[ERROR] [Help 1] http://cwiki.apache.org/confluence/display/MAVEN/MojoFailureException
channel stopped
[BFA] Scanning build for known causes...
[BFA] No failure causes found
[BFA] Done. 0s
Started calculate disk usage of build
Finished Calculation of disk usage of build in 0 seconds
Started calculate disk usage of workspace
Finished Calculation of disk usage of workspace in 0 seconds
Warning: you have no plugins providing access control for builds, so falling back to legacy behavior of permitting any downstream builds to be triggered
Finished: FAILURE