SuccessConsole Output

Established TCP socket on 37137
Java HotSpot(TM) 64-Bit Server VM warning: ignoring option MaxPermSize=1024m; support was removed in 8.0
<===[JENKINS REMOTING CAPACITY]===>channel started
Executing Maven:  -B -f /home/jenkins/.hudson/jobs/cdabasic-validator-jar/workspace/pom.xml clean install -P production org.sonarsource.scanner.maven:sonar-maven-plugin:sonar
[INFO] Scanning for projects...
[INFO] 
[INFO] ------------------------------------------------------------------------
[INFO] Building CDA Basic - Validator 1.1.2-SNAPSHOT
[INFO] ------------------------------------------------------------------------
[INFO] 
[INFO] --- maven-clean-plugin:2.5:clean (default-clean) @ cdabasic-validator-jar ---
[INFO] 
[INFO] --- jacoco-maven-plugin:0.7.9:prepare-agent (default-prepare-agent) @ cdabasic-validator-jar ---
[INFO] argLine set to -javaagent:/home/jenkins/.m2/repository/org/jacoco/org.jacoco.agent/0.7.9/org.jacoco.agent-0.7.9-runtime.jar=destfile=/home/jenkins/.hudson/jobs/cdabasic-validator-jar/workspace/target/jacoco.exec
[INFO] 
[INFO] --- maven-resources-plugin:2.6:resources (default-resources) @ cdabasic-validator-jar ---
[INFO] Using 'UTF-8' encoding to copy filtered resources.
[INFO] skip non existing resourceDirectory /home/jenkins/.hudson/jobs/cdabasic-validator-jar/workspace/src/main/resources
[INFO] 
[INFO] --- maven-compiler-plugin:3.1:compile (default-compile) @ cdabasic-validator-jar ---
[INFO] Changes detected - recompiling the module!
[INFO] Compiling 84 source files to /home/jenkins/.hudson/jobs/cdabasic-validator-jar/workspace/target/classes
[INFO] 
[INFO] --- maven-resources-plugin:2.6:testResources (default-testResources) @ cdabasic-validator-jar ---
[INFO] Using 'UTF-8' encoding to copy filtered resources.
[INFO] Copying 636 resources
[INFO] 
[INFO] --- maven-compiler-plugin:3.1:testCompile (default-testCompile) @ cdabasic-validator-jar ---
[INFO] Changes detected - recompiling the module!
[INFO] Compiling 98 source files to /home/jenkins/.hudson/jobs/cdabasic-validator-jar/workspace/target/test-classes
[INFO] 
[INFO] --- maven-surefire-plugin:2.12.4:test (default-test) @ cdabasic-validator-jar ---
[INFO] Surefire report directory: /home/jenkins/.hudson/jobs/cdabasic-validator-jar/workspace/target/surefire-reports

-------------------------------------------------------
 T E S T S
-------------------------------------------------------
Running net.ihe.gazelle.testdt.PIVLTSSpecTest
Initiating the CDA validator of the application
log4j:WARN No appenders could be found for logger (org.apache.commons.httpclient.HttpClient).
log4j:WARN Please initialize the log4j system properly.
java.lang.instrument.IllegalClassFormatException: Error while instrumenting class com/pixelmed/ucum/UCUMRewriter.
	at org.jacoco.agent.rt.internal_8ff85ea.CoverageTransformer.transform(CoverageTransformer.java:93)
	at sun.instrument.TransformerManager.transform(TransformerManager.java:188)
	at sun.instrument.InstrumentationImpl.transform(InstrumentationImpl.java:428)
	at java.lang.ClassLoader.defineClass1(Native Method)
	at java.lang.ClassLoader.defineClass(ClassLoader.java:763)
	at java.security.SecureClassLoader.defineClass(SecureClassLoader.java:142)
	at java.net.URLClassLoader.defineClass(URLClassLoader.java:468)
	at java.net.URLClassLoader.access$100(URLClassLoader.java:74)
	at java.net.URLClassLoader$1.run(URLClassLoader.java:369)
	at java.net.URLClassLoader$1.run(URLClassLoader.java:363)
	at java.security.AccessController.doPrivileged(Native Method)
	at java.net.URLClassLoader.findClass(URLClassLoader.java:362)
	at java.lang.ClassLoader.loadClass(ClassLoader.java:424)
	at sun.misc.Launcher$AppClassLoader.loadClass(Launcher.java:349)
	at java.lang.ClassLoader.loadClass(ClassLoader.java:357)
	at com.pixelmed.ucum.UCUMAnalyzer.getCanonicalForm(UCUMAnalyzer.java:314)
	at com.pixelmed.ucum.UCUMAnalyzer.getCanonicalForm(UCUMAnalyzer.java:366)
	at net.ihe.gazelle.basic.validation.UCUMValidator.unitsAreComparable(UCUMValidator.java:33)
	at net.ihe.gazelle.cda.cdadt.PIVLTSSpecValidator.unitIsMeasureOfTime(PIVLTSSpecValidator.java:25)
	at net.ihe.gazelle.cda.cdadt.PIVLTSSpecValidator._validatePIVLTSSpec_Dtits016(PIVLTSSpecValidator.java:46)
	at net.ihe.gazelle.cda.cdadt.PIVLTSSpecValidator.executeCons_PIVLTSSpec_Dtits016(PIVLTSSpecValidator.java:100)
	at net.ihe.gazelle.cda.cdadt.PIVLTSSpecValidator._validatePIVLTSSpec(PIVLTSSpecValidator.java:68)
	at net.ihe.gazelle.cda.cdadt.CDADTPackValidator.validate(CDADTPackValidator.java:92)
	at net.ihe.gazelle.datatypes.ANY.validateByModule(ANY.java:164)
	at net.ihe.gazelle.datatypes.QTY.validateByModule(QTY.java:93)
	at net.ihe.gazelle.datatypes.TS.validateByModule(TS.java:121)
	at net.ihe.gazelle.datatypes.SXCMTS.validateByModule(SXCMTS.java:123)
	at net.ihe.gazelle.cda.POCDMT000040SubstanceAdministration.validateByModule(POCDMT000040SubstanceAdministration.java:1058)
	at net.ihe.gazelle.cda.POCDMT000040Entry.validateByModule(POCDMT000040Entry.java:523)
	at net.ihe.gazelle.cda.POCDMT000040Section.validateByModule(POCDMT000040Section.java:722)
	at net.ihe.gazelle.cda.POCDMT000040Component3.validateByModule(POCDMT000040Component3.java:340)
	at net.ihe.gazelle.cda.POCDMT000040StructuredBody.validateByModule(POCDMT000040StructuredBody.java:399)
	at net.ihe.gazelle.cda.POCDMT000040Component2.validateByModule(POCDMT000040Component2.java:363)
	at net.ihe.gazelle.cda.POCDMT000040ClinicalDocument.validateByModule(POCDMT000040ClinicalDocument.java:1120)
	at net.ihe.gazelle.util.CommonUtil.validateClinicalDocumentType(CommonUtil.java:117)
	at net.ihe.gazelle.util.CommonUtil.getDetailedResultFromFile(CommonUtil.java:61)
	at net.ihe.gazelle.testdt.PIVLTSSpecTest.test_cdadt028(PIVLTSSpecTest.java:13)
	at sun.reflect.NativeMethodAccessorImpl.invoke0(Native Method)
	at sun.reflect.NativeMethodAccessorImpl.invoke(NativeMethodAccessorImpl.java:62)
	at sun.reflect.DelegatingMethodAccessorImpl.invoke(DelegatingMethodAccessorImpl.java:43)
	at java.lang.reflect.Method.invoke(Method.java:498)
	at org.junit.runners.model.FrameworkMethod$1.runReflectiveCall(FrameworkMethod.java:45)
	at org.junit.internal.runners.model.ReflectiveCallable.run(ReflectiveCallable.java:15)
	at org.junit.runners.model.FrameworkMethod.invokeExplosively(FrameworkMethod.java:42)
	at org.junit.internal.runners.statements.InvokeMethod.evaluate(InvokeMethod.java:20)
	at org.junit.runners.ParentRunner.runLeaf(ParentRunner.java:263)
	at org.junit.runners.BlockJUnit4ClassRunner.runChild(BlockJUnit4ClassRunner.java:68)
	at org.junit.runners.BlockJUnit4ClassRunner.runChild(BlockJUnit4ClassRunner.java:47)
	at org.junit.runners.ParentRunner$3.run(ParentRunner.java:231)
	at org.junit.runners.ParentRunner$1.schedule(ParentRunner.java:60)
	at org.junit.runners.ParentRunner.runChildren(ParentRunner.java:229)
	at org.junit.runners.ParentRunner.access$000(ParentRunner.java:50)
	at org.junit.runners.ParentRunner$2.evaluate(ParentRunner.java:222)
	at org.junit.runners.ParentRunner.run(ParentRunner.java:300)
	at org.apache.maven.surefire.junit4.JUnit4Provider.execute(JUnit4Provider.java:252)
	at org.apache.maven.surefire.junit4.JUnit4Provider.executeTestSet(JUnit4Provider.java:141)
	at org.apache.maven.surefire.junit4.JUnit4Provider.invoke(JUnit4Provider.java:112)
	at sun.reflect.NativeMethodAccessorImpl.invoke0(Native Method)
	at sun.reflect.NativeMethodAccessorImpl.invoke(NativeMethodAccessorImpl.java:62)
	at sun.reflect.DelegatingMethodAccessorImpl.invoke(DelegatingMethodAccessorImpl.java:43)
	at java.lang.reflect.Method.invoke(Method.java:498)
	at org.apache.maven.surefire.util.ReflectionUtils.invokeMethodWithArray(ReflectionUtils.java:189)
	at org.apache.maven.surefire.booter.ProviderFactory$ProviderProxy.invoke(ProviderFactory.java:165)
	at org.apache.maven.surefire.booter.ProviderFactory.invokeProvider(ProviderFactory.java:85)
	at org.apache.maven.surefire.booter.ForkedBooter.runSuitesInProcess(ForkedBooter.java:115)
	at org.apache.maven.surefire.booter.ForkedBooter.main(ForkedBooter.java:75)
Caused by: java.io.IOException: Error while instrumenting class com/pixelmed/ucum/UCUMRewriter.
	at org.jacoco.agent.rt.internal_8ff85ea.core.instr.Instrumenter.instrumentError(Instrumenter.java:166)
	at org.jacoco.agent.rt.internal_8ff85ea.core.instr.Instrumenter.instrument(Instrumenter.java:117)
	at org.jacoco.agent.rt.internal_8ff85ea.CoverageTransformer.transform(CoverageTransformer.java:91)
	... 65 more
Caused by: java.lang.RuntimeException: Method code too large!
	at org.jacoco.agent.rt.internal_8ff85ea.asm.MethodWriter.getSize(MethodWriter.java:2079)
	at org.jacoco.agent.rt.internal_8ff85ea.asm.ClassWriter.toByteArray(ClassWriter.java:838)
	at org.jacoco.agent.rt.internal_8ff85ea.core.instr.Instrumenter.instrument(Instrumenter.java:91)
	at org.jacoco.agent.rt.internal_8ff85ea.core.instr.Instrumenter.instrument(Instrumenter.java:114)
	... 66 more
Tests run: 2, Failures: 0, Errors: 0, Skipped: 0, Time elapsed: 5.714 sec
Running net.ihe.gazelle.testdt.PIVLPPDTSSpecTest
Tests run: 1, Failures: 0, Errors: 0, Skipped: 0, Time elapsed: 1.986 sec
Running net.ihe.gazelle.testdt.CRSpecTest
Tests run: 1, Failures: 0, Errors: 0, Skipped: 0, Time elapsed: 11.823 sec
Running net.ihe.gazelle.testdt.ANYSpecTest
Tests run: 2, Failures: 0, Errors: 0, Skipped: 0, Time elapsed: 17.251 sec
Running net.ihe.gazelle.testdt.IVLPQSpecTest
Tests run: 1, Failures: 0, Errors: 0, Skipped: 0, Time elapsed: 7.652 sec
Running net.ihe.gazelle.testdt.MOSpecTest
Tests run: 1, Failures: 0, Errors: 0, Skipped: 0, Time elapsed: 3.156 sec
Running net.ihe.gazelle.testdt.CDSpecTest
Tests run: 9, Failures: 0, Errors: 0, Skipped: 0, Time elapsed: 56.887 sec
Running net.ihe.gazelle.testdt.EDSpecTest
Tests run: 5, Failures: 0, Errors: 0, Skipped: 0, Time elapsed: 26.039 sec
Running net.ihe.gazelle.testdt.IISpecTest
Tests run: 2, Failures: 0, Errors: 0, Skipped: 0, Time elapsed: 11.34 sec
Running net.ihe.gazelle.testdt.CSSpecTest
Tests run: 1, Failures: 0, Errors: 0, Skipped: 0, Time elapsed: 7.263 sec
Running net.ihe.gazelle.testdt.EIVLEventSpecTest
Tests run: 1, Failures: 0, Errors: 0, Skipped: 0, Time elapsed: 6.729 sec
Running net.ihe.gazelle.testdt.URLSpecTest
Tests run: 6, Failures: 0, Errors: 0, Skipped: 0, Time elapsed: 6.505 sec
Running net.ihe.gazelle.testdt.PNSpecTest
Tests run: 1, Failures: 0, Errors: 0, Skipped: 0, Time elapsed: 4.755 sec
Running net.ihe.gazelle.testdt.IVLREALSpecTest
Tests run: 1, Failures: 0, Errors: 0, Skipped: 0, Time elapsed: 4.932 sec
Running net.ihe.gazelle.testdt.TELSpecTest
Tests run: 1, Failures: 0, Errors: 0, Skipped: 0, Time elapsed: 1.008 sec
Running net.ihe.gazelle.testdt.ENXPSpecTest
Tests run: 1, Failures: 0, Errors: 0, Skipped: 0, Time elapsed: 3.802 sec
Running net.ihe.gazelle.testdt.SCSpecTest
Tests run: 1, Failures: 0, Errors: 0, Skipped: 0, Time elapsed: 1.022 sec
Running net.ihe.gazelle.testdt.TNSpecTest
Tests run: 1, Failures: 0, Errors: 0, Skipped: 0, Time elapsed: 5.013 sec
Running net.ihe.gazelle.testdt.IVLTSSpecTest
Tests run: 2, Failures: 0, Errors: 0, Skipped: 0, Time elapsed: 6.146 sec
Running net.ihe.gazelle.testdt.PQSpecTest
Tests run: 3, Failures: 0, Errors: 0, Skipped: 0, Time elapsed: 3.912 sec
Running net.ihe.gazelle.testdt.IVLINTSpecTest
Tests run: 1, Failures: 0, Errors: 0, Skipped: 0, Time elapsed: 0.934 sec
Running net.ihe.gazelle.testdt.ADSpecTest
Tests run: 1, Failures: 0, Errors: 0, Skipped: 0, Time elapsed: 3.7 sec
Running net.ihe.gazelle.testdt.RTOSpecTest
Tests run: 1, Failures: 0, Errors: 0, Skipped: 0, Time elapsed: 2.068 sec
Running net.ihe.gazelle.testdt.TSSpecTest
Tests run: 2, Failures: 0, Errors: 0, Skipped: 0, Time elapsed: 12.09 sec
Running net.ihe.gazelle.testdt.ENSpecTest
Tests run: 1, Failures: 0, Errors: 0, Skipped: 0, Time elapsed: 4.85 sec
Running net.ihe.gazelle.testcda.StructuredBodySpecTest
Tests run: 1, Failures: 0, Errors: 0, Skipped: 0, Time elapsed: 5.275 sec
Running net.ihe.gazelle.testcda.IntendedRecipientSpecTest
Tests run: 8, Failures: 0, Errors: 0, Skipped: 0, Time elapsed: 53.041 sec
Running net.ihe.gazelle.testcda.ManufacturedProductSpecTest
Tests run: 2, Failures: 0, Errors: 0, Skipped: 0, Time elapsed: 11.968 sec
Running net.ihe.gazelle.testcda.EncounterSpecTest
Tests run: 3, Failures: 0, Errors: 0, Skipped: 0, Time elapsed: 17.857 sec
Running net.ihe.gazelle.testcda.ObservationRangeSpecTest
Tests run: 3, Failures: 0, Errors: 0, Skipped: 0, Time elapsed: 24.745 sec
Running net.ihe.gazelle.testcda.ActSpecTest
Tests run: 4, Failures: 0, Errors: 0, Skipped: 0, Time elapsed: 18.97 sec
Running net.ihe.gazelle.testcda.CriterionSpecTest
Tests run: 2, Failures: 0, Errors: 0, Skipped: 0, Time elapsed: 9.151 sec
Running net.ihe.gazelle.testcda.PersonSpecTest
Tests run: 2, Failures: 0, Errors: 0, Skipped: 0, Time elapsed: 9.402 sec
Running net.ihe.gazelle.testcda.RegionOfInterestSpecTest
Tests run: 8, Failures: 0, Errors: 0, Skipped: 0, Time elapsed: 46.321 sec
Running net.ihe.gazelle.testcda.OrganizationPartOfSpecTest
Tests run: 3, Failures: 0, Errors: 0, Skipped: 0, Time elapsed: 16.205 sec
Running net.ihe.gazelle.testcda.ExternalActSpecTest
Tests run: 2, Failures: 0, Errors: 0, Skipped: 0, Time elapsed: 10.631 sec
Running net.ihe.gazelle.testcda.EncompassingEncounterSpecTest
Tests run: 2, Failures: 0, Errors: 0, Skipped: 0, Time elapsed: 12.9 sec
Running net.ihe.gazelle.testcda.AssociatedEntitySpecTest
Tests run: 7, Failures: 0, Errors: 0, Skipped: 0, Time elapsed: 46.593 sec
Running net.ihe.gazelle.testcda.ExternalDocumentSpecTest
Tests run: 2, Failures: 0, Errors: 0, Skipped: 0, Time elapsed: 11.71 sec
Running net.ihe.gazelle.testcda.CustodianOrganizationSpecTest
Tests run: 3, Failures: 0, Errors: 0, Skipped: 0, Time elapsed: 15.412 sec
Running net.ihe.gazelle.testcda.HealthCareFacilitySpecTest
Tests run: 3, Failures: 0, Errors: 0, Skipped: 0, Time elapsed: 25.178 sec
Running net.ihe.gazelle.testcda.NonXMLBodySpecTest
Tests run: 2, Failures: 0, Errors: 0, Skipped: 0, Time elapsed: 4.651 sec
Running net.ihe.gazelle.testcda.ClinicalDocumentSpecTest
Tests run: 13, Failures: 0, Errors: 0, Skipped: 0, Time elapsed: 84.762 sec
Running net.ihe.gazelle.testcda.LegalAuthenticatorSpecTest
Tests run: 2, Failures: 0, Errors: 0, Skipped: 0, Time elapsed: 8.292 sec
Running net.ihe.gazelle.testcda.PatientRoleSpecTest
Tests run: 7, Failures: 0, Errors: 0, Skipped: 0, Time elapsed: 42.728 sec
Running net.ihe.gazelle.testcda.SupplySpecTest
Tests run: 5, Failures: 0, Errors: 0, Skipped: 0, Time elapsed: 25.751 sec
Running net.ihe.gazelle.testcda.SpecimenRoleSpecTest
Tests run: 2, Failures: 0, Errors: 0, Skipped: 0, Time elapsed: 9.217 sec
Running net.ihe.gazelle.testcda.SubjectPersonSpecTest
Tests run: 2, Failures: 0, Errors: 0, Skipped: 0, Time elapsed: 9.542 sec
Running net.ihe.gazelle.testcda.PatientSpecTest
Tests run: 3, Failures: 0, Errors: 0, Skipped: 0, Time elapsed: 12.71 sec
Running net.ihe.gazelle.testcda.ExternalProcedureSpecTest
Tests run: 2, Failures: 0, Errors: 0, Skipped: 0, Time elapsed: 9.262 sec
Running net.ihe.gazelle.testcda.GuardianSpecTest
Tests run: 6, Failures: 0, Errors: 0, Skipped: 0, Time elapsed: 27.837 sec
Running net.ihe.gazelle.testcda.OrganizationSpecTest
Tests run: 8, Failures: 0, Errors: 0, Skipped: 0, Time elapsed: 46.179 sec
Running net.ihe.gazelle.testcda.RelatedSubjectSpecTest
Tests run: 4, Failures: 0, Errors: 0, Skipped: 0, Time elapsed: 25.502 sec
Running net.ihe.gazelle.testcda.RelatedEntitySpecTest
Tests run: 4, Failures: 0, Errors: 0, Skipped: 0, Time elapsed: 18.866 sec
Running net.ihe.gazelle.testcda.AuthoringDeviceSpecTest
Tests run: 1, Failures: 0, Errors: 0, Skipped: 0, Time elapsed: 3.57 sec
Running net.ihe.gazelle.testcda.ParentDocumentSpecTest
Tests run: 3, Failures: 0, Errors: 0, Skipped: 0, Time elapsed: 16.689 sec
Running net.ihe.gazelle.testcda.ProcedureSpecTest
Tests run: 10, Failures: 0, Errors: 0, Skipped: 0, Time elapsed: 45.839 sec
Running net.ihe.gazelle.testcda.ObservationMediaSpecTest
Tests run: 2, Failures: 0, Errors: 0, Skipped: 0, Time elapsed: 10.534 sec
Running net.ihe.gazelle.testcda.ParticipantRoleSpecTest
Tests run: 7, Failures: 0, Errors: 0, Skipped: 0, Time elapsed: 46.619 sec
Running net.ihe.gazelle.testcda.EntitySpecTest
Tests run: 2, Failures: 0, Errors: 0, Skipped: 0, Time elapsed: 12.318 sec
Running net.ihe.gazelle.testcda.OrderSpecTest
Tests run: 2, Failures: 0, Errors: 0, Skipped: 0, Time elapsed: 11.617 sec
Running net.ihe.gazelle.testcda.PlayingEntitySpecTest
Tests run: 4, Failures: 0, Errors: 0, Skipped: 0, Time elapsed: 21.985 sec
Running net.ihe.gazelle.testcda.OrganizerSpecTest
Tests run: 2, Failures: 0, Errors: 0, Skipped: 0, Time elapsed: 12.06 sec
Running net.ihe.gazelle.testcda.ObservationSpecTest
Tests run: 13, Failures: 0, Errors: 0, Skipped: 0, Time elapsed: 76.058 sec
Running net.ihe.gazelle.testcda.AssignedEntitySpecTest
Tests run: 5, Failures: 0, Errors: 0, Skipped: 0, Time elapsed: 38.724 sec
Running net.ihe.gazelle.testcda.SubstanceAdministrationSpecTest
Tests run: 5, Failures: 0, Errors: 0, Skipped: 0, Time elapsed: 28.658 sec
Running net.ihe.gazelle.testcda.ServiceEventSpecTest
Tests run: 2, Failures: 0, Errors: 0, Skipped: 0, Time elapsed: 14.471 sec
Running net.ihe.gazelle.testcda.AuthenticatorSpecTest
Tests run: 2, Failures: 0, Errors: 0, Skipped: 0, Time elapsed: 8.103 sec
Running net.ihe.gazelle.testcda.ConsentSpecTest
Tests run: 4, Failures: 0, Errors: 0, Skipped: 0, Time elapsed: 16.44 sec
Running net.ihe.gazelle.testcda.AuthorSpecTest
Tests run: 1, Failures: 0, Errors: 0, Skipped: 0, Time elapsed: 12.871 sec
Running net.ihe.gazelle.testcda.SectionSpecTest
Tests run: 2, Failures: 0, Errors: 0, Skipped: 0, Time elapsed: 10.526 sec
Running net.ihe.gazelle.testcda.ExternalObservationSpecTest
Tests run: 2, Failures: 0, Errors: 0, Skipped: 0, Time elapsed: 12.546 sec
Running net.ihe.gazelle.testcda.AssignedAuthorSpecTest
Tests run: 4, Failures: 0, Errors: 0, Skipped: 0, Time elapsed: 25.094 sec
Running net.ihe.gazelle.testcda.EntrySpecTest
Tests run: 1, Failures: 0, Errors: 0, Skipped: 0, Time elapsed: 3.692 sec
Running net.ihe.gazelle.test.HL7TimeTest
null
Tests run: 3, Failures: 0, Errors: 0, Skipped: 0, Time elapsed: 0.006 sec
Running net.ihe.gazelle.test.UCUMValidatorTest
unit not valid:%[slope]
unit not valid:[Amb'a'1'U]
unit not valid:[AU]
unit not valid:[BAU]
unit not valid:[CCID_50]
unit not valid:[CFU]
unit not valid:[D'ag'U]
unit not valid:[FFU]
unit not valid:[hp'_C]
unit not valid:[hp'_M]
unit not valid:[hp'_Q]
unit not valid:[hp'_X]
unit not valid:[hp_M]
unit not valid:[hp_Q]
unit not valid:[IU]
unit not valid:[kp_C]
unit not valid:[kp_M]
unit not valid:[kp_Q]
unit not valid:[kp_X]
unit not valid:[Lf]
unit not valid:[p'diop]
unit not valid:[PFU]
unit not valid:[PNU]
unit not valid:[smoot]
unit not valid:[TCID_50]
unit not valid:[wood'U]
unit not valid:B[10.nV]
Tests run: 9, Failures: 0, Errors: 0, Skipped: 0, Time elapsed: 0.175 sec
Running net.ihe.gazelle.test.SHAValidationTest
Tests run: 5, Failures: 0, Errors: 0, Skipped: 0, Time elapsed: 0.005 sec
Running net.ihe.gazelle.testbasic.BasicITSTest
Tests run: 3, Failures: 0, Errors: 0, Skipped: 0, Time elapsed: 0.003 sec
Running net.ihe.gazelle.testnblock.TableSpecTest
Tests run: 3, Failures: 0, Errors: 0, Skipped: 0, Time elapsed: 2.799 sec
Running net.ihe.gazelle.testnblock.ParagraphSpecTest
Tests run: 1, Failures: 0, Errors: 0, Skipped: 0, Time elapsed: 1.018 sec
Running net.ihe.gazelle.testnblock.LinkHtmlSpecTest
Tests run: 1, Failures: 0, Errors: 0, Skipped: 0, Time elapsed: 0.966 sec

Results :

Tests run: 263, Failures: 0, Errors: 0, Skipped: 0

[JENKINS] Recording test results
[INFO] 
[INFO] --- jacoco-maven-plugin:0.7.9:report (default-report) @ cdabasic-validator-jar ---
[INFO] Loading execution data file /home/jenkins/.hudson/jobs/cdabasic-validator-jar/workspace/target/jacoco.exec
[INFO] Analyzed bundle 'CDA Basic - Validator' with 85 classes
[INFO] 
[INFO] --- maven-jar-plugin:2.3:jar (default-jar) @ cdabasic-validator-jar ---
[INFO] Building jar: /home/jenkins/.hudson/jobs/cdabasic-validator-jar/workspace/target/cdabasic-validator-jar-1.1.2-SNAPSHOT.jar
[INFO] 
[INFO] --- maven-install-plugin:2.4:install (default-install) @ cdabasic-validator-jar ---
[INFO] Installing /home/jenkins/.hudson/jobs/cdabasic-validator-jar/workspace/target/cdabasic-validator-jar-1.1.2-SNAPSHOT.jar to /home/jenkins/.m2/repository/net/ihe/gazelle/cdabasic-validator-jar/1.1.2-SNAPSHOT/cdabasic-validator-jar-1.1.2-SNAPSHOT.jar
[INFO] Installing /home/jenkins/.hudson/jobs/cdabasic-validator-jar/workspace/pom.xml to /home/jenkins/.m2/repository/net/ihe/gazelle/cdabasic-validator-jar/1.1.2-SNAPSHOT/cdabasic-validator-jar-1.1.2-SNAPSHOT.pom
Collecting metadata...
Metadata collection done.
Started calculate disk usage of build
Finished Calculation of disk usage of build in 0 seconds
Started calculate disk usage of workspace
Finished Calculation of disk usage of workspace in 0 seconds
[Checks API] No suitable checks publisher found.
[INFO] 
[INFO] ------------------------------------------------------------------------
[INFO] Building CDA Basic - Validator 1.1.2-SNAPSHOT
[INFO] ------------------------------------------------------------------------
[INFO] 
[INFO] --- sonar-maven-plugin:3.7.0.1746:sonar (default-cli) @ cdabasic-validator-jar ---
[INFO] User cache: /home/jenkins/.sonar/cache
[INFO] SonarQube version: 7.3.0
[INFO] Default locale: "en_GB", source code encoding: "UTF-8"
[INFO] Publish mode
[INFO] Load global settings
[INFO] Load global settings (done) | time=133ms
[INFO] Server id: A7EE8CF2-1e5f71089284882
[INFO] User cache: /home/jenkins/.sonar/cache
[INFO] Load/download plugins
[INFO] Load plugins index
[INFO] Load plugins index (done) | time=47ms
[INFO] Plugin [l10nfr] defines 'l10nen' as base plugin. This metadata can be removed from manifest of l10n plugins since version 5.2.
[INFO] Plugin [l10nde] defines 'l10nen' as base plugin. This metadata can be removed from manifest of l10n plugins since version 5.2.
[INFO] Plugin [l10nel] defines 'l10nen' as base plugin. This metadata can be removed from manifest of l10n plugins since version 5.2.
[INFO] Plugin [l10nit] defines 'l10nen' as base plugin. This metadata can be removed from manifest of l10n plugins since version 5.2.
[INFO] Plugin [l10nja] defines 'l10nen' as base plugin. This metadata can be removed from manifest of l10n plugins since version 5.2.
[INFO] Plugin [l10nko] defines 'l10nen' as base plugin. This metadata can be removed from manifest of l10n plugins since version 5.2.
[INFO] Load/download plugins (done) | time=63ms
[INFO] Loaded core extensions: 
[INFO] Sonargraph Integration: Custom metrics file '/home/jenkins/.sonargraphintegration/metrics.properties' not found
[INFO] Sonargraph Integration: Created 54 predefined and 0 custom metric(s)
[INFO] Process project properties
[INFO] Execute project builders
[INFO] Execute project builders (done) | time=2ms
[INFO] Load project repositories
[INFO] Load project repositories (done) | time=86ms
[INFO] Load quality profiles
[INFO] Load quality profiles (done) | time=30ms
[INFO] Load active rules
[INFO] Load active rules (done) | time=448ms
[INFO] Load metrics repository
[INFO] Load metrics repository (done) | time=20ms
[INFO] Project key: net.ihe.gazelle:cdabasic-validator-jar
[INFO] Project base dir: /home/jenkins/.hudson/jobs/cdabasic-validator-jar/workspace
[INFO] -------------  Scan CDA Basic - Validator
[INFO] Base dir: /home/jenkins/.hudson/jobs/cdabasic-validator-jar/workspace
[INFO] Working dir: /home/jenkins/.hudson/jobs/cdabasic-validator-jar/workspace/target/sonar
[INFO] Source paths: pom.xml, src/main/java
[INFO] Test paths: src/test/java
[INFO] Source encoding: UTF-8, default locale: en_GB
[INFO] Load server rules
[INFO] Load server rules (done) | time=84ms
[INFO] Index files
[INFO] 183 files indexed
[INFO] Quality profile for java: Sonar way with Findbugs
[INFO] Quality profile for xml: Sonar way
[INFO] Sensor JavaSquidSensor [java]
[INFO] Configured Java source version (sonar.java.source): 7
[INFO] JavaClasspath initialization
[INFO] JavaClasspath initialization (done) | time=8ms
[INFO] JavaTestClasspath initialization
[INFO] JavaTestClasspath initialization (done) | time=2ms
[INFO] Java Main Files AST scan
[INFO] 84 source files to be analyzed
[INFO] 84/84 source files have been analyzed
[INFO] Java Main Files AST scan (done) | time=8863ms
[INFO] Java Test Files AST scan
[INFO] 98 source files to be analyzed
[INFO] 98/98 source files have been analyzed
[INFO] Java Test Files AST scan (done) | time=1180ms
[INFO] Sensor JavaSquidSensor [java] (done) | time=10426ms
[INFO] Sensor SurefireSensor [java]
[INFO] parsing [/home/jenkins/.hudson/jobs/cdabasic-validator-jar/workspace/target/surefire-reports]
[INFO] Sensor SurefireSensor [java] (done) | time=86ms
[INFO] Sensor JaCoCoSensor [java]
[INFO] Analysing /home/jenkins/.hudson/jobs/cdabasic-validator-jar/workspace/target/jacoco.exec
[INFO] No information about coverage per test.
[INFO] Sensor JaCoCoSensor [java] (done) | time=237ms
[INFO] Sensor JavaXmlSensor [java]
[INFO] 1 source files to be analyzed
[INFO] Sensor JavaXmlSensor [java] (done) | time=121ms
[INFO] 1/1 source files have been analyzed
[INFO] Sensor Sonargraph Integration [sonargraphintegration]
[INFO] Sonargraph Integration: Processing project 'net.ihe.gazelle:cdabasic-validator-jar'
[WARNING] Sonargraph Integration: XML report file '/home/jenkins/.hudson/jobs/cdabasic-validator-jar/workspace/target/sonargraph/sonargraph-sonarqube-report.xml' not found
[INFO] Sonargraph Integration: Finished processing project 'net.ihe.gazelle:cdabasic-validator-jar'
[INFO] Sensor Sonargraph Integration [sonargraphintegration] (done) | time=0ms
[INFO] Sensor HTML [web]
[INFO] Sensor HTML [web] (done) | time=12ms
[INFO] Sensor XML Sensor [xml]
[INFO] 1 source files to be analyzed
[INFO] Sensor XML Sensor [xml] (done) | time=101ms
[INFO] 1/1 source files have been analyzed
[INFO] Sensor FindBugs Sensor [findbugs]
[INFO] Loading findbugs plugin: /home/jenkins/.hudson/jobs/cdabasic-validator-jar/workspace/target/sonar/findbugs/fb-contrib.jar
[INFO] Loading findbugs plugin: /home/jenkins/.hudson/jobs/cdabasic-validator-jar/workspace/target/sonar/findbugs/findsecbugs-plugin.jar
[INFO] Findbugs output report: /home/jenkins/.hudson/jobs/cdabasic-validator-jar/workspace/target/sonar/findbugs-result.xml
[INFO] Sensor FindBugs Sensor [findbugs] (done) | time=11733ms
[INFO] Sensor Zero Coverage Sensor
[INFO] Sensor Zero Coverage Sensor (done) | time=67ms
[INFO] Sensor Java CPD Block Indexer
[INFO] Sensor Java CPD Block Indexer (done) | time=157ms
[INFO] SCM Publisher is disabled
[INFO] Calculating CPD for 84 files
[WARNING] Too many duplication references on file src/main/java/net/ihe/gazelle/cda/cdabasic/PersonSpecValidator.java for block at line 119. Keep only the first 100 references.
[WARNING] Too many duplication references on file src/main/java/net/ihe/gazelle/cda/cdabasic/PersonSpecValidator.java for block at line 121. Keep only the first 100 references.
[WARNING] Too many duplication references on file src/main/java/net/ihe/gazelle/cda/cdabasic/HealthCareFacilitySpecValidator.java for block at line 131. Keep only the first 100 references.
[WARNING] Too many duplication references on file src/main/java/net/ihe/gazelle/cda/cdabasic/HealthCareFacilitySpecValidator.java for block at line 133. Keep only the first 100 references.
[WARNING] Too many duplication references on file src/main/java/net/ihe/gazelle/cda/cdabasic/PlayingEntitySpecValidator.java for block at line 187. Keep only the first 100 references.
[WARNING] Too many duplication references on file src/main/java/net/ihe/gazelle/cda/cdabasic/PlayingEntitySpecValidator.java for block at line 189. Keep only the first 100 references.
[WARNING] Too many duplication references on file src/main/java/net/ihe/gazelle/cda/cdabasic/LegalAuthenticatorSpecValidator.java for block at line 74. Keep only the first 100 references.
[WARNING] Too many duplication references on file src/main/java/net/ihe/gazelle/cda/cdabasic/LegalAuthenticatorSpecValidator.java for block at line 76. Keep only the first 100 references.
[WARNING] Too many duplication references on file src/main/java/net/ihe/gazelle/cda/cdabasic/EntrySpecValidator.java for block at line 64. Keep only the first 100 references.
[WARNING] Too many duplication references on file src/main/java/net/ihe/gazelle/cda/cdabasic/EntrySpecValidator.java for block at line 66. Keep only the first 100 references.
[WARNING] Too many duplication references on file src/main/java/net/ihe/gazelle/cda/cdanblock/LinkHtmlSpecValidator.java for block at line 66. Keep only the first 100 references.
[WARNING] Too many duplication references on file src/main/java/net/ihe/gazelle/cda/cdadt/IVLPQSpecValidator.java for block at line 95. Keep only the first 100 references.
[WARNING] Too many duplication references on file src/main/java/net/ihe/gazelle/cda/cdadt/IVLPQSpecValidator.java for block at line 97. Keep only the first 100 references.
[WARNING] Too many duplication references on file src/main/java/net/ihe/gazelle/cda/cdadt/EIVLEventSpecValidator.java for block at line 61. Keep only the first 100 references.
[WARNING] Too many duplication references on file src/main/java/net/ihe/gazelle/cda/cdadt/EIVLEventSpecValidator.java for block at line 63. Keep only the first 100 references.
[WARNING] Too many duplication references on file src/main/java/net/ihe/gazelle/cda/cdadt/TNSpecValidator.java for block at line 77. Keep only the first 100 references.
[WARNING] Too many duplication references on file src/main/java/net/ihe/gazelle/cda/cdadt/TNSpecValidator.java for block at line 79. Keep only the first 100 references.
[WARNING] Too many duplication references on file src/main/java/net/ihe/gazelle/cda/cdabasic/ExternalProcedureSpecValidator.java for block at line 119. Keep only the first 100 references.
[WARNING] Too many duplication references on file src/main/java/net/ihe/gazelle/cda/cdabasic/ExternalProcedureSpecValidator.java for block at line 121. Keep only the first 100 references.
[WARNING] Too many duplication references on file src/main/java/net/ihe/gazelle/cda/cdadt/TSSpecValidator.java for block at line 85. Keep only the first 100 references.
[WARNING] Too many duplication references on file src/main/java/net/ihe/gazelle/cda/cdadt/TSSpecValidator.java for block at line 87. Keep only the first 100 references.
[WARNING] Too many duplication references on file src/main/java/net/ihe/gazelle/cda/cdadt/PIVLPPDTSSpecValidator.java for block at line 61. Keep only the first 100 references.
[WARNING] Too many duplication references on file src/main/java/net/ihe/gazelle/cda/cdadt/PIVLPPDTSSpecValidator.java for block at line 63. Keep only the first 100 references.
[WARNING] Too many duplication references on file src/main/java/net/ihe/gazelle/cda/cdadt/IISpecValidator.java for block at line 72. Keep only the first 100 references.
[WARNING] Too many duplication references on file src/main/java/net/ihe/gazelle/cda/cdadt/IISpecValidator.java for block at line 74. Keep only the first 100 references.
[WARNING] Too many duplication references on file src/main/java/net/ihe/gazelle/cda/cdabasic/PatientSpecValidator.java for block at line 131. Keep only the first 100 references.
[WARNING] Too many duplication references on file src/main/java/net/ihe/gazelle/cda/cdabasic/PatientSpecValidator.java for block at line 133. Keep only the first 100 references.
[WARNING] Too many duplication references on file src/main/java/net/ihe/gazelle/cda/cdanblock/ParagraphSpecValidator.java for block at line 80. Keep only the first 100 references.
[WARNING] Too many duplication references on file src/main/java/net/ihe/gazelle/cda/cdanblock/ParagraphSpecValidator.java for block at line 82. Keep only the first 100 references.
[WARNING] Too many duplication references on file src/main/java/net/ihe/gazelle/cda/cdabasic/OrganizationPartOfSpecValidator.java for block at line 130. Keep only the first 100 references.
[WARNING] Too many duplication references on file src/main/java/net/ihe/gazelle/cda/cdabasic/OrganizationPartOfSpecValidator.java for block at line 132. Keep only the first 100 references.
[WARNING] Too many duplication references on file src/main/java/net/ihe/gazelle/cda/cdadt/ANYSpecValidator.java for block at line 74. Keep only the first 100 references.
[WARNING] Too many duplication references on file src/main/java/net/ihe/gazelle/cda/cdadt/ANYSpecValidator.java for block at line 76. Keep only the first 100 references.
[WARNING] Too many duplication references on file src/main/java/net/ihe/gazelle/cda/cdabasic/RelatedEntitySpecValidator.java for block at line 187. Keep only the first 100 references.
[WARNING] Too many duplication references on file src/main/java/net/ihe/gazelle/cda/cdabasic/RelatedEntitySpecValidator.java for block at line 189. Keep only the first 100 references.
[WARNING] Too many duplication references on file src/main/java/net/ihe/gazelle/cda/cdabasic/ParticipantRoleSpecValidator.java for block at line 267. Keep only the first 100 references.
[WARNING] Too many duplication references on file src/main/java/net/ihe/gazelle/cda/cdabasic/ParticipantRoleSpecValidator.java for block at line 269. Keep only the first 100 references.
[WARNING] Too many duplication references on file src/main/java/net/ihe/gazelle/cda/cdabasic/EncounterSpecValidator.java for block at line 130. Keep only the first 100 references.
[WARNING] Too many duplication references on file src/main/java/net/ihe/gazelle/cda/cdabasic/EncounterSpecValidator.java for block at line 132. Keep only the first 100 references.
[WARNING] Too many duplication references on file src/main/java/net/ihe/gazelle/cda/cdabasic/GuardianSpecValidator.java for block at line 255. Keep only the first 100 references.
[WARNING] Too many duplication references on file src/main/java/net/ihe/gazelle/cda/cdabasic/GuardianSpecValidator.java for block at line 257. Keep only the first 100 references.
[WARNING] Too many duplication references on file src/main/java/net/ihe/gazelle/cda/cdadt/IVLTSSpecValidator.java for block at line 85. Keep only the first 100 references.
[WARNING] Too many duplication references on file src/main/java/net/ihe/gazelle/cda/cdadt/IVLTSSpecValidator.java for block at line 87. Keep only the first 100 references.
[WARNING] Too many duplication references on file src/main/java/net/ihe/gazelle/cda/cdabasic/ActSpecValidator.java for block at line 141. Keep only the first 100 references.
[WARNING] Too many duplication references on file src/main/java/net/ihe/gazelle/cda/cdabasic/ActSpecValidator.java for block at line 143. Keep only the first 100 references.
[WARNING] Too many duplication references on file src/main/java/net/ihe/gazelle/cda/cdabasic/ParentDocumentSpecValidator.java for block at line 146. Keep only the first 100 references.
[WARNING] Too many duplication references on file src/main/java/net/ihe/gazelle/cda/cdabasic/ParentDocumentSpecValidator.java for block at line 148. Keep only the first 100 references.
[WARNING] Too many duplication references on file src/main/java/net/ihe/gazelle/cda/cdabasic/ObservationMediaSpecValidator.java for block at line 119. Keep only the first 100 references.
[WARNING] Too many duplication references on file src/main/java/net/ihe/gazelle/cda/cdabasic/ObservationMediaSpecValidator.java for block at line 121. Keep only the first 100 references.
[WARNING] Too many duplication references on file src/main/java/net/ihe/gazelle/cda/cdabasic/ServiceEventSpecValidator.java for block at line 119. Keep only the first 100 references.
[WARNING] Too many duplication references on file src/main/java/net/ihe/gazelle/cda/cdabasic/ServiceEventSpecValidator.java for block at line 121. Keep only the first 100 references.
[WARNING] Too many duplication references on file src/main/java/net/ihe/gazelle/cda/cdadt/SCSpecValidator.java for block at line 77. Keep only the first 100 references.
[WARNING] Too many duplication references on file src/main/java/net/ihe/gazelle/cda/cdadt/SCSpecValidator.java for block at line 79. Keep only the first 100 references.
[WARNING] Too many duplication references on file src/main/java/net/ihe/gazelle/cda/cdadt/URLSpecValidator.java for block at line 116. Keep only the first 100 references.
[WARNING] Too many duplication references on file src/main/java/net/ihe/gazelle/cda/cdadt/URLSpecValidator.java for block at line 118. Keep only the first 100 references.
[WARNING] Too many duplication references on file src/main/java/net/ihe/gazelle/cda/cdabasic/AuthenticatorSpecValidator.java for block at line 74. Keep only the first 100 references.
[WARNING] Too many duplication references on file src/main/java/net/ihe/gazelle/cda/cdabasic/AuthenticatorSpecValidator.java for block at line 76. Keep only the first 100 references.
[WARNING] Too many duplication references on file src/main/java/net/ihe/gazelle/cda/cdabasic/SubjectPersonSpecValidator.java for block at line 119. Keep only the first 100 references.
[WARNING] Too many duplication references on file src/main/java/net/ihe/gazelle/cda/cdabasic/SubjectPersonSpecValidator.java for block at line 121. Keep only the first 100 references.
[WARNING] Too many duplication references on file src/main/java/net/ihe/gazelle/cda/cdabasic/CustodianOrganizationSpecValidator.java for block at line 146. Keep only the first 100 references.
[WARNING] Too many duplication references on file src/main/java/net/ihe/gazelle/cda/cdabasic/CustodianOrganizationSpecValidator.java for block at line 148. Keep only the first 100 references.
[WARNING] Too many duplication references on file src/main/java/net/ihe/gazelle/cda/cdabasic/SpecimenRoleSpecValidator.java for block at line 119. Keep only the first 100 references.
[WARNING] Too many duplication references on file src/main/java/net/ihe/gazelle/cda/cdabasic/SpecimenRoleSpecValidator.java for block at line 121. Keep only the first 100 references.
[WARNING] Too many duplication references on file src/main/java/net/ihe/gazelle/cda/cdabasic/RegionOfInterestSpecValidator.java for block at line 247. Keep only the first 100 references.
[WARNING] Too many duplication references on file src/main/java/net/ihe/gazelle/cda/cdabasic/RegionOfInterestSpecValidator.java for block at line 249. Keep only the first 100 references.
[WARNING] Too many duplication references on file src/main/java/net/ihe/gazelle/cda/cdabasic/ManufacturedProductSpecValidator.java for block at line 119. Keep only the first 100 references.
[WARNING] Too many duplication references on file src/main/java/net/ihe/gazelle/cda/cdabasic/ManufacturedProductSpecValidator.java for block at line 121. Keep only the first 100 references.
[WARNING] Too many duplication references on file src/main/java/net/ihe/gazelle/cda/cdadt/IVLINTSpecValidator.java for block at line 61. Keep only the first 100 references.
[WARNING] Too many duplication references on file src/main/java/net/ihe/gazelle/cda/cdadt/IVLINTSpecValidator.java for block at line 63. Keep only the first 100 references.
[WARNING] Too many duplication references on file src/main/java/net/ihe/gazelle/cda/cdabasic/OrganizerSpecValidator.java for block at line 119. Keep only the first 100 references.
[WARNING] Too many duplication references on file src/main/java/net/ihe/gazelle/cda/cdabasic/OrganizerSpecValidator.java for block at line 121. Keep only the first 100 references.
[WARNING] Too many duplication references on file src/main/java/net/ihe/gazelle/cda/cdadt/RTOSpecValidator.java for block at line 62. Keep only the first 100 references.
[WARNING] Too many duplication references on file src/main/java/net/ihe/gazelle/cda/cdadt/RTOSpecValidator.java for block at line 64. Keep only the first 100 references.
[WARNING] Too many duplication references on file src/main/java/net/ihe/gazelle/cda/cdabasic/ClinicalDocumentSpecValidator.java for block at line 307. Keep only the first 100 references.
[WARNING] Too many duplication references on file src/main/java/net/ihe/gazelle/cda/cdabasic/ClinicalDocumentSpecValidator.java for block at line 309. Keep only the first 100 references.
[WARNING] Too many duplication references on file src/main/java/net/ihe/gazelle/cda/cdabasic/PatientRoleSpecValidator.java for block at line 267. Keep only the first 100 references.
[WARNING] Too many duplication references on file src/main/java/net/ihe/gazelle/cda/cdabasic/PatientRoleSpecValidator.java for block at line 269. Keep only the first 100 references.
[WARNING] Too many duplication references on file src/main/java/net/ihe/gazelle/cda/cdadt/PNSpecValidator.java for block at line 182. Keep only the first 100 references.
[WARNING] Too many duplication references on file src/main/java/net/ihe/gazelle/cda/cdadt/PNSpecValidator.java for block at line 184. Keep only the first 100 references.
[WARNING] Too many duplication references on file src/main/java/net/ihe/gazelle/cda/cdadt/IVLREALSpecValidator.java for block at line 61. Keep only the first 100 references.
[WARNING] Too many duplication references on file src/main/java/net/ihe/gazelle/cda/cdadt/IVLREALSpecValidator.java for block at line 63. Keep only the first 100 references.
[WARNING] Too many duplication references on file src/main/java/net/ihe/gazelle/cda/cdadt/EDSpecValidator.java for block at line 204. Keep only the first 100 references.
[WARNING] Too many duplication references on file src/main/java/net/ihe/gazelle/cda/cdadt/EDSpecValidator.java for block at line 182. Keep only the first 100 references.
[WARNING] Too many duplication references on file src/main/java/net/ihe/gazelle/cda/cdabasic/SupplySpecValidator.java for block at line 198. Keep only the first 100 references.
[WARNING] Too many duplication references on file src/main/java/net/ihe/gazelle/cda/cdabasic/SupplySpecValidator.java for block at line 200. Keep only the first 100 references.
[WARNING] Too many duplication references on file src/main/java/net/ihe/gazelle/cda/cdabasic/EncompassingEncounterSpecValidator.java for block at line 119. Keep only the first 100 references.
[WARNING] Too many duplication references on file src/main/java/net/ihe/gazelle/cda/cdabasic/EncompassingEncounterSpecValidator.java for block at line 121. Keep only the first 100 references.
[WARNING] Too many duplication references on file src/main/java/net/ihe/gazelle/cda/cdabasic/StructuredBodySpecValidator.java for block at line 62. Keep only the first 100 references.
[WARNING] Too many duplication references on file src/main/java/net/ihe/gazelle/cda/cdabasic/StructuredBodySpecValidator.java for block at line 64. Keep only the first 100 references.
[WARNING] Too many duplication references on file src/main/java/net/ihe/gazelle/cda/cdadt/ENSpecValidator.java for block at line 91. Keep only the first 100 references.
[WARNING] Too many duplication references on file src/main/java/net/ihe/gazelle/cda/cdadt/ENSpecValidator.java for block at line 93. Keep only the first 100 references.
[WARNING] Too many duplication references on file src/main/java/net/ihe/gazelle/cda/cdabasic/OrganizationSpecValidator.java for block at line 323. Keep only the first 100 references.
[WARNING] Too many duplication references on file src/main/java/net/ihe/gazelle/cda/cdabasic/OrganizationSpecValidator.java for block at line 325. Keep only the first 100 references.
[WARNING] Too many duplication references on file src/main/java/net/ihe/gazelle/cda/cdadt/TELSpecValidator.java for block at line 91. Keep only the first 100 references.
[WARNING] Too many duplication references on file src/main/java/net/ihe/gazelle/cda/cdadt/TELSpecValidator.java for block at line 93. Keep only the first 100 references.
[WARNING] Too many duplication references on file src/main/java/net/ihe/gazelle/cda/cdadt/MOSpecValidator.java for block at line 61. Keep only the first 100 references.
[WARNING] Too many duplication references on file src/main/java/net/ihe/gazelle/cda/cdadt/MOSpecValidator.java for block at line 63. Keep only the first 100 references.
[WARNING] Too many duplication references on file src/main/java/net/ihe/gazelle/cda/cdabasic/AuthorSpecValidator.java for block at line 62. Keep only the first 100 references.
[WARNING] Too many duplication references on file src/main/java/net/ihe/gazelle/cda/cdabasic/AuthorSpecValidator.java for block at line 64. Keep only the first 100 references.
[WARNING] Too many duplication references on file src/main/java/net/ihe/gazelle/cda/cdabasic/ObservationRangeSpecValidator.java for block at line 108. Keep only the first 100 references.
[WARNING] Too many duplication references on file src/main/java/net/ihe/gazelle/cda/cdabasic/ObservationRangeSpecValidator.java for block at line 110. Keep only the first 100 references.
[WARNING] Too many duplication references on file src/main/java/net/ihe/gazelle/cda/cdabasic/AuthoringDeviceSpecValidator.java for block at line 64. Keep only the first 100 references.
[WARNING] Too many duplication references on file src/main/java/net/ihe/gazelle/cda/cdadt/PIVLTSSpecValidator.java for block at line 77. Keep only the first 100 references.
[WARNING] Too many duplication references on file src/main/java/net/ihe/gazelle/cda/cdadt/PIVLTSSpecValidator.java for block at line 79. Keep only the first 100 references.
[WARNING] Too many duplication references on file src/main/java/net/ihe/gazelle/cda/cdabasic/ObservationSpecValidator.java for block at line 428. Keep only the first 100 references.
[WARNING] Too many duplication references on file src/main/java/net/ihe/gazelle/cda/cdabasic/ObservationSpecValidator.java for block at line 430. Keep only the first 100 references.
[WARNING] Too many duplication references on file src/main/java/net/ihe/gazelle/cda/cdabasic/SubstanceAdministrationSpecValidator.java for block at line 198. Keep only the first 100 references.
[WARNING] Too many duplication references on file src/main/java/net/ihe/gazelle/cda/cdabasic/SubstanceAdministrationSpecValidator.java for block at line 200. Keep only the first 100 references.
[WARNING] Too many duplication references on file src/main/java/net/ihe/gazelle/cda/cdabasic/ProcedureSpecValidator.java for block at line 344. Keep only the first 100 references.
[WARNING] Too many duplication references on file src/main/java/net/ihe/gazelle/cda/cdabasic/ProcedureSpecValidator.java for block at line 346. Keep only the first 100 references.
[WARNING] Too many duplication references on file src/main/java/net/ihe/gazelle/cda/cdabasic/CriterionSpecValidator.java for block at line 97. Keep only the first 100 references.
[WARNING] Too many duplication references on file src/main/java/net/ihe/gazelle/cda/cdabasic/CriterionSpecValidator.java for block at line 99. Keep only the first 100 references.
[WARNING] Too many duplication references on file src/main/java/net/ihe/gazelle/cda/cdabasic/IntendedRecipientSpecValidator.java for block at line 279. Keep only the first 100 references.
[WARNING] Too many duplication references on file src/main/java/net/ihe/gazelle/cda/cdabasic/IntendedRecipientSpecValidator.java for block at line 281. Keep only the first 100 references.
[WARNING] Too many duplication references on file src/main/java/net/ihe/gazelle/cda/cdabasic/EntitySpecValidator.java for block at line 119. Keep only the first 100 references.
[WARNING] Too many duplication references on file src/main/java/net/ihe/gazelle/cda/cdabasic/EntitySpecValidator.java for block at line 121. Keep only the first 100 references.
[WARNING] Too many duplication references on file src/main/java/net/ihe/gazelle/cda/cdadt/CDSpecValidator.java for block at line 207. Keep only the first 100 references.
[WARNING] Too many duplication references on file src/main/java/net/ihe/gazelle/cda/cdadt/CDSpecValidator.java for block at line 209. Keep only the first 100 references.
[WARNING] Too many duplication references on file src/main/java/net/ihe/gazelle/cda/cdabasic/ConsentSpecValidator.java for block at line 141. Keep only the first 100 references.
[WARNING] Too many duplication references on file src/main/java/net/ihe/gazelle/cda/cdabasic/ConsentSpecValidator.java for block at line 143. Keep only the first 100 references.
[WARNING] Too many duplication references on file src/main/java/net/ihe/gazelle/cda/cdadt/ENXPSpecValidator.java for block at line 91. Keep only the first 100 references.
[WARNING] Too many duplication references on file src/main/java/net/ihe/gazelle/cda/cdadt/ENXPSpecValidator.java for block at line 93. Keep only the first 100 references.
[WARNING] Too many duplication references on file src/main/java/net/ihe/gazelle/cda/cdadt/CSSpecValidator.java for block at line 61. Keep only the first 100 references.
[WARNING] Too many duplication references on file src/main/java/net/ihe/gazelle/cda/cdadt/CSSpecValidator.java for block at line 63. Keep only the first 100 references.
[WARNING] Too many duplication references on file src/main/java/net/ihe/gazelle/cda/cdabasic/ExternalObservationSpecValidator.java for block at line 119. Keep only the first 100 references.
[WARNING] Too many duplication references on file src/main/java/net/ihe/gazelle/cda/cdabasic/ExternalObservationSpecValidator.java for block at line 121. Keep only the first 100 references.
[WARNING] Too many duplication references on file src/main/java/net/ihe/gazelle/cda/cdabasic/AssignedAuthorSpecValidator.java for block at line 187. Keep only the first 100 references.
[WARNING] Too many duplication references on file src/main/java/net/ihe/gazelle/cda/cdabasic/AssignedAuthorSpecValidator.java for block at line 189. Keep only the first 100 references.
[WARNING] Too many duplication references on file src/main/java/net/ihe/gazelle/cda/cdabasic/SectionSpecValidator.java for block at line 91. Keep only the first 100 references.
[WARNING] Too many duplication references on file src/main/java/net/ihe/gazelle/cda/cdabasic/SectionSpecValidator.java for block at line 93. Keep only the first 100 references.
[WARNING] Too many duplication references on file src/main/java/net/ihe/gazelle/cda/cdabasic/ExternalDocumentSpecValidator.java for block at line 119. Keep only the first 100 references.
[WARNING] Too many duplication references on file src/main/java/net/ihe/gazelle/cda/cdabasic/ExternalDocumentSpecValidator.java for block at line 121. Keep only the first 100 references.
[WARNING] Too many duplication references on file src/main/java/net/ihe/gazelle/cda/cdanblock/TableSpecValidator.java for block at line 88. Keep only the first 100 references.
[WARNING] Too many duplication references on file src/main/java/net/ihe/gazelle/cda/cdabasic/RelatedSubjectSpecValidator.java for block at line 187. Keep only the first 100 references.
[WARNING] Too many duplication references on file src/main/java/net/ihe/gazelle/cda/cdabasic/RelatedSubjectSpecValidator.java for block at line 189. Keep only the first 100 references.
[WARNING] Too many duplication references on file src/main/java/net/ihe/gazelle/cda/cdabasic/ExternalActSpecValidator.java for block at line 119. Keep only the first 100 references.
[WARNING] Too many duplication references on file src/main/java/net/ihe/gazelle/cda/cdabasic/ExternalActSpecValidator.java for block at line 121. Keep only the first 100 references.
[WARNING] Too many duplication references on file src/main/java/net/ihe/gazelle/cda/cdabasic/AssignedEntitySpecValidator.java for block at line 206. Keep only the first 100 references.
[WARNING] Too many duplication references on file src/main/java/net/ihe/gazelle/cda/cdabasic/AssignedEntitySpecValidator.java for block at line 208. Keep only the first 100 references.
[WARNING] Too many duplication references on file src/main/java/net/ihe/gazelle/cda/cdadt/ADSpecValidator.java for block at line 73. Keep only the first 100 references.
[WARNING] Too many duplication references on file src/main/java/net/ihe/gazelle/cda/cdadt/ADSpecValidator.java for block at line 75. Keep only the first 100 references.
[WARNING] Too many duplication references on file src/main/java/net/ihe/gazelle/cda/cdabasic/NonXMLBodySpecValidator.java for block at line 140. Keep only the first 100 references.
[WARNING] Too many duplication references on file src/main/java/net/ihe/gazelle/cda/cdabasic/NonXMLBodySpecValidator.java for block at line 142. Keep only the first 100 references.
[WARNING] Too many duplication references on file src/main/java/net/ihe/gazelle/cda/cdabasic/OrderSpecValidator.java for block at line 119. Keep only the first 100 references.
[WARNING] Too many duplication references on file src/main/java/net/ihe/gazelle/cda/cdabasic/OrderSpecValidator.java for block at line 121. Keep only the first 100 references.
[WARNING] Too many duplication references on file src/main/java/net/ihe/gazelle/cda/cdadt/PQSpecValidator.java for block at line 134. Keep only the first 100 references.
[WARNING] Too many duplication references on file src/main/java/net/ihe/gazelle/cda/cdadt/PQSpecValidator.java for block at line 136. Keep only the first 100 references.
[WARNING] Too many duplication references on file src/main/java/net/ihe/gazelle/cda/cdabasic/AssociatedEntitySpecValidator.java for block at line 267. Keep only the first 100 references.
[WARNING] Too many duplication references on file src/main/java/net/ihe/gazelle/cda/cdabasic/AssociatedEntitySpecValidator.java for block at line 269. Keep only the first 100 references.
[WARNING] Too many duplication references on file src/main/java/net/ihe/gazelle/cda/cdadt/CRSpecValidator.java for block at line 61. Keep only the first 100 references.
[WARNING] Too many duplication references on file src/main/java/net/ihe/gazelle/cda/cdadt/CRSpecValidator.java for block at line 63. Keep only the first 100 references.
[INFO] CPD calculation finished
[INFO] Analysis report generated in 218ms, dir size=1 MB
[INFO] Analysis reports compressed in 256ms, zip size=740 KB
[INFO] Analysis report uploaded in 72ms
[INFO] ANALYSIS SUCCESSFUL, you can browse https://gazelle.ihe.net/sonar/dashboard?id=net.ihe.gazelle%3Acdabasic-validator-jar
[INFO] Note that you will be able to access the updated dashboard once the server has processed the submitted analysis report
[INFO] More about the report processing at https://gazelle.ihe.net/sonar/api/ce/task?id=AXVYoED7Kg8BlPPufCAQ
[INFO] Task total time: 26.479 s
Collecting metadata...
[WARNING] The following metadata could not be added due to conflict with existing values:
	build

Metadata collection done.
Started calculate disk usage of build
Finished Calculation of disk usage of build in 0 seconds
Started calculate disk usage of workspace
Finished Calculation of disk usage of workspace in 0 seconds
[Checks API] No suitable checks publisher found.
[INFO] ------------------------------------------------------------------------
[INFO] BUILD SUCCESS
[INFO] ------------------------------------------------------------------------
[INFO] Total time: 22:27 min
[INFO] Finished at: 2020-10-24T05:21:39+02:00
[INFO] Final Memory: 50M/1612M
[INFO] ------------------------------------------------------------------------
[WARNING] The requested profile "production" could not be activated because it does not exist.
Waiting for Jenkins to finish collecting data