FailedConsole Output

Started by an SCM change
Running as SYSTEM
[EnvInject] - Loading node environment variables.
Building on master in workspace /home/jenkins/.hudson/jobs/fhir-util(HEAD)/workspace
The recommended git tool is: NONE
using credential 2ad325d5-1ad7-4c47-8fa6-7511b68f7a9e
 > git rev-parse --is-inside-work-tree # timeout=10
Fetching changes from the remote Git repository
 > git config remote.origin.url git@gitlab.inria.fr:gazelle/library/fhir-util.git # timeout=10
Fetching upstream changes from git@gitlab.inria.fr:gazelle/library/fhir-util.git
 > git --version # timeout=10
 > git --version # 'git version 2.11.0'
using GIT_SSH to set credentials 
 > git fetch --tags --progress -- git@gitlab.inria.fr:gazelle/library/fhir-util.git +refs/heads/*:refs/remotes/origin/* # timeout=10
Seen branch in repository origin/develop
Seen branch in repository origin/feature/FHIRVAL-61
Seen branch in repository origin/feature/Passation
Seen branch in repository origin/master
Seen 4 remote branches
 > git show-ref --tags -d # timeout=10
Multiple candidate revisions
Scheduling another build to catch up with fhir-util(HEAD)
Checking out Revision d32a1b331e3a2dad36c5d5c73b06017c5478423d (origin/develop)
 > git config core.sparsecheckout # timeout=10
 > git checkout -f d32a1b331e3a2dad36c5d5c73b06017c5478423d # timeout=10
 > git branch -a -v --no-abbrev # timeout=10
 > git branch -D master # timeout=10
 > git checkout -b master d32a1b331e3a2dad36c5d5c73b06017c5478423d # timeout=10
Commit message: "Merge branch 'feature/Passation' into 'develop'"
First time build. Skipping changelog.
[Checks API] No suitable checks publisher found.
[workspace] $ /bin/bash -xe /tmp/jenkins4761160478818876148.sh
+ git config user.email net.gazelle@gmail.com
+ git config user.name jenkins
Parsing POMs
Established TCP socket on 41175
[workspace] $ /usr/lib/jvm/java-8-oracle//bin/java -Djava.net.preferIPv4Stack=true -Dfile.encoding=UTF8 -Xmx4096m -XX:MaxPermSize=1024m -cp /home/jenkins/.hudson/plugins/maven-plugin/WEB-INF/lib/maven35-agent-1.13.jar:/home/jenkins/.hudson/tools/hudson.tasks.Maven_MavenInstallation/Maven3/boot/plexus-classworlds-2.5.2.jar:/home/jenkins/.hudson/tools/hudson.tasks.Maven_MavenInstallation/Maven3/conf/logging jenkins.maven3.agent.Maven35Main /home/jenkins/.hudson/tools/hudson.tasks.Maven_MavenInstallation/Maven3 /home/jenkins/.hudson/war/WEB-INF/lib/remoting-4.5.jar /home/jenkins/.hudson/plugins/maven-plugin/WEB-INF/lib/maven35-interceptor-1.13.jar /home/jenkins/.hudson/plugins/maven-plugin/WEB-INF/lib/maven3-interceptor-commons-1.13.jar 41175
Java HotSpot(TM) 64-Bit Server VM warning: ignoring option MaxPermSize=1024m; support was removed in 8.0
<===[JENKINS REMOTING CAPACITY]===>channel started
Executing Maven:  -B -f /home/jenkins/.hudson/jobs/fhir-util(HEAD)/workspace/pom.xml clean install
[INFO] Scanning for projects...
[WARNING] 
[WARNING] Some problems were encountered while building the effective model for net.ihe.gazelle.library:fhir-util:jar:3.0.3-SNAPSHOT
[WARNING] 'build.plugins.plugin.version' for org.apache.maven.plugins:maven-compiler-plugin is missing. @ line 61, column 25
[WARNING] 
[WARNING] It is highly recommended to fix these problems because they threaten the stability of your build.
[WARNING] 
[WARNING] For this reason, future Maven versions might no longer support building such malformed projects.
[WARNING] 
[INFO] 
[INFO] ------------------------------------------------------------------------
[INFO] Building fhir-util 3.0.3-SNAPSHOT
[INFO] ------------------------------------------------------------------------
[INFO] 
[INFO] --- maven-clean-plugin:2.5:clean (default-clean) @ fhir-util ---
[INFO] Deleting /home/jenkins/.hudson/jobs/fhir-util(HEAD)/workspace/target
[INFO] 
[INFO] --- jacoco-maven-plugin:0.8.4:prepare-agent (pre-unit-test) @ fhir-util ---
[INFO] argLine set to -javaagent:/home/jenkins/.m2/repository/org/jacoco/org.jacoco.agent/0.8.4/org.jacoco.agent-0.8.4-runtime.jar=destfile=/home/jenkins/.hudson/jobs/fhir-util(HEAD)/workspace/target/jacoco.exec
[INFO] 
[INFO] --- maven-resources-plugin:2.6:resources (default-resources) @ fhir-util ---
[INFO] Using 'UTF-8' encoding to copy filtered resources.
[INFO] skip non existing resourceDirectory /home/jenkins/.hudson/jobs/fhir-util(HEAD)/workspace/src/main/resources
[INFO] 
[INFO] --- maven-compiler-plugin:3.1:compile (default-compile) @ fhir-util ---
[INFO] Changes detected - recompiling the module!
[INFO] Compiling 13 source files to /home/jenkins/.hudson/jobs/fhir-util(HEAD)/workspace/target/classes
Collecting metadata...
Metadata collection done.
Started calculate disk usage of build
Finished Calculation of disk usage of build in 0 seconds
Started calculate disk usage of workspace
Finished Calculation of disk usage of workspace in 0 seconds
[Checks API] No suitable checks publisher found.
[INFO] ------------------------------------------------------------------------
[INFO] BUILD FAILURE
[INFO] ------------------------------------------------------------------------
[INFO] Total time: 2.670 s
[INFO] Finished at: 2020-11-26T15:49:31+01:00
[INFO] Final Memory: 17M/401M
[INFO] ------------------------------------------------------------------------
Waiting for Jenkins to finish collecting data
[ERROR] Failed to execute goal org.apache.maven.plugins:maven-compiler-plugin:3.1:compile (default-compile) on project fhir-util: Compilation failure -> [Help 1]
[ERROR] 
[ERROR] To see the full stack trace of the errors, re-run Maven with the -e switch.
[ERROR] Re-run Maven using the -X switch to enable full debug logging.
[ERROR] 
[ERROR] For more information about the errors and possible solutions, please read the following articles:
[ERROR] [Help 1] http://cwiki.apache.org/confluence/display/MAVEN/MojoFailureException
[JENKINS] Archiving /home/jenkins/.hudson/jobs/fhir-util(HEAD)/workspace/pom.xml to net.ihe.gazelle.library/fhir-util/3.0.3-SNAPSHOT/fhir-util-3.0.3-SNAPSHOT.pom
channel stopped
Skipping sonar analysis due to bad build status FAILURE
Collecting metadata...
Metadata collection done.
Started calculate disk usage of build
Finished Calculation of disk usage of build in 0 seconds
Started calculate disk usage of workspace
Finished Calculation of disk usage of workspace in 0 seconds
[Checks API] No suitable checks publisher found.
Sending e-mails to: wbs@kereval.com
Finished: FAILURE