UnstableConsole Output

Started calculate disk usage of build
Finished Calculation of disk usage of build in 0 seconds
Started calculate disk usage of workspace
Finished Calculation of disk usage of workspace in 0 seconds
[INFO] 
[INFO] ------------------------------------------------------------------------
[INFO] Building gazelle-assertion-ws-client 4.0.6-SNAPSHOT
[INFO] ------------------------------------------------------------------------
[INFO] 
[INFO] --- maven-clean-plugin:3.0.0:clean (default-clean) @ gazelle-assertion-ws-client ---
[INFO] 
[INFO] --- maven-enforcer-plugin:1.2:enforce (enforce-java-version) @ gazelle-assertion-ws-client ---
[INFO] 
[INFO] --- maven-enforcer-plugin:1.2:enforce (enforce-maven-version) @ gazelle-assertion-ws-client ---
[INFO] 
[INFO] --- buildnumber-maven-plugin:1.2:create-timestamp (get-build-timestamp) @ gazelle-assertion-ws-client ---
[INFO] 
[INFO] --- buildnumber-maven-plugin:1.2:create (get-scm-revision) @ gazelle-assertion-ws-client ---
[INFO] 
[INFO] --- maven-buildmetadata-plugin:1.1.0.IHE.3:provide-buildmetadata (default) @ gazelle-assertion-ws-client ---
[INFO] Writing properties '/home/jenkins/.hudson/jobs/gazelle-assertion/workspace/gazelle-assertion-ws-client/target/classes/META-INF/build.properties'...
[INFO] Writing XML report '/home/jenkins/.hudson/jobs/gazelle-assertion/workspace/gazelle-assertion-ws-client/target/buildmetadata.xml'...
[INFO] 
[INFO] --- maven-resources-plugin:3.0.2:resources (default-resources) @ gazelle-assertion-ws-client ---
[INFO] Using 'UTF-8' encoding to copy filtered resources.
[INFO] skip non existing resourceDirectory /home/jenkins/.hudson/jobs/gazelle-assertion/workspace/gazelle-assertion-ws-client/src/main/resources
[INFO] 
[INFO] --- maven-compiler-plugin:3.5.1:compile (default-compile) @ gazelle-assertion-ws-client ---
[INFO] Changes detected - recompiling the module!
[INFO] Compiling 4 source files to /home/jenkins/.hudson/jobs/gazelle-assertion/workspace/gazelle-assertion-ws-client/target/classes
[WARNING] bootstrap class path not set in conjunction with -source 1.6
[INFO] 
[INFO] --- maven-resources-plugin:3.0.2:testResources (default-testResources) @ gazelle-assertion-ws-client ---
[INFO] Using 'UTF-8' encoding to copy filtered resources.
[INFO] skip non existing resourceDirectory /home/jenkins/.hudson/jobs/gazelle-assertion/workspace/gazelle-assertion-ws-client/src/test/resources
[INFO] 
[INFO] --- maven-compiler-plugin:3.5.1:testCompile (default-testCompile) @ gazelle-assertion-ws-client ---
[INFO] Changes detected - recompiling the module!
[INFO] Compiling 1 source file to /home/jenkins/.hudson/jobs/gazelle-assertion/workspace/gazelle-assertion-ws-client/target/test-classes
[WARNING] bootstrap class path not set in conjunction with -source 1.6
[INFO] 
[INFO] --- maven-surefire-plugin:2.20:test (default-test) @ gazelle-assertion-ws-client ---
[INFO] 
[INFO] -------------------------------------------------------
[INFO]  T E S T S
[INFO] -------------------------------------------------------
[INFO] Running net.ihe.gazelle.assertion.AssertionWsClientTest
[main] INFO net.ihe.gazelle.assertion.AssertionWsClient - getAssertionsForTestStep
[main] INFO net.ihe.gazelle.assertion.Request - request on: http://localhost:8080/AssertionManagerGui/rest/testAssertion/testStep/0
log4j:WARN No appenders could be found for logger (org.jboss.resteasy.plugins.providers.DocumentProvider).
log4j:WARN Please initialize the log4j system properly.
[main] ERROR net.ihe.gazelle.assertion.Request - cannot reach host: http://localhost:8080/AssertionManagerGui/rest/
[main] INFO net.ihe.gazelle.assertion.AssertionWsClient - getAssertionsForScheme
[main] INFO net.ihe.gazelle.assertion.Request - request on: http://localhost:8080/AssertionManagerGui/rest/testAssertion/v2/idSchemes/ATNA/assertions
[main] ERROR net.ihe.gazelle.assertion.Request - cannot reach host: http://localhost:8080/AssertionManagerGui/rest/
[main] INFO net.ihe.gazelle.assertion.AssertionWsClient - getAssertionsForScheme
[main] INFO net.ihe.gazelle.assertion.Request - request on: http://localhost:8080/AssertionManagerGui/rest/testAssertion/v2/idSchemes/ATNA/assertions/ATNA-10
[main] ERROR net.ihe.gazelle.assertion.Request - cannot reach host: http://localhost:8080/AssertionManagerGui/rest/
[main] INFO net.ihe.gazelle.assertion.AssertionWsClient - getAssertionsForTest
[main] INFO net.ihe.gazelle.assertion.Request - request on: http://localhost:8080/AssertionManagerGui/rest/testAssertion/test/122
[main] ERROR net.ihe.gazelle.assertion.Request - cannot reach host: http://localhost:8080/AssertionManagerGui/rest/
[main] INFO net.ihe.gazelle.assertion.AssertionWsClient - getAssertionsForTestStep
[main] INFO net.ihe.gazelle.assertion.Request - request on: http://localhost:8080/AssertionManagerGui/rest/testAssertion/testStep/1500837
[main] ERROR net.ihe.gazelle.assertion.Request - cannot reach host: http://localhost:8080/AssertionManagerGui/rest/
[main] INFO net.ihe.gazelle.assertion.AssertionWsClient - getAssertionsForTest
[main] INFO net.ihe.gazelle.assertion.Request - request on: http://localhost:8080/AssertionManagerGui/rest/testAssertion/test/10097
[main] ERROR net.ihe.gazelle.assertion.Request - cannot reach host: http://localhost:8080/AssertionManagerGui/rest/
[main] INFO net.ihe.gazelle.assertion.AssertionWsClient - getIdSchemes
[main] INFO net.ihe.gazelle.assertion.Request - request on: http://localhost:8080/AssertionManagerGui/rest/testAssertion/v2/idSchemes
[main] ERROR net.ihe.gazelle.assertion.Request - cannot reach host: http://localhost:8080/AssertionManagerGui/rest/
[ERROR] Tests run: 7, Failures: 5, Errors: 0, Skipped: 0, Time elapsed: 0.563 s <<< FAILURE! - in net.ihe.gazelle.assertion.AssertionWsClientTest
[ERROR] getAssertionsForScheme(net.ihe.gazelle.assertion.AssertionWsClientTest)  Time elapsed: 0.014 s  <<< FAILURE!
java.lang.AssertionError: expected:<3> but was:<0>
	at net.ihe.gazelle.assertion.AssertionWsClientTest.getAssertionsForScheme(AssertionWsClientTest.java:45)

[ERROR] getAssertion(net.ihe.gazelle.assertion.AssertionWsClientTest)  Time elapsed: 0.003 s  <<< FAILURE!
java.lang.AssertionError: expected:<1> but was:<0>
	at net.ihe.gazelle.assertion.AssertionWsClientTest.getAssertion(AssertionWsClientTest.java:52)

[ERROR] getAssertionsForTestStep(net.ihe.gazelle.assertion.AssertionWsClientTest)  Time elapsed: 0.006 s  <<< FAILURE!
java.lang.AssertionError: expected:<1> but was:<0>
	at net.ihe.gazelle.assertion.AssertionWsClientTest.getAssertionsForTestStep(AssertionWsClientTest.java:31)

[ERROR] getAssertionsForTest(net.ihe.gazelle.assertion.AssertionWsClientTest)  Time elapsed: 0.005 s  <<< FAILURE!
java.lang.AssertionError: expected:<2> but was:<0>
	at net.ihe.gazelle.assertion.AssertionWsClientTest.getAssertionsForTest(AssertionWsClientTest.java:17)

[ERROR] getIdSchemes(net.ihe.gazelle.assertion.AssertionWsClientTest)  Time elapsed: 0.006 s  <<< FAILURE!
java.lang.AssertionError: expected:<38> but was:<0>
	at net.ihe.gazelle.assertion.AssertionWsClientTest.getIdSchemes(AssertionWsClientTest.java:59)

[INFO] 
[INFO] Results:
[INFO] 
[ERROR] Failures: 
[ERROR]   AssertionWsClientTest.getAssertion:52 expected:<1> but was:<0>
[ERROR]   AssertionWsClientTest.getAssertionsForScheme:45 expected:<3> but was:<0>
[ERROR]   AssertionWsClientTest.getAssertionsForTest:17 expected:<2> but was:<0>
[ERROR]   AssertionWsClientTest.getAssertionsForTestStep:31 expected:<1> but was:<0>
[ERROR]   AssertionWsClientTest.getIdSchemes:59 expected:<38> but was:<0>
[INFO] 
[ERROR] Tests run: 7, Failures: 5, Errors: 0, Skipped: 0
[INFO] 
[ERROR] There are test failures.

Please refer to /home/jenkins/.hudson/jobs/gazelle-assertion/workspace/gazelle-assertion-ws-client/target/surefire-reports for the individual test results.
Please refer to dump files (if any exist) [date]-jvmRun[N].dump, [date].dumpstream and [date]-jvmRun[N].dumpstream.
[JENKINS] Recording test results
[INFO] 
[INFO] --- maven-jar-plugin:3.0.2:jar (default-jar) @ gazelle-assertion-ws-client ---
[INFO] Building jar: /home/jenkins/.hudson/jobs/gazelle-assertion/workspace/gazelle-assertion-ws-client/target/gazelle-assertion-ws-client.jar
[INFO] 
[INFO] --- maven-source-plugin:3.0.1:jar-no-fork (attach-sources) @ gazelle-assertion-ws-client ---
[INFO] Building jar: /home/jenkins/.hudson/jobs/gazelle-assertion/workspace/gazelle-assertion-ws-client/target/gazelle-assertion-ws-client-sources.jar
[INFO] 
[INFO] --- maven-jar-plugin:3.0.2:test-jar (default) @ gazelle-assertion-ws-client ---
[INFO] Building jar: /home/jenkins/.hudson/jobs/gazelle-assertion/workspace/gazelle-assertion-ws-client/target/gazelle-assertion-ws-client-tests.jar
[INFO] 
[INFO] --- maven-install-plugin:2.4:install (default-install) @ gazelle-assertion-ws-client ---
[INFO] Installing /home/jenkins/.hudson/jobs/gazelle-assertion/workspace/gazelle-assertion-ws-client/target/gazelle-assertion-ws-client.jar to /home/jenkins/.m2/repository/net/ihe/gazelle/assertion/gazelle-assertion-ws-client/4.0.6-SNAPSHOT/gazelle-assertion-ws-client-4.0.6-SNAPSHOT.jar
[INFO] Installing /home/jenkins/.hudson/jobs/gazelle-assertion/workspace/gazelle-assertion-ws-client/pom.xml to /home/jenkins/.m2/repository/net/ihe/gazelle/assertion/gazelle-assertion-ws-client/4.0.6-SNAPSHOT/gazelle-assertion-ws-client-4.0.6-SNAPSHOT.pom
[INFO] Installing /home/jenkins/.hudson/jobs/gazelle-assertion/workspace/gazelle-assertion-ws-client/target/gazelle-assertion-ws-client-sources.jar to /home/jenkins/.m2/repository/net/ihe/gazelle/assertion/gazelle-assertion-ws-client/4.0.6-SNAPSHOT/gazelle-assertion-ws-client-4.0.6-SNAPSHOT-sources.jar
[INFO] Installing /home/jenkins/.hudson/jobs/gazelle-assertion/workspace/gazelle-assertion-ws-client/target/gazelle-assertion-ws-client-tests.jar to /home/jenkins/.m2/repository/net/ihe/gazelle/assertion/gazelle-assertion-ws-client/4.0.6-SNAPSHOT/gazelle-assertion-ws-client-4.0.6-SNAPSHOT-tests.jar