SuccessConsole Output

Collecting metadata...
Metadata collection done.
Started calculate disk usage of build
Finished Calculation of disk usage of build in 0 seconds
Started calculate disk usage of workspace
Finished Calculation of disk usage of workspace in 0 seconds
[INFO] 
[INFO] ------------------------------------------------------------------------
[INFO] Building gazelle-xua-jar 6.1.0
[INFO] ------------------------------------------------------------------------
[INFO] 
[INFO] --- maven-clean-plugin:3.0.0:clean (default-clean) @ gazelle-xua-jar ---
[INFO] 
[INFO] --- maven-enforcer-plugin:1.2:enforce (enforce-java-version) @ gazelle-xua-jar ---
[INFO] 
[INFO] --- maven-enforcer-plugin:1.2:enforce (enforce-maven-version) @ gazelle-xua-jar ---
[INFO] 
[INFO] --- buildnumber-maven-plugin:1.2:create-timestamp (get-build-timestamp) @ gazelle-xua-jar ---
[INFO] 
[INFO] --- buildnumber-maven-plugin:1.2:create (get-scm-revision) @ gazelle-xua-jar ---
[INFO] 
[INFO] --- maven-buildmetadata-plugin:1.1.0.IHE.3:provide-buildmetadata (default) @ gazelle-xua-jar ---
[INFO] Writing properties '/home/jenkins/.hudson/jobs/gazelle-atna-RELEASE/workspace/gazelle-xua-jar/target/classes/META-INF/build.properties'...
[INFO] Writing XML report '/home/jenkins/.hudson/jobs/gazelle-atna-RELEASE/workspace/gazelle-xua-jar/target/buildmetadata.xml'...
[INFO] 
[INFO] --- jacoco-maven-plugin:0.7.9:prepare-agent (default) @ gazelle-xua-jar ---
[INFO] argLine set to -javaagent:/home/jenkins/.m2/repository/org/jacoco/org.jacoco.agent/0.7.9/org.jacoco.agent-0.7.9-runtime.jar=destfile=/home/jenkins/.hudson/jobs/gazelle-atna-RELEASE/workspace/gazelle-xua-jar/target/jacoco.exec,append=true
[INFO] 
[INFO] --- maven-resources-plugin:3.0.2:resources (default-resources) @ gazelle-xua-jar ---
[INFO] Using 'UTF-8' encoding to copy filtered resources.
[INFO] Copying 1 resource
[INFO] 
[INFO] --- maven-compiler-plugin:3.5.1:compile (default-compile) @ gazelle-xua-jar ---
[INFO] Changes detected - recompiling the module!
[INFO] Compiling 8 source files to /home/jenkins/.hudson/jobs/gazelle-atna-RELEASE/workspace/gazelle-xua-jar/target/classes
[INFO] 
[INFO] --- maven-resources-plugin:3.0.2:testResources (default-testResources) @ gazelle-xua-jar ---
[INFO] Using 'UTF-8' encoding to copy filtered resources.
[INFO] Copying 8 resources
[INFO] 
[INFO] --- maven-compiler-plugin:3.5.1:testCompile (default-testCompile) @ gazelle-xua-jar ---
[INFO] Changes detected - recompiling the module!
[INFO] Compiling 1 source file to /home/jenkins/.hudson/jobs/gazelle-atna-RELEASE/workspace/gazelle-xua-jar/target/test-classes
[INFO] 
[INFO] --- maven-surefire-plugin:2.20:test (default-test) @ gazelle-xua-jar ---
[INFO] 
[INFO] -------------------------------------------------------
[INFO]  T E S T S
[INFO] -------------------------------------------------------
[INFO] Running net.ihe.gazelle.xua.integration.test.XUAIntegrationTest
SLF4J: Class path contains multiple SLF4J bindings.
SLF4J: Found binding in [jar:file:/home/jenkins/.m2/repository/org/slf4j/slf4j-simple/1.7.21/slf4j-simple-1.7.21.jar!/org/slf4j/impl/StaticLoggerBinder.class]
SLF4J: Found binding in [jar:file:/home/jenkins/.m2/repository/org/slf4j/slf4j-log4j12/1.1.0/slf4j-log4j12-1.1.0.jar!/org/slf4j/impl/StaticLoggerBinder.class]
SLF4J: See http://www.slf4j.org/codes.html#multiple_bindings for an explanation.
SLF4J: Actual binding is of type [org.slf4j.impl.SimpleLoggerFactory]
[main] INFO net.ihe.gazelle.xua.ws.XUADocumentValidation - Initiating the CDA validator of the application
[main] INFO net.ihe.gazelle.xua.ws.XUADocumentValidation - 11svs = https://gazelle.ihe.net/SVSSimulator/rest/RetrieveValueSetForSimulator
[main] ERROR net.ihe.gazelle.xua.util.XMLValidation - Fail to build XUA SAX Parser factory
java.net.MalformedURLException: no protocol: /opt/tls/saml-schema-assertion-2.0.xsd	at java.net.URL.<init>(URL.java:593)	at java.net.URL.<init>(URL.java:490)	at java.net.URL.<init>(URL.java:439)	at net.ihe.gazelle.xua.util.XMLValidation.<clinit>(XMLValidation.java:55)	at net.ihe.gazelle.xua.ws.XUADocumentValidation.validateToSchema(XUADocumentValidation.java:230)	at net.ihe.gazelle.xua.ws.XUADocumentValidation.validateWithBasicValidator(XUADocumentValidation.java:92)	at net.ihe.gazelle.xua.ws.XUADocumentValidation.validateIHE_XUA_Authz_CONSENT(XUADocumentValidation.java:136)	at net.ihe.gazelle.xua.integration.test.XUAIntegrationTest.validateDocument(XUAIntegrationTest.java:125)	at net.ihe.gazelle.xua.integration.test.XUAIntegrationTest.testValidatorType(XUAIntegrationTest.java:99)	at net.ihe.gazelle.xua.integration.test.XUAIntegrationTest.ValidateXUA_IHE_AuthzConsent(XUAIntegrationTest.java:71)	at sun.reflect.NativeMethodAccessorImpl.invoke0(Native Method)	at sun.reflect.NativeMethodAccessorImpl.invoke(NativeMethodAccessorImpl.java:62)	at sun.reflect.DelegatingMethodAccessorImpl.invoke(DelegatingMethodAccessorImpl.java:43)	at java.lang.reflect.Method.invoke(Method.java:498)	at org.junit.internal.runners.TestMethod.invoke(TestMethod.java:66)	at org.powermock.modules.junit4.internal.impl.PowerMockJUnit44RunnerDelegateImpl$PowerMockJUnit44MethodRunner.runTestMethod(PowerMockJUnit44RunnerDelegateImpl.java:310)	at org.junit.internal.runners.MethodRoadie$2.run(MethodRoadie.java:86)	at org.junit.internal.runners.MethodRoadie.runBeforesThenTestThenAfters(MethodRoadie.java:94)	at org.powermock.modules.junit4.internal.impl.PowerMockJUnit44RunnerDelegateImpl$PowerMockJUnit44MethodRunner.executeTest(PowerMockJUnit44RunnerDelegateImpl.java:294)	at org.powermock.modules.junit4.internal.impl.PowerMockJUnit47RunnerDelegateImpl$PowerMockJUnit47MethodRunner.executeTestInSuper(PowerMockJUnit47RunnerDelegateImpl.java:127)	at org.powermock.modules.junit4.internal.impl.PowerMockJUnit47RunnerDelegateImpl$PowerMockJUnit47MethodRunner.executeTest(PowerMockJUnit47RunnerDelegateImpl.java:82)	at org.powermock.modules.junit4.internal.impl.PowerMockJUnit44RunnerDelegateImpl$PowerMockJUnit44MethodRunner.runBeforesThenTestThenAfters(PowerMockJUnit44RunnerDelegateImpl.java:282)	at org.junit.internal.runners.MethodRoadie.runTest(MethodRoadie.java:84)	at org.junit.internal.runners.MethodRoadie.run(MethodRoadie.java:49)	at org.powermock.modules.junit4.internal.impl.PowerMockJUnit44RunnerDelegateImpl.invokeTestMethod(PowerMockJUnit44RunnerDelegateImpl.java:207)	at org.powermock.modules.junit4.internal.impl.PowerMockJUnit44RunnerDelegateImpl.runMethods(PowerMockJUnit44RunnerDelegateImpl.java:146)	at org.powermock.modules.junit4.internal.impl.PowerMockJUnit44RunnerDelegateImpl$1.run(PowerMockJUnit44RunnerDelegateImpl.java:120)	at org.junit.internal.runners.ClassRoadie.runUnprotected(ClassRoadie.java:34)	at org.junit.internal.runners.ClassRoadie.runProtected(ClassRoadie.java:44)	at org.powermock.modules.junit4.internal.impl.PowerMockJUnit44RunnerDelegateImpl.run(PowerMockJUnit44RunnerDelegateImpl.java:118)	at org.powermock.modules.junit4.common.internal.impl.JUnit4TestSuiteChunkerImpl.run(JUnit4TestSuiteChunkerImpl.java:101)	at org.powermock.modules.junit4.common.internal.impl.AbstractCommonPowerMockRunner.run(AbstractCommonPowerMockRunner.java:53)	at org.powermock.modules.junit4.PowerMockRunner.run(PowerMockRunner.java:53)	at org.junit.runners.Suite.runChild(Suite.java:128)	at org.junit.runners.Suite.runChild(Suite.java:24)	at org.junit.runners.ParentRunner$3.run(ParentRunner.java:193)	at org.junit.runners.ParentRunner$1.schedule(ParentRunner.java:52)	at org.junit.runners.ParentRunner.runChildren(ParentRunner.java:191)	at org.junit.runners.ParentRunner.access$000(ParentRunner.java:42)	at org.junit.runners.ParentRunner$2.evaluate(ParentRunner.java:184)	at org.junit.runners.ParentRunner.run(ParentRunner.java:236)	at org.junit.runners.Suite.runChild(Suite.java:128)	at org.junit.runners.Suite.runChild(Suite.java:24)	at org.junit.runners.ParentRunner$3.run(ParentRunner.java:193)	at org.apache.maven.surefire.junitcore.pc.Scheduler$1.run(Scheduler.java:393)	at org.apache.maven.surefire.junitcore.pc.InvokerStrategy.schedule(InvokerStrategy.java:54)	at org.apache.maven.surefire.junitcore.pc.Scheduler.schedule(Scheduler.java:352)	at org.junit.runners.ParentRunner.runChildren(ParentRunner.java:191)	at org.junit.runners.ParentRunner.access$000(ParentRunner.java:42)	at org.junit.runners.ParentRunner$2.evaluate(ParentRunner.java:184)	at org.junit.runners.ParentRunner.run(ParentRunner.java:236)	at org.apache.maven.surefire.junitcore.pc.ParallelComputerBuilder$PC$1.run(ParallelComputerBuilder.java:595)	at org.apache.maven.surefire.junitcore.JUnitCore.run(JUnitCore.java:55)	at org.apache.maven.surefire.junitcore.JUnitCoreWrapper.createRequestAndRun(JUnitCoreWrapper.java:137)	at org.apache.maven.surefire.junitcore.JUnitCoreWrapper.executeEager(JUnitCoreWrapper.java:107)	at org.apache.maven.surefire.junitcore.JUnitCoreWrapper.execute(JUnitCoreWrapper.java:83)	at org.apache.maven.surefire.junitcore.JUnitCoreWrapper.execute(JUnitCoreWrapper.java:75)	at org.apache.maven.surefire.junitcore.JUnitCoreProvider.invoke(JUnitCoreProvider.java:157)	at org.apache.maven.surefire.booter.ForkedBooter.invokeProviderInSameClassLoader(ForkedBooter.java:386)	at org.apache.maven.surefire.booter.ForkedBooter.runSuitesInProcess(ForkedBooter.java:323)	at org.apache.maven.surefire.booter.ForkedBooter.main(ForkedBooter.java:143)[main] ERROR net.ihe.gazelle.xua.util.XMLValidation - Fail to build XACML Protocol SAX Parser factory
java.net.MalformedURLException: no protocol: /opt/tls/xacml-os2/XACML-2.0-OS-NORMATIVE/access_control-xacml-2.0-saml-protocol-schema-os.xsd	at java.net.URL.<init>(URL.java:593)	at java.net.URL.<init>(URL.java:490)	at java.net.URL.<init>(URL.java:439)	at net.ihe.gazelle.xua.util.XMLValidation.<clinit>(XMLValidation.java:66)	at net.ihe.gazelle.xua.ws.XUADocumentValidation.validateToSchema(XUADocumentValidation.java:230)	at net.ihe.gazelle.xua.ws.XUADocumentValidation.validateWithBasicValidator(XUADocumentValidation.java:92)	at net.ihe.gazelle.xua.ws.XUADocumentValidation.validateIHE_XUA_Authz_CONSENT(XUADocumentValidation.java:136)	at net.ihe.gazelle.xua.integration.test.XUAIntegrationTest.validateDocument(XUAIntegrationTest.java:125)	at net.ihe.gazelle.xua.integration.test.XUAIntegrationTest.testValidatorType(XUAIntegrationTest.java:99)	at net.ihe.gazelle.xua.integration.test.XUAIntegrationTest.ValidateXUA_IHE_AuthzConsent(XUAIntegrationTest.java:71)	at sun.reflect.NativeMethodAccessorImpl.invoke0(Native Method)	at sun.reflect.NativeMethodAccessorImpl.invoke(NativeMethodAccessorImpl.java:62)	at sun.reflect.DelegatingMethodAccessorImpl.invoke(DelegatingMethodAccessorImpl.java:43)	at java.lang.reflect.Method.invoke(Method.java:498)	at org.junit.internal.runners.TestMethod.invoke(TestMethod.java:66)	at org.powermock.modules.junit4.internal.impl.PowerMockJUnit44RunnerDelegateImpl$PowerMockJUnit44MethodRunner.runTestMethod(PowerMockJUnit44RunnerDelegateImpl.java:310)	at org.junit.internal.runners.MethodRoadie$2.run(MethodRoadie.java:86)	at org.junit.internal.runners.MethodRoadie.runBeforesThenTestThenAfters(MethodRoadie.java:94)	at org.powermock.modules.junit4.internal.impl.PowerMockJUnit44RunnerDelegateImpl$PowerMockJUnit44MethodRunner.executeTest(PowerMockJUnit44RunnerDelegateImpl.java:294)	at org.powermock.modules.junit4.internal.impl.PowerMockJUnit47RunnerDelegateImpl$PowerMockJUnit47MethodRunner.executeTestInSuper(PowerMockJUnit47RunnerDelegateImpl.java:127)	at org.powermock.modules.junit4.internal.impl.PowerMockJUnit47RunnerDelegateImpl$PowerMockJUnit47MethodRunner.executeTest(PowerMockJUnit47RunnerDelegateImpl.java:82)	at org.powermock.modules.junit4.internal.impl.PowerMockJUnit44RunnerDelegateImpl$PowerMockJUnit44MethodRunner.runBeforesThenTestThenAfters(PowerMockJUnit44RunnerDelegateImpl.java:282)	at org.junit.internal.runners.MethodRoadie.runTest(MethodRoadie.java:84)	at org.junit.internal.runners.MethodRoadie.run(MethodRoadie.java:49)	at org.powermock.modules.junit4.internal.impl.PowerMockJUnit44RunnerDelegateImpl.invokeTestMethod(PowerMockJUnit44RunnerDelegateImpl.java:207)	at org.powermock.modules.junit4.internal.impl.PowerMockJUnit44RunnerDelegateImpl.runMethods(PowerMockJUnit44RunnerDelegateImpl.java:146)	at org.powermock.modules.junit4.internal.impl.PowerMockJUnit44RunnerDelegateImpl$1.run(PowerMockJUnit44RunnerDelegateImpl.java:120)	at org.junit.internal.runners.ClassRoadie.runUnprotected(ClassRoadie.java:34)	at org.junit.internal.runners.ClassRoadie.runProtected(ClassRoadie.java:44)	at org.powermock.modules.junit4.internal.impl.PowerMockJUnit44RunnerDelegateImpl.run(PowerMockJUnit44RunnerDelegateImpl.java:118)	at org.powermock.modules.junit4.common.internal.impl.JUnit4TestSuiteChunkerImpl.run(JUnit4TestSuiteChunkerImpl.java:101)	at org.powermock.modules.junit4.common.internal.impl.AbstractCommonPowerMockRunner.run(AbstractCommonPowerMockRunner.java:53)	at org.powermock.modules.junit4.PowerMockRunner.run(PowerMockRunner.java:53)	at org.junit.runners.Suite.runChild(Suite.java:128)	at org.junit.runners.Suite.runChild(Suite.java:24)	at org.junit.runners.ParentRunner$3.run(ParentRunner.java:193)	at org.junit.runners.ParentRunner$1.schedule(ParentRunner.java:52)	at org.junit.runners.ParentRunner.runChildren(ParentRunner.java:191)	at org.junit.runners.ParentRunner.access$000(ParentRunner.java:42)	at org.junit.runners.ParentRunner$2.evaluate(ParentRunner.java:184)	at org.junit.runners.ParentRunner.run(ParentRunner.java:236)	at org.junit.runners.Suite.runChild(Suite.java:128)	at org.junit.runners.Suite.runChild(Suite.java:24)	at org.junit.runners.ParentRunner$3.run(ParentRunner.java:193)	at org.apache.maven.surefire.junitcore.pc.Scheduler$1.run(Scheduler.java:393)	at org.apache.maven.surefire.junitcore.pc.InvokerStrategy.schedule(InvokerStrategy.java:54)	at org.apache.maven.surefire.junitcore.pc.Scheduler.schedule(Scheduler.java:352)	at org.junit.runners.ParentRunner.runChildren(ParentRunner.java:191)	at org.junit.runners.ParentRunner.access$000(ParentRunner.java:42)	at org.junit.runners.ParentRunner$2.evaluate(ParentRunner.java:184)	at org.junit.runners.ParentRunner.run(ParentRunner.java:236)	at org.apache.maven.surefire.junitcore.pc.ParallelComputerBuilder$PC$1.run(ParallelComputerBuilder.java:595)	at org.apache.maven.surefire.junitcore.JUnitCore.run(JUnitCore.java:55)	at org.apache.maven.surefire.junitcore.JUnitCoreWrapper.createRequestAndRun(JUnitCoreWrapper.java:137)	at org.apache.maven.surefire.junitcore.JUnitCoreWrapper.executeEager(JUnitCoreWrapper.java:107)	at org.apache.maven.surefire.junitcore.JUnitCoreWrapper.execute(JUnitCoreWrapper.java:83)	at org.apache.maven.surefire.junitcore.JUnitCoreWrapper.execute(JUnitCoreWrapper.java:75)	at org.apache.maven.surefire.junitcore.JUnitCoreProvider.invoke(JUnitCoreProvider.java:157)	at org.apache.maven.surefire.booter.ForkedBooter.invokeProviderInSameClassLoader(ForkedBooter.java:386)	at org.apache.maven.surefire.booter.ForkedBooter.runSuitesInProcess(ForkedBooter.java:323)	at org.apache.maven.surefire.booter.ForkedBooter.main(ForkedBooter.java:143)[main] ERROR net.ihe.gazelle.xua.util.XMLValidation - Fail to build XACML Assertion SAX Parser factory
java.net.MalformedURLException: no protocol: /opt/tls/xacml-os2/XACML-2.0-OS-NORMATIVE/access_control-xacml-2.0-saml-assertion-schema-os.xsd	at java.net.URL.<init>(URL.java:593)	at java.net.URL.<init>(URL.java:490)	at java.net.URL.<init>(URL.java:439)	at net.ihe.gazelle.xua.util.XMLValidation.<clinit>(XMLValidation.java:77)	at net.ihe.gazelle.xua.ws.XUADocumentValidation.validateToSchema(XUADocumentValidation.java:230)	at net.ihe.gazelle.xua.ws.XUADocumentValidation.validateWithBasicValidator(XUADocumentValidation.java:92)	at net.ihe.gazelle.xua.ws.XUADocumentValidation.validateIHE_XUA_Authz_CONSENT(XUADocumentValidation.java:136)	at net.ihe.gazelle.xua.integration.test.XUAIntegrationTest.validateDocument(XUAIntegrationTest.java:125)	at net.ihe.gazelle.xua.integration.test.XUAIntegrationTest.testValidatorType(XUAIntegrationTest.java:99)	at net.ihe.gazelle.xua.integration.test.XUAIntegrationTest.ValidateXUA_IHE_AuthzConsent(XUAIntegrationTest.java:71)	at sun.reflect.NativeMethodAccessorImpl.invoke0(Native Method)	at sun.reflect.NativeMethodAccessorImpl.invoke(NativeMethodAccessorImpl.java:62)	at sun.reflect.DelegatingMethodAccessorImpl.invoke(DelegatingMethodAccessorImpl.java:43)	at java.lang.reflect.Method.invoke(Method.java:498)	at org.junit.internal.runners.TestMethod.invoke(TestMethod.java:66)	at org.powermock.modules.junit4.internal.impl.PowerMockJUnit44RunnerDelegateImpl$PowerMockJUnit44MethodRunner.runTestMethod(PowerMockJUnit44RunnerDelegateImpl.java:310)	at org.junit.internal.runners.MethodRoadie$2.run(MethodRoadie.java:86)	at org.junit.internal.runners.MethodRoadie.runBeforesThenTestThenAfters(MethodRoadie.java:94)	at org.powermock.modules.junit4.internal.impl.PowerMockJUnit44RunnerDelegateImpl$PowerMockJUnit44MethodRunner.executeTest(PowerMockJUnit44RunnerDelegateImpl.java:294)	at org.powermock.modules.junit4.internal.impl.PowerMockJUnit47RunnerDelegateImpl$PowerMockJUnit47MethodRunner.executeTestInSuper(PowerMockJUnit47RunnerDelegateImpl.java:127)	at org.powermock.modules.junit4.internal.impl.PowerMockJUnit47RunnerDelegateImpl$PowerMockJUnit47MethodRunner.executeTest(PowerMockJUnit47RunnerDelegateImpl.java:82)	at org.powermock.modules.junit4.internal.impl.PowerMockJUnit44RunnerDelegateImpl$PowerMockJUnit44MethodRunner.runBeforesThenTestThenAfters(PowerMockJUnit44RunnerDelegateImpl.java:282)	at org.junit.internal.runners.MethodRoadie.runTest(MethodRoadie.java:84)	at org.junit.internal.runners.MethodRoadie.run(MethodRoadie.java:49)	at org.powermock.modules.junit4.internal.impl.PowerMockJUnit44RunnerDelegateImpl.invokeTestMethod(PowerMockJUnit44RunnerDelegateImpl.java:207)	at org.powermock.modules.junit4.internal.impl.PowerMockJUnit44RunnerDelegateImpl.runMethods(PowerMockJUnit44RunnerDelegateImpl.java:146)	at org.powermock.modules.junit4.internal.impl.PowerMockJUnit44RunnerDelegateImpl$1.run(PowerMockJUnit44RunnerDelegateImpl.java:120)	at org.junit.internal.runners.ClassRoadie.runUnprotected(ClassRoadie.java:34)	at org.junit.internal.runners.ClassRoadie.runProtected(ClassRoadie.java:44)	at org.powermock.modules.junit4.internal.impl.PowerMockJUnit44RunnerDelegateImpl.run(PowerMockJUnit44RunnerDelegateImpl.java:118)	at org.powermock.modules.junit4.common.internal.impl.JUnit4TestSuiteChunkerImpl.run(JUnit4TestSuiteChunkerImpl.java:101)	at org.powermock.modules.junit4.common.internal.impl.AbstractCommonPowerMockRunner.run(AbstractCommonPowerMockRunner.java:53)	at org.powermock.modules.junit4.PowerMockRunner.run(PowerMockRunner.java:53)	at org.junit.runners.Suite.runChild(Suite.java:128)	at org.junit.runners.Suite.runChild(Suite.java:24)	at org.junit.runners.ParentRunner$3.run(ParentRunner.java:193)	at org.junit.runners.ParentRunner$1.schedule(ParentRunner.java:52)	at org.junit.runners.ParentRunner.runChildren(ParentRunner.java:191)	at org.junit.runners.ParentRunner.access$000(ParentRunner.java:42)	at org.junit.runners.ParentRunner$2.evaluate(ParentRunner.java:184)	at org.junit.runners.ParentRunner.run(ParentRunner.java:236)	at org.junit.runners.Suite.runChild(Suite.java:128)	at org.junit.runners.Suite.runChild(Suite.java:24)	at org.junit.runners.ParentRunner$3.run(ParentRunner.java:193)	at org.apache.maven.surefire.junitcore.pc.Scheduler$1.run(Scheduler.java:393)	at org.apache.maven.surefire.junitcore.pc.InvokerStrategy.schedule(InvokerStrategy.java:54)	at org.apache.maven.surefire.junitcore.pc.Scheduler.schedule(Scheduler.java:352)	at org.junit.runners.ParentRunner.runChildren(ParentRunner.java:191)	at org.junit.runners.ParentRunner.access$000(ParentRunner.java:42)	at org.junit.runners.ParentRunner$2.evaluate(ParentRunner.java:184)	at org.junit.runners.ParentRunner.run(ParentRunner.java:236)	at org.apache.maven.surefire.junitcore.pc.ParallelComputerBuilder$PC$1.run(ParallelComputerBuilder.java:595)	at org.apache.maven.surefire.junitcore.JUnitCore.run(JUnitCore.java:55)	at org.apache.maven.surefire.junitcore.JUnitCoreWrapper.createRequestAndRun(JUnitCoreWrapper.java:137)	at org.apache.maven.surefire.junitcore.JUnitCoreWrapper.executeEager(JUnitCoreWrapper.java:107)	at org.apache.maven.surefire.junitcore.JUnitCoreWrapper.execute(JUnitCoreWrapper.java:83)	at org.apache.maven.surefire.junitcore.JUnitCoreWrapper.execute(JUnitCoreWrapper.java:75)	at org.apache.maven.surefire.junitcore.JUnitCoreProvider.invoke(JUnitCoreProvider.java:157)	at org.apache.maven.surefire.booter.ForkedBooter.invokeProviderInSameClassLoader(ForkedBooter.java:386)	at org.apache.maven.surefire.booter.ForkedBooter.runSuitesInProcess(ForkedBooter.java:323)	at org.apache.maven.surefire.booter.ForkedBooter.main(ForkedBooter.java:143)[INFO] Tests run: 4, Failures: 0, Errors: 0, Skipped: 0, Time elapsed: 2.677 s - in net.ihe.gazelle.xua.integration.test.XUAIntegrationTest
[INFO] 
[INFO] Results:
[INFO] 
[INFO] Tests run: 4, Failures: 0, Errors: 0, Skipped: 0
[INFO] 
[JENKINS] Recording test results
[INFO] 
[INFO] --- jacoco-maven-plugin:0.7.9:report (post-unit-test) @ gazelle-xua-jar ---
[INFO] Skipping JaCoCo execution due to missing execution data file.
[INFO] 
[INFO] --- maven-ejb-plugin:2.3:ejb (default-ejb) @ gazelle-xua-jar ---
[INFO] Building EJB gazelle-xua-jar with EJB version 3.0
[INFO] Building jar: /home/jenkins/.hudson/jobs/gazelle-atna-RELEASE/workspace/gazelle-xua-jar/target/gazelle-xua-jar.jar
[INFO] 
[INFO] --- maven-source-plugin:3.0.1:jar-no-fork (attach-sources) @ gazelle-xua-jar ---
[INFO] Building jar: /home/jenkins/.hudson/jobs/gazelle-atna-RELEASE/workspace/gazelle-xua-jar/target/gazelle-xua-jar-sources.jar
[INFO] 
[INFO] --- maven-jar-plugin:2.6:test-jar (default) @ gazelle-xua-jar ---
[INFO] Building jar: /home/jenkins/.hudson/jobs/gazelle-atna-RELEASE/workspace/gazelle-xua-jar/target/gazelle-xua-jar-tests.jar
Collecting metadata...
Metadata collection done.
Started calculate disk usage of build
Finished Calculation of disk usage of build in 0 seconds
Started calculate disk usage of workspace
Finished Calculation of disk usage of workspace in 0 seconds
[INFO] ------------------------------------------------------------------------
[INFO] Reactor Summary:
[INFO] 
[INFO] gazelle-atna ....................................... SUCCESS [  3.422 s]
[INFO] gazelle-pki-jar .................................... SUCCESS [ 15.734 s]
[INFO] gazelle-tls-jar .................................... SUCCESS [ 50.193 s]
[INFO] gazelle-xua-jar .................................... SUCCESS [  6.809 s]
[INFO] xml-signature-validator-jar ........................ SUCCESS [  4.966 s]
[INFO] gazelle-xua-tester-jar ............................. SUCCESS [  2.713 s]
[INFO] gazelle-atna-ejb ................................... SUCCESS [  4.186 s]
[INFO] gazelle-atna-war ................................... SUCCESS [  2.549 s]
[INFO] gazelle-atna-ear ................................... SUCCESS [  2.973 s]
[INFO] ------------------------------------------------------------------------
[INFO] BUILD SUCCESS
[INFO] ------------------------------------------------------------------------
[INFO] Total time: 01:41 min
[INFO] Finished at: 2019-06-11T10:50:08+02:00
[INFO] Final Memory: 70M/806M
[INFO] ------------------------------------------------------------------------
Waiting for Jenkins to finish collecting data