SuccessConsole Output

Collecting metadata...
Metadata collection done.
Started calculate disk usage of build
Finished Calculation of disk usage of build in 0 seconds
Started calculate disk usage of workspace
Finished Calculation of disk usage of workspace in 0 seconds
[INFO] 
[INFO] ------------------------------------------------------------------------
[INFO] Building gazelle-model-tm 4.2.2-SNAPSHOT
[INFO] ------------------------------------------------------------------------
[INFO] 
[INFO] --- maven-clean-plugin:3.0.0:clean (default-clean) @ gazelle-model-tm ---
[INFO] 
[INFO] --- maven-enforcer-plugin:1.2:enforce (enforce-java-version) @ gazelle-model-tm ---
[INFO] 
[INFO] --- maven-enforcer-plugin:1.2:enforce (enforce-maven-version) @ gazelle-model-tm ---
[INFO] 
[INFO] --- buildnumber-maven-plugin:1.2:create-timestamp (get-build-timestamp) @ gazelle-model-tm ---
[INFO] 
[INFO] --- buildnumber-maven-plugin:1.2:create (get-scm-revision) @ gazelle-model-tm ---
[INFO] 
[INFO] --- maven-buildmetadata-plugin:1.1.0.IHE.3:provide-buildmetadata (default) @ gazelle-model-tm ---
[INFO] Executing: /bin/sh -c cd /home/jenkins/.hudson/jobs/gazelle-model/workspace/gazelle-model-tm && svn --non-interactive log -v -r '{2019-08-27 14:54:08 +0000}:{2019-09-27 14:54:08 +0000}' svn+ssh://scm.gforge.inria.fr/svn/gazelle/Maven/gazelle-model/trunk/gazelle-model-tm
[INFO] Working directory: /home/jenkins/.hudson/jobs/gazelle-model/workspace/gazelle-model-tm
[INFO] Executing: /bin/sh -c cd /home/jenkins/.hudson/jobs/gazelle-model/workspace/gazelle-model-tm && svn --non-interactive status
[INFO] Working directory: /home/jenkins/.hudson/jobs/gazelle-model/workspace/gazelle-model-tm
[INFO] Writing properties '/home/jenkins/.hudson/jobs/gazelle-model/workspace/gazelle-model-tm/target/classes/META-INF/build.properties'...
[INFO] Writing XML report '/home/jenkins/.hudson/jobs/gazelle-model/workspace/gazelle-model-tm/target/buildmetadata.xml'...
[INFO] 
[INFO] --- jacoco-maven-plugin:0.7.9:prepare-agent (default) @ gazelle-model-tm ---
[INFO] argLine set to -javaagent:/home/jenkins/.m2/repository/org/jacoco/org.jacoco.agent/0.7.9/org.jacoco.agent-0.7.9-runtime.jar=destfile=/home/jenkins/.hudson/jobs/gazelle-model/workspace/gazelle-model-tm/target/jacoco.exec,append=true
[INFO] 
[INFO] --- maven-resources-plugin:3.0.2:resources (default-resources) @ gazelle-model-tm ---
[INFO] Using 'UTF-8' encoding to copy filtered resources.
[INFO] Copying 1 resource
[INFO] 
[INFO] --- maven-compiler-plugin:3.5.1:compile (default-compile) @ gazelle-model-tm ---
[INFO] Changes detected - recompiling the module!
[INFO] Compiling 148 source files to /home/jenkins/.hudson/jobs/gazelle-model/workspace/gazelle-model-tm/target/classes
[WARNING] /home/jenkins/.hudson/jobs/gazelle-model/workspace/gazelle-model-tm/src/main/java/net/ihe/gazelle/pr/search/model/ISDownload.java:[46,26] [deprecation] Entity in org.hibernate.annotations has been deprecated
[WARNING] /home/jenkins/.hudson/jobs/gazelle-model/workspace/gazelle-model-tm/src/main/java/net/ihe/gazelle/tm/systems/model/System.java:[89,26] [deprecation] Entity in org.hibernate.annotations has been deprecated
[WARNING] /home/jenkins/.hudson/jobs/gazelle-model/workspace/gazelle-model-tm/src/main/java/net/ihe/gazelle/pr/search/model/SearchLogReport.java:[54,26] [deprecation] Entity in org.hibernate.annotations has been deprecated
[WARNING] /home/jenkins/.hudson/jobs/gazelle-model/workspace/gazelle-model-tm/src/main/java/net/ihe/gazelle/tm/systems/model/SystemSubtypesPerSystemType.java:[49,26] [deprecation] Entity in org.hibernate.annotations has been deprecated
[WARNING] /home/jenkins/.hudson/jobs/gazelle-model/workspace/gazelle-model-tm/src/main/java/net/ihe/gazelle/tm/systems/model/SystemInSession.java:[88,26] [deprecation] Entity in org.hibernate.annotations has been deprecated
[WARNING] /home/jenkins/.hudson/jobs/gazelle-model/workspace/gazelle-model-tm/src/main/java/net/ihe/gazelle/tm/systems/model/SystemActorProfiles.java:[61,26] [deprecation] Entity in org.hibernate.annotations has been deprecated
[WARNING] /home/jenkins/.hudson/jobs/gazelle-model/workspace/gazelle-model-tm/src/main/java/net/ihe/gazelle/tm/systems/model/TestingSession.java:[86,26] [deprecation] Entity in org.hibernate.annotations has been deprecated
[WARNING] /home/jenkins/.hudson/jobs/gazelle-model/workspace/gazelle-model-tm/src/main/java/net/ihe/gazelle/pr/search/model/SearchLogCriterion.java:[50,26] [deprecation] Entity in org.hibernate.annotations has been deprecated
[WARNING] /home/jenkins/.hudson/jobs/gazelle-model/workspace/gazelle-model-tm/src/main/java/net/ihe/gazelle/objects/model/ObjectInstance.java:[66,26] [deprecation] Entity in org.hibernate.annotations has been deprecated
[WARNING] /home/jenkins/.hudson/jobs/gazelle-model/workspace/gazelle-model-tm/src/main/java/net/ihe/gazelle/objects/model/ObjectInstanceFile.java:[48,26] [deprecation] Entity in org.hibernate.annotations has been deprecated
[WARNING] /home/jenkins/.hudson/jobs/gazelle-model/workspace/gazelle-model-tm/src/main/java/net/ihe/gazelle/objects/model/ObjectType.java:[64,26] [deprecation] Entity in org.hibernate.annotations has been deprecated
[WARNING] /home/jenkins/.hudson/jobs/gazelle-model/workspace/gazelle-model-tm/src/main/java/net/ihe/gazelle/tm/systems/model/TestingType.java:[58,26] [deprecation] Entity in org.hibernate.annotations has been deprecated
[WARNING] /home/jenkins/.hudson/jobs/gazelle-model/workspace/gazelle-model-tm/src/main/java/net/ihe/gazelle/objects/model/ObjectInstanceValidation.java:[41,26] [deprecation] Entity in org.hibernate.annotations has been deprecated
[WARNING] /home/jenkins/.hudson/jobs/gazelle-model/workspace/gazelle-model-tm/src/main/java/net/ihe/gazelle/objects/model/ObjectInstanceAnnotation.java:[35,26] [deprecation] Entity in org.hibernate.annotations has been deprecated
[WARNING] /home/jenkins/.hudson/jobs/gazelle-model/workspace/gazelle-model-tm/src/main/java/net/ihe/gazelle/objects/model/ObjectInstanceAttribute.java:[32,26] [deprecation] Entity in org.hibernate.annotations has been deprecated
[WARNING] /home/jenkins/.hudson/jobs/gazelle-model/workspace/gazelle-model-tm/src/main/java/net/ihe/gazelle/objects/model/ObjectFile.java:[66,26] [deprecation] Entity in org.hibernate.annotations has been deprecated
[WARNING] /home/jenkins/.hudson/jobs/gazelle-model/workspace/gazelle-model-tm/src/main/java/net/ihe/gazelle/objects/model/ObjectTypeStatus.java:[63,26] [deprecation] Entity in org.hibernate.annotations has been deprecated
[WARNING] /home/jenkins/.hudson/jobs/gazelle-model/workspace/gazelle-model-tm/src/main/java/net/ihe/gazelle/objects/model/ObjectAttribute.java:[62,26] [deprecation] Entity in org.hibernate.annotations has been deprecated
[WARNING] /home/jenkins/.hudson/jobs/gazelle-model/workspace/gazelle-model-tm/src/main/java/net/ihe/gazelle/objects/model/ObjectCreator.java:[62,26] [deprecation] Entity in org.hibernate.annotations has been deprecated
[WARNING] /home/jenkins/.hudson/jobs/gazelle-model/workspace/gazelle-model-tm/src/main/java/net/ihe/gazelle/objects/model/ObjectReader.java:[63,26] [deprecation] Entity in org.hibernate.annotations has been deprecated
[WARNING] /home/jenkins/.hudson/jobs/gazelle-model/workspace/gazelle-model-tm/src/main/java/net/ihe/gazelle/objects/model/ObjectFileType.java:[57,26] [deprecation] Entity in org.hibernate.annotations has been deprecated
[WARNING] /home/jenkins/.hudson/jobs/gazelle-model/workspace/gazelle-model-tm/src/main/java/net/ihe/gazelle/objects/model/Annotation.java:[36,26] [deprecation] Entity in org.hibernate.annotations has been deprecated
[WARNING] /home/jenkins/.hudson/jobs/gazelle-model/workspace/gazelle-model-tm/src/main/java/net/ihe/gazelle/objects/model/ObjectAttributeOption.java:[59,26] [deprecation] Entity in org.hibernate.annotations has been deprecated
[WARNING] /home/jenkins/.hudson/jobs/gazelle-model/workspace/gazelle-model-tm/src/main/java/net/ihe/gazelle/tm/users/model/ConnectathonParticipant.java:[67,26] [deprecation] Entity in org.hibernate.annotations has been deprecated
[WARNING] /home/jenkins/.hudson/jobs/gazelle-model/workspace/gazelle-model-tm/src/main/java/net/ihe/gazelle/tm/users/model/ConnectathonParticipantStatus.java:[63,26] [deprecation] Entity in org.hibernate.annotations has been deprecated
[WARNING] /home/jenkins/.hudson/jobs/gazelle-model/workspace/gazelle-model-tm/src/main/java/net/ihe/gazelle/tm/users/model/UserPreferences.java:[62,26] [deprecation] Entity in org.hibernate.annotations has been deprecated
[WARNING] /home/jenkins/.hudson/jobs/gazelle-model/workspace/gazelle-model-tm/src/main/java/net/ihe/gazelle/tm/financial/model/Invoice.java:[66,26] [deprecation] Entity in org.hibernate.annotations has been deprecated
[WARNING] /home/jenkins/.hudson/jobs/gazelle-model/workspace/gazelle-model-tm/target/generated-sources/annotations/net/ihe/gazelle/pr/systems/model/SubtypesPerSystemAttributes.java:[16,51] [deprecation] SubtypesPerSystem in net.ihe.gazelle.pr.systems.model has been deprecated
[WARNING] /home/jenkins/.hudson/jobs/gazelle-model/workspace/gazelle-model-tm/target/generated-sources/annotations/net/ihe/gazelle/pr/systems/model/SubtypesPerSystemAttributes.java:[23,9] [deprecation] SubtypesPerSystem in net.ihe.gazelle.pr.systems.model has been deprecated
[WARNING] /home/jenkins/.hudson/jobs/gazelle-model/workspace/gazelle-model-tm/target/generated-sources/annotations/net/ihe/gazelle/pr/systems/model/SubtypesPerSystemEntity.java:[12,47] [deprecation] SubtypesPerSystem in net.ihe.gazelle.pr.systems.model has been deprecated
[WARNING] /home/jenkins/.hudson/jobs/gazelle-model/workspace/gazelle-model-tm/target/generated-sources/annotations/net/ihe/gazelle/pr/systems/model/SubtypesPerSystemQuery.java:[14,68] [deprecation] SubtypesPerSystem in net.ihe.gazelle.pr.systems.model has been deprecated
[WARNING] /home/jenkins/.hudson/jobs/gazelle-model/workspace/gazelle-model-tm/target/generated-sources/annotations/net/ihe/gazelle/pr/systems/model/SubtypesPerSystemQuery.java:[14,123] [deprecation] SubtypesPerSystem in net.ihe.gazelle.pr.systems.model has been deprecated
[WARNING] /home/jenkins/.hudson/jobs/gazelle-model/workspace/gazelle-model-tm/target/generated-sources/annotations/net/ihe/gazelle/pr/systems/model/SubtypesPerSystemQuery.java:[17,36] [deprecation] SubtypesPerSystem in net.ihe.gazelle.pr.systems.model has been deprecated
[WARNING] /home/jenkins/.hudson/jobs/gazelle-model/workspace/gazelle-model-tm/target/generated-sources/annotations/net/ihe/gazelle/pr/systems/model/SubtypesPerSystemQuery.java:[25,50] [deprecation] SubtypesPerSystem in net.ihe.gazelle.pr.systems.model has been deprecated
[WARNING] /home/jenkins/.hudson/jobs/gazelle-model/workspace/gazelle-model-tm/target/generated-sources/annotations/net/ihe/gazelle/pr/systems/model/SubtypesPerSystemQuery.java:[41,13] [deprecation] SubtypesPerSystem in net.ihe.gazelle.pr.systems.model has been deprecated
[WARNING] /home/jenkins/.hudson/jobs/gazelle-model/workspace/gazelle-model-tm/target/generated-sources/annotations/net/ihe/gazelle/pr/systems/model/SubtypesPerSystemQuery.java:[42,15] [deprecation] SubtypesPerSystem in net.ihe.gazelle.pr.systems.model has been deprecated
[WARNING] /home/jenkins/.hudson/jobs/gazelle-model/workspace/gazelle-model-tm/target/generated-sources/annotations/net/ihe/gazelle/pr/systems/model/SubtypesPerSystemQuery.java:[49,13] [deprecation] SubtypesPerSystem in net.ihe.gazelle.pr.systems.model has been deprecated
[WARNING] /home/jenkins/.hudson/jobs/gazelle-model/workspace/gazelle-model-tm/target/generated-sources/annotations/net/ihe/gazelle/pr/systems/model/SubtypesPerSystemQuery.java:[50,15] [deprecation] SubtypesPerSystem in net.ihe.gazelle.pr.systems.model has been deprecated
[WARNING] /home/jenkins/.hudson/jobs/gazelle-model/workspace/gazelle-model-tm/target/generated-sources/annotations/net/ihe/gazelle/pr/systems/model/SubtypesPerSystemQuery.java:[57,8] [deprecation] SubtypesPerSystem in net.ihe.gazelle.pr.systems.model has been deprecated
[WARNING] /home/jenkins/.hudson/jobs/gazelle-model/workspace/gazelle-model-tm/target/generated-sources/annotations/net/ihe/gazelle/pr/systems/model/SubtypesPerSystemQuery.java:[58,10] [deprecation] SubtypesPerSystem in net.ihe.gazelle.pr.systems.model has been deprecated
[WARNING] /home/jenkins/.hudson/jobs/gazelle-model/workspace/gazelle-model-tm/target/generated-sources/annotations/net/ihe/gazelle/pr/systems/model/SubtypesPerSystemQuery.java:[65,26] [deprecation] SubtypesPerSystem in net.ihe.gazelle.pr.systems.model has been deprecated
[WARNING] /home/jenkins/.hudson/jobs/gazelle-model/workspace/gazelle-model-tm/target/generated-sources/annotations/net/ihe/gazelle/pr/systems/model/SubtypesPerSystemQuery.java:[67,28] [deprecation] SubtypesPerSystem in net.ihe.gazelle.pr.systems.model has been deprecated
[WARNING] /home/jenkins/.hudson/jobs/gazelle-model/workspace/gazelle-model-tm/target/generated-sources/annotations/net/ihe/gazelle/pr/systems/model/SubtypesPerSystemQuery.java:[74,91] [deprecation] SubtypesPerSystem in net.ihe.gazelle.pr.systems.model has been deprecated
[INFO] 
[INFO] --- maven-resources-plugin:3.0.2:testResources (default-testResources) @ gazelle-model-tm ---
[INFO] Using 'UTF-8' encoding to copy filtered resources.
[INFO] Copying 4 resources
[INFO] 
[INFO] --- maven-compiler-plugin:3.5.1:testCompile (default-testCompile) @ gazelle-model-tm ---
[INFO] Changes detected - recompiling the module!
[INFO] Compiling 57 source files to /home/jenkins/.hudson/jobs/gazelle-model/workspace/gazelle-model-tm/target/test-classes
[WARNING] bootstrap class path not set in conjunction with -source 1.7
/home/jenkins/.hudson/jobs/gazelle-model/workspace/gazelle-model-tm/src/test/java/net/ihe/gazelle/tm/utils/TestQueryDDL.java:[5,24] [deprecation] Ejb3Configuration in org.hibernate.ejb has been deprecated
[WARNING] /home/jenkins/.hudson/jobs/gazelle-model/workspace/gazelle-model-tm/src/test/java/net/ihe/gazelle/tm/utils/TestQueryDDL.java:[5,24] [deprecation] Ejb3Configuration in org.hibernate.ejb has been deprecated
[WARNING] /home/jenkins/.hudson/jobs/gazelle-model/workspace/gazelle-model-tm/src/test/java/net/ihe/gazelle/tm/utils/TestQueryDDL.java:[5,24] [deprecation] Ejb3Configuration in org.hibernate.ejb has been deprecated
[WARNING] /home/jenkins/.hudson/jobs/gazelle-model/workspace/gazelle-model-tm/src/test/java/net/ihe/gazelle/tm/configurations/model/AbstractConfigurationTest.java:[64,62] non-varargs call of varargs method with inexact argument type for last parameter;
[WARNING] for a non-varargs call and to suppress this warning
/home/jenkins/.hudson/jobs/gazelle-model/workspace/gazelle-model-tm/src/test/java/net/ihe/gazelle/tm/configurations/model/AbstractConfigurationTest.java:[63,16] [deprecation] getConfigurationsFiltered(Class<?>,SystemInSession,System,Institution,TestingSession,Host,Actor,IntegrationProfile,WSTransactionUsage,String,Boolean,Boolean,Pair<String,Object>...) in AbstractConfiguration has been deprecated
[WARNING] /home/jenkins/.hudson/jobs/gazelle-model/workspace/gazelle-model-tm/src/test/java/net/ihe/gazelle/tm/configurations/model/AbstractConfigurationTest.java:[68,62] non-varargs call of varargs method with inexact argument type for last parameter;
[WARNING] for a non-varargs call and to suppress this warning
/home/jenkins/.hudson/jobs/gazelle-model/workspace/gazelle-model-tm/src/test/java/net/ihe/gazelle/tm/configurations/model/AbstractConfigurationTest.java:[91,51] [deprecation] getStatusOfTestParticipantsForTest(TestRoles,SystemInSession) in TestInstanceParticipants has been deprecated
[WARNING] /home/jenkins/.hudson/jobs/gazelle-model/workspace/gazelle-model-tm/src/test/java/net/ihe/gazelle/tm/utils/TestQueryDDL.java:[14,8] [deprecation] Ejb3Configuration in org.hibernate.ejb has been deprecated
[WARNING] /home/jenkins/.hudson/jobs/gazelle-model/workspace/gazelle-model-tm/src/test/java/net/ihe/gazelle/tm/utils/TestQueryDDL.java:[14,36] [deprecation] Ejb3Configuration in org.hibernate.ejb has been deprecated
[WARNING] /home/jenkins/.hudson/jobs/gazelle-model/workspace/gazelle-model-tm/src/test/java/net/ihe/gazelle/tm/utils/TestQueryDDL.java:[15,8] [deprecation] Ejb3Configuration in org.hibernate.ejb has been deprecated
[INFO] 
[INFO] --- maven-surefire-plugin:2.20:test (default-test) @ gazelle-model-tm ---
[INFO] 
[INFO] -------------------------------------------------------
[INFO]  T E S T S
[INFO] -------------------------------------------------------
[INFO] Running net.ihe.gazelle.tm.utils.AllTests
[WARNING] Tests run: 1, Failures: 0, Errors: 0, Skipped: 1, Time elapsed: 0.002 s - in net.ihe.gazelle.tm.utils.AllTests
[INFO] Running net.ihe.gazelle.tm.utils.TestQueryDDL
[WARNING] Tests run: 1, Failures: 0, Errors: 0, Skipped: 1, Time elapsed: 0 s - in net.ihe.gazelle.tm.utils.TestQueryDDL
[INFO] Running net.ihe.gazelle.tm.gazelletest.jira.JiraIssuesToTestTest
[WARNING] Tests run: 1, Failures: 0, Errors: 0, Skipped: 1, Time elapsed: 0 s - in net.ihe.gazelle.tm.gazelletest.jira.JiraIssuesToTestTest
[INFO] Running net.ihe.gazelle.tm.gazelletest.model.definition.TestStepsTest
[WARNING] Tests run: 9, Failures: 0, Errors: 0, Skipped: 5, Time elapsed: 0.014 s - in net.ihe.gazelle.tm.gazelletest.model.definition.TestStepsTest
[INFO] Running net.ihe.gazelle.tm.gazelletest.model.definition.TestOptionTest
[main] INFO org.reflections.Reflections - Reflections took 534 ms to scan 16 urls, producing 749 keys and 3160 values 
[main] INFO org.hibernate.validator.util.Version - Hibernate Validator 4.2.0.Final
[INFO] Tests run: 2, Failures: 0, Errors: 0, Skipped: 0, Time elapsed: 5.024 s - in net.ihe.gazelle.tm.gazelletest.model.definition.TestOptionTest
[INFO] Running net.ihe.gazelle.tm.gazelletest.model.definition.TestTest
[WARNING] Tests run: 2, Failures: 0, Errors: 0, Skipped: 1, Time elapsed: 0 s - in net.ihe.gazelle.tm.gazelletest.model.definition.TestTest
[INFO] Running net.ihe.gazelle.tm.configurations.model.AbstractConfigurationTest
[WARNING] Tests run: 1, Failures: 0, Errors: 0, Skipped: 1, Time elapsed: 0 s - in net.ihe.gazelle.tm.configurations.model.AbstractConfigurationTest
[INFO] Running net.ihe.gazelle.tm.configurations.model.HostTest
[WARNING] Tests run: 1, Failures: 0, Errors: 0, Skipped: 1, Time elapsed: 0 s - in net.ihe.gazelle.tm.configurations.model.HostTest
[INFO] Running net.ihe.gazelle.tm.systems.model.SystemActorProfilesTest
[WARNING] Tests run: 1, Failures: 0, Errors: 0, Skipped: 1, Time elapsed: 0 s - in net.ihe.gazelle.tm.systems.model.SystemActorProfilesTest
[INFO] Running net.ihe.gazelle.tm.systems.model.TestingSessionTest
[INFO] Tests run: 11, Failures: 0, Errors: 0, Skipped: 0, Time elapsed: 0.826 s - in net.ihe.gazelle.tm.systems.model.TestingSessionTest
[INFO] Running net.ihe.gazelle.tm.systems.model.SystemInSessionTest
[main] INFO org.hibernate.validator.util.Version - Hibernate Validator 4.2.0.Final
[main] WARN net.ihe.gazelle.junit.DatabaseManager - org.hibernate.exception.ConstraintViolationException: could not execute statement
[main] WARN net.ihe.gazelle.junit.DatabaseManager - Unable to find net.ihe.gazelle.tm.systems.model.System with id 1
[main] WARN net.ihe.gazelle.junit.DatabaseManager - org.hibernate.exception.ConstraintViolationException: could not execute statement
[main] WARN net.ihe.gazelle.junit.DatabaseManager - Unable to find net.ihe.gazelle.tm.systems.model.System with id 2
[main] WARN net.ihe.gazelle.junit.DatabaseManager - org.hibernate.exception.ConstraintViolationException: could not execute statement
[main] WARN net.ihe.gazelle.junit.DatabaseManager - Unable to find net.ihe.gazelle.tm.systems.model.System with id 3
[main] WARN net.ihe.gazelle.junit.DatabaseManager - org.hibernate.exception.ConstraintViolationException: could not execute statement
[main] WARN net.ihe.gazelle.junit.DatabaseManager - Unable to find net.ihe.gazelle.tm.systems.model.System with id 4
[INFO] Tests run: 4, Failures: 0, Errors: 0, Skipped: 0, Time elapsed: 4.337 s - in net.ihe.gazelle.tm.systems.model.SystemInSessionTest
[INFO] Running net.ihe.gazelle.tm.systems.model.SystemInSessionRegistrationStatusTest
[INFO] Tests run: 2, Failures: 0, Errors: 0, Skipped: 0, Time elapsed: 0.003 s - in net.ihe.gazelle.tm.systems.model.SystemInSessionRegistrationStatusTest
[INFO] Running net.ihe.gazelle.objects.test.ObjectFileTest
[INFO] Tests run: 12, Failures: 0, Errors: 0, Skipped: 0, Time elapsed: 0.004 s - in net.ihe.gazelle.objects.test.ObjectFileTest
[INFO] Running net.ihe.gazelle.objects.test.ObjectInstanceTest
[INFO] Tests run: 11, Failures: 0, Errors: 0, Skipped: 0, Time elapsed: 0.003 s - in net.ihe.gazelle.objects.test.ObjectInstanceTest
[INFO] Running net.ihe.gazelle.objects.test.ObjectInstanceAnnotationTest
[INFO] Tests run: 5, Failures: 0, Errors: 0, Skipped: 0, Time elapsed: 0 s - in net.ihe.gazelle.objects.test.ObjectInstanceAnnotationTest
[INFO] Running net.ihe.gazelle.objects.test.ObjectFileTypeTest
[INFO] Tests run: 8, Failures: 0, Errors: 0, Skipped: 0, Time elapsed: 0.004 s - in net.ihe.gazelle.objects.test.ObjectFileTypeTest
[INFO] Running net.ihe.gazelle.objects.test.ObjectAttributeTest
[INFO] Tests run: 10, Failures: 0, Errors: 0, Skipped: 0, Time elapsed: 0.003 s - in net.ihe.gazelle.objects.test.ObjectAttributeTest
[INFO] Running net.ihe.gazelle.objects.test.AnnotationTest
[INFO] Tests run: 5, Failures: 0, Errors: 0, Skipped: 0, Time elapsed: 0.003 s - in net.ihe.gazelle.objects.test.AnnotationTest
[INFO] Running net.ihe.gazelle.objects.test.ObjectCreatorTest
[INFO] Tests run: 4, Failures: 0, Errors: 0, Skipped: 0, Time elapsed: 0 s - in net.ihe.gazelle.objects.test.ObjectCreatorTest
[INFO] Running net.ihe.gazelle.objects.test.ObjectInstanceFileTest
[INFO] Tests run: 9, Failures: 0, Errors: 0, Skipped: 0, Time elapsed: 0.001 s - in net.ihe.gazelle.objects.test.ObjectInstanceFileTest
[INFO] Running net.ihe.gazelle.objects.test.ObjectInstanceAttributeTest
[INFO] Tests run: 7, Failures: 0, Errors: 0, Skipped: 0, Time elapsed: 0.001 s - in net.ihe.gazelle.objects.test.ObjectInstanceAttributeTest
[INFO] Running net.ihe.gazelle.IO.TestsExportTest
[WARNING] Tests run: 3, Failures: 0, Errors: 0, Skipped: 3, Time elapsed: 0 s - in net.ihe.gazelle.IO.TestsExportTest
[INFO] Running net.ihe.gazelle.IO.TestsImportTest
[WARNING] Tests run: 1, Failures: 0, Errors: 0, Skipped: 1, Time elapsed: 0 s - in net.ihe.gazelle.IO.TestsImportTest
[INFO] 
[INFO] Results:
[INFO] 
[WARNING] Tests run: 111, Failures: 0, Errors: 0, Skipped: 16
[INFO] 
[JENKINS] Recording test results
[INFO] 
[INFO] --- jacoco-maven-plugin:0.7.9:report (post-unit-test) @ gazelle-model-tm ---
[INFO] Loading execution data file /home/jenkins/.hudson/jobs/gazelle-model/workspace/gazelle-model-tm/target/jacoco.exec
[INFO] Analyzed bundle 'gazelle-model-tm' with 528 classes
[INFO] 
[INFO] --- maven-ejb-plugin:2.3:ejb (default-ejb) @ gazelle-model-tm ---
[INFO] Building EJB gazelle-model-tm with EJB version 3.0
[INFO] Building jar: /home/jenkins/.hudson/jobs/gazelle-model/workspace/gazelle-model-tm/target/gazelle-model-tm.jar
[INFO] 
[INFO] --- maven-source-plugin:3.0.1:jar-no-fork (attach-sources) @ gazelle-model-tm ---
[INFO] Building jar: /home/jenkins/.hudson/jobs/gazelle-model/workspace/gazelle-model-tm/target/gazelle-model-tm-sources.jar
[INFO] 
[INFO] --- maven-jar-plugin:2.6:test-jar (default) @ gazelle-model-tm ---
[INFO] Building jar: /home/jenkins/.hudson/jobs/gazelle-model/workspace/gazelle-model-tm/target/gazelle-model-tm-tests.jar
[INFO] 
[INFO] --- maven-install-plugin:2.4:install (default-install) @ gazelle-model-tm ---
[INFO] Installing /home/jenkins/.hudson/jobs/gazelle-model/workspace/gazelle-model-tm/target/gazelle-model-tm.jar to /home/jenkins/.m2/repository/net/ihe/gazelle/model/gazelle-model-tm/4.2.2-SNAPSHOT/gazelle-model-tm-4.2.2-SNAPSHOT.jar
[INFO] Installing /home/jenkins/.hudson/jobs/gazelle-model/workspace/gazelle-model-tm/pom.xml to /home/jenkins/.m2/repository/net/ihe/gazelle/model/gazelle-model-tm/4.2.2-SNAPSHOT/gazelle-model-tm-4.2.2-SNAPSHOT.pom
[INFO] Installing /home/jenkins/.hudson/jobs/gazelle-model/workspace/gazelle-model-tm/target/gazelle-model-tm-sources.jar to /home/jenkins/.m2/repository/net/ihe/gazelle/model/gazelle-model-tm/4.2.2-SNAPSHOT/gazelle-model-tm-4.2.2-SNAPSHOT-sources.jar
[INFO] Installing /home/jenkins/.hudson/jobs/gazelle-model/workspace/gazelle-model-tm/target/gazelle-model-tm-tests.jar to /home/jenkins/.m2/repository/net/ihe/gazelle/model/gazelle-model-tm/4.2.2-SNAPSHOT/gazelle-model-tm-4.2.2-SNAPSHOT-tests.jar