Not builtConsole Output

[BFA] Scanning build for known causes...
[BFA] No failure causes found
[BFA] Done. 0s
Started calculate disk usage of build
Finished Calculation of disk usage of build in 0 seconds
Started calculate disk usage of workspace
Finished Calculation of disk usage of workspace in 0 seconds
[INFO] 
[INFO] ------------------------------------------------------------------------
[INFO] Skipping gazelle-proxy
[INFO] This project has been banned from the build due to previous failures.
[INFO] ------------------------------------------------------------------------
[INFO] ------------------------------------------------------------------------
[INFO] Reactor Summary:
[INFO] 
[INFO] gazelle-proxy ...................................... SUCCESS [  4.178 s]
[INFO] gazelle-proxy-netty ................................ SUCCESS [  7.432 s]
[INFO] gazelle-proxy-jar .................................. FAILURE [  3.994 s]
[INFO] gazelle-proxy - EJB ................................ SKIPPED
[INFO] gazelle-proxy - Common WAR ......................... SKIPPED
[INFO] gazelle-proxy-war .................................. SKIPPED
[INFO] gazelle-proxy - EAR ................................ SKIPPED
[INFO] ------------------------------------------------------------------------
[INFO] BUILD FAILURE
[INFO] ------------------------------------------------------------------------
[INFO] Total time: 18.627 s
[INFO] Finished at: 2019-03-01T11:07:02+01:00
[INFO] Final Memory: 55M/771M
[INFO] ------------------------------------------------------------------------
Waiting for Jenkins to finish collecting data
[ERROR] Failed to execute goal org.apache.maven.plugins:maven-compiler-plugin:3.5.1:compile (default-compile) on project gazelle-proxy-jar: Compilation failure: Compilation failure:
[ERROR] /home/jenkins/.hudson/jobs/gazelle-proxy-nbt/workspace/gazelle-proxy-jar/src/main/java/net/ihe/gazelle/proxy/model/message/AbstractMessage.java:[331,4] error: method does not override or implement a method from a supertype
[ERROR] /home/jenkins/.hudson/jobs/gazelle-proxy-nbt/workspace/gazelle-proxy-jar/src/main/java/net/ihe/gazelle/proxy/model/message/AbstractMessage.java:[337,4] error: method does not override or implement a method from a supertype
[ERROR] /home/jenkins/.hudson/jobs/gazelle-proxy-nbt/workspace/gazelle-proxy-jar/src/main/java/net/ihe/gazelle/proxy/gui/MessageBean.java:[592,56] error: cannot find symbol
[ERROR] symbol:   method addToParts(AbstractMessage,String)
[ERROR] location: class EVSClientServletConnector
[ERROR] /home/jenkins/.hudson/jobs/gazelle-proxy-nbt/workspace/gazelle-proxy-jar/src/main/java/net/ihe/gazelle/proxy/gui/MessageBean.java:[600,48] error: cannot find symbol
[ERROR] symbol:   method addToParts(AbstractMessage,String)
[ERROR] location: class EVSClientServletConnector
[ERROR] /home/jenkins/.hudson/jobs/gazelle-proxy-nbt/workspace/gazelle-proxy-jar/src/main/java/net/ihe/gazelle/proxy/gui/MessageBean.java:[606,52] error: cannot find symbol
[ERROR] -> [Help 1]
[ERROR] 
[ERROR] To see the full stack trace of the errors, re-run Maven with the -e switch.
[ERROR] Re-run Maven using the -X switch to enable full debug logging.
[ERROR] 
[ERROR] For more information about the errors and possible solutions, please read the following articles:
[ERROR] [Help 1] http://cwiki.apache.org/confluence/display/MAVEN/MojoFailureException
[ERROR] 
[ERROR] After correcting the problems, you can resume the build with the command
[ERROR]   mvn <goals> -rf :gazelle-proxy-jar
Started
Build failed before it gets to this module
[BFA] Scanning build for known causes...
[BFA] No failure causes found
[BFA] Done. 0s
Started calculate disk usage of build
Finished Calculation of disk usage of build in 0 seconds
Started calculate disk usage of workspace
Finished Calculation of disk usage of workspace in 0 seconds
Finished: NOT_BUILT