FailedConsole Output

Started by timer
[EnvInject] - Loading node environment variables.
Building on master in workspace /home/jenkins/.hudson/jobs/gazelle-public-SNAPSHOT/workspace
Reverting /home/jenkins/.hudson/jobs/gazelle-public-SNAPSHOT/workspace/. to depth infinity with ignoreExternals: false
Updating svn+ssh://scm.gforge.inria.fr/svn/gazelle/Maven/gazelle-tm/trunk at revision '2017-04-09T04:04:00.366 +0200'
At revision 56669

No changes for svn+ssh://scm.gforge.inria.fr/svn/gazelle/Maven/gazelle-tm/trunk since the previous build
Parsing POMs
Downloaded artifact https://gazelle.ihe.net/nexus/content/groups/public/net/ihe/gazelle/model/gazelle-model/3.3.125-SNAPSHOT/maven-metadata.xml
Established TCP socket on 54466
[workspace] $ /usr/lib/jvm/java-8-oracle//bin/java -Djava.net.preferIPv4Stack=true -Dfile.encoding=UTF8 -Xmx512m -XX:MaxPermSize=128m -cp /home/jenkins/.hudson/plugins/maven-plugin/WEB-INF/lib/maven33-agent-1.8.1.jar:/home/jenkins/.hudson/tools/hudson.tasks.Maven_MavenInstallation/Maven3/boot/plexus-classworlds-2.5.2.jar:/home/jenkins/.hudson/tools/hudson.tasks.Maven_MavenInstallation/Maven3/conf/logging jenkins.maven3.agent.Maven33Main /home/jenkins/.hudson/tools/hudson.tasks.Maven_MavenInstallation/Maven3 /home/jenkins/.hudson/war/WEB-INF/lib/remoting-3.7.jar /home/jenkins/.hudson/plugins/maven-plugin/WEB-INF/lib/maven33-interceptor-1.8.1.jar /home/jenkins/.hudson/plugins/maven-plugin/WEB-INF/lib/maven3-interceptor-commons-1.8.1.jar 54466
Java HotSpot(TM) 64-Bit Server VM warning: ignoring option MaxPermSize=128m; support was removed in 8.0
<===[JENKINS REMOTING CAPACITY]===>channel started
Executing Maven:  -B -f /home/jenkins/.hudson/jobs/gazelle-public-SNAPSHOT/workspace/pom.xml -Ppublic,distribution clean deploy
[INFO] Scanning for projects...
[WARNING] 
[WARNING] Some problems were encountered while building the effective model for net.ihe.gazelle.tm:gazelle-tm-war:war:4.12.0-SNAPSHOT
[WARNING] The expression ${artifactId} is deprecated. Please use ${project.artifactId} instead.
[WARNING] The expression ${version} is deprecated. Please use ${project.version} instead.
[WARNING] 
[WARNING] It is highly recommended to fix these problems because they threaten the stability of your build.
[WARNING] 
[WARNING] For this reason, future Maven versions might no longer support building such malformed projects.
[WARNING] 
[INFO] ------------------------------------------------------------------------
[INFO] Reactor Build Order:
[INFO] 
[INFO] Gazelle Test Management Platform
[INFO] gazelle-tm-ws-data
[INFO] gazelle-tm-ejb
[INFO] gazelle-tm-war
[INFO] gazelle-tm-ear
[INFO] gazelle-tm-ws-client
[INFO]                                                                         
[INFO] ------------------------------------------------------------------------
[INFO] Building Gazelle Test Management Platform 4.12.0-SNAPSHOT
[INFO] ------------------------------------------------------------------------
[INFO] 
[INFO] --- maven-clean-plugin:2.4.1:clean (default-clean) @ gazelle-tm ---
[INFO] Deleting /home/jenkins/.hudson/jobs/gazelle-public-SNAPSHOT/workspace/target
[INFO] 
[INFO] --- maven-buildmetadata-plugin:1.1.0.IHE.3:provide-buildmetadata (default) @ gazelle-tm ---
[INFO] Writing properties '/home/jenkins/.hudson/jobs/gazelle-public-SNAPSHOT/workspace/target/build.properties'...
[INFO] Writing XML report '/home/jenkins/.hudson/jobs/gazelle-public-SNAPSHOT/workspace/target/buildmetadata.xml'...
[INFO] 
[INFO] --- maven-assembly-plugin:2.2.1:single (make-assembly-metadata) @ gazelle-tm ---
[INFO] Building zip: /home/jenkins/.hudson/jobs/gazelle-public-SNAPSHOT/workspace/target/gazelle-tm-4.12.0-SNAPSHOT-metadata.zip
[INFO] 
[INFO] --- maven-install-plugin:2.1:install (default-install) @ gazelle-tm ---
[INFO] Installing /home/jenkins/.hudson/jobs/gazelle-public-SNAPSHOT/workspace/pom.xml to /home/jenkins/.m2/repository/net/ihe/gazelle/tm/gazelle-tm/4.12.0-SNAPSHOT/gazelle-tm-4.12.0-SNAPSHOT.pom
[INFO] Installing /home/jenkins/.hudson/jobs/gazelle-public-SNAPSHOT/workspace/target/gazelle-tm-4.12.0-SNAPSHOT-metadata.zip to /home/jenkins/.m2/repository/net/ihe/gazelle/tm/gazelle-tm/4.12.0-SNAPSHOT/gazelle-tm-4.12.0-SNAPSHOT-metadata.zip
[INFO] 
[INFO] --- maven-deploy-plugin:2.7:deploy (default-deploy) @ gazelle-tm ---
[INFO] Downloading: https://gazelle.ihe.net/nexus/content/repositories/snapshots/net/ihe/gazelle/tm/gazelle-tm/4.12.0-SNAPSHOT/maven-metadata.xml
[INFO] Downloaded: https://gazelle.ihe.net/nexus/content/repositories/snapshots/net/ihe/gazelle/tm/gazelle-tm/4.12.0-SNAPSHOT/maven-metadata.xml (829 B at 1.6 KB/sec)
[INFO] Uploading: https://gazelle.ihe.net/nexus/content/repositories/snapshots/net/ihe/gazelle/tm/gazelle-tm/4.12.0-SNAPSHOT/gazelle-tm-4.12.0-20170409.020408-725.pom
[INFO] Uploaded: https://gazelle.ihe.net/nexus/content/repositories/snapshots/net/ihe/gazelle/tm/gazelle-tm/4.12.0-SNAPSHOT/gazelle-tm-4.12.0-20170409.020408-725.pom (26 KB at 27.1 KB/sec)
[INFO] Downloading: https://gazelle.ihe.net/nexus/content/repositories/snapshots/net/ihe/gazelle/tm/gazelle-tm/maven-metadata.xml
[INFO] Downloaded: https://gazelle.ihe.net/nexus/content/repositories/snapshots/net/ihe/gazelle/tm/gazelle-tm/maven-metadata.xml (3 KB at 5.5 KB/sec)
[INFO] Uploading: https://gazelle.ihe.net/nexus/content/repositories/snapshots/net/ihe/gazelle/tm/gazelle-tm/4.12.0-SNAPSHOT/maven-metadata.xml
[INFO] Uploaded: https://gazelle.ihe.net/nexus/content/repositories/snapshots/net/ihe/gazelle/tm/gazelle-tm/4.12.0-SNAPSHOT/maven-metadata.xml (829 B at 1.0 KB/sec)
[INFO] Uploading: https://gazelle.ihe.net/nexus/content/repositories/snapshots/net/ihe/gazelle/tm/gazelle-tm/maven-metadata.xml
[INFO] Uploaded: https://gazelle.ihe.net/nexus/content/repositories/snapshots/net/ihe/gazelle/tm/gazelle-tm/maven-metadata.xml (3 KB at 2.6 KB/sec)
[INFO] Uploading: https://gazelle.ihe.net/nexus/content/repositories/snapshots/net/ihe/gazelle/tm/gazelle-tm/4.12.0-SNAPSHOT/gazelle-tm-4.12.0-20170409.020408-725-metadata.zip
[INFO] Uploaded: https://gazelle.ihe.net/nexus/content/repositories/snapshots/net/ihe/gazelle/tm/gazelle-tm/4.12.0-SNAPSHOT/gazelle-tm-4.12.0-20170409.020408-725-metadata.zip (783 B at 0.9 KB/sec)
[INFO] Uploading: https://gazelle.ihe.net/nexus/content/repositories/snapshots/net/ihe/gazelle/tm/gazelle-tm/4.12.0-SNAPSHOT/maven-metadata.xml
[INFO] Uploaded: https://gazelle.ihe.net/nexus/content/repositories/snapshots/net/ihe/gazelle/tm/gazelle-tm/4.12.0-SNAPSHOT/maven-metadata.xml (829 B at 0.7 KB/sec)
Started calculate disk usage of build
Finished Calculation of disk usage of build in 0 seconds
Started calculate disk usage of workspace
Finished Calculation of disk usage of workspace in 0 seconds
[INFO]                                                                         
[INFO] ------------------------------------------------------------------------
[INFO] Building gazelle-tm-ws-data 4.12.0-SNAPSHOT
[INFO] ------------------------------------------------------------------------
[INFO] 
[INFO] --- maven-clean-plugin:2.4.1:clean (default-clean) @ gazelle-tm-ws-data ---
[INFO] Deleting /home/jenkins/.hudson/jobs/gazelle-public-SNAPSHOT/workspace/gazelle-tm-ws-data/target
[INFO] 
[INFO] --- maven-buildmetadata-plugin:1.1.0.IHE.3:provide-buildmetadata (default) @ gazelle-tm-ws-data ---
[INFO] Writing properties '/home/jenkins/.hudson/jobs/gazelle-public-SNAPSHOT/workspace/gazelle-tm-ws-data/target/classes/META-INF/build.properties'...
[INFO] Writing XML report '/home/jenkins/.hudson/jobs/gazelle-public-SNAPSHOT/workspace/gazelle-tm-ws-data/target/buildmetadata.xml'...
[INFO] 
[INFO] --- maven-resources-plugin:2.5:resources (default-resources) @ gazelle-tm-ws-data ---
[debug] execute contextualize
[INFO] Using 'UTF-8' encoding to copy filtered resources.
[INFO] skip non existing resourceDirectory /home/jenkins/.hudson/jobs/gazelle-public-SNAPSHOT/workspace/gazelle-tm-ws-data/src/main/resources
[INFO] 
[INFO] --- maven-compiler-plugin:2.3.2:compile (default-compile) @ gazelle-tm-ws-data ---
[INFO] Compiling 33 source files to /home/jenkins/.hudson/jobs/gazelle-public-SNAPSHOT/workspace/gazelle-tm-ws-data/target/classes
[INFO] 
[INFO] --- maven-resources-plugin:2.5:testResources (default-testResources) @ gazelle-tm-ws-data ---
[debug] execute contextualize
[INFO] Using 'UTF-8' encoding to copy filtered resources.
[INFO] skip non existing resourceDirectory /home/jenkins/.hudson/jobs/gazelle-public-SNAPSHOT/workspace/gazelle-tm-ws-data/src/test/resources
[INFO] 
[INFO] --- maven-compiler-plugin:2.3.2:testCompile (default-testCompile) @ gazelle-tm-ws-data ---
[INFO] Compiling 2 source files to /home/jenkins/.hudson/jobs/gazelle-public-SNAPSHOT/workspace/gazelle-tm-ws-data/target/test-classes
[INFO] 
[INFO] --- maven-surefire-plugin:2.13:test (default-test) @ gazelle-tm-ws-data ---
[INFO] Tests are skipped.
[INFO] 
[INFO] --- maven-jar-plugin:2.3:jar (default-jar) @ gazelle-tm-ws-data ---
[INFO] Building jar: /home/jenkins/.hudson/jobs/gazelle-public-SNAPSHOT/workspace/gazelle-tm-ws-data/target/gazelle-tm-ws-data-4.12.0-SNAPSHOT.jar
[INFO] 
[INFO] --- maven-jar-plugin:2.3:test-jar (default) @ gazelle-tm-ws-data ---
[INFO] Building jar: /home/jenkins/.hudson/jobs/gazelle-public-SNAPSHOT/workspace/gazelle-tm-ws-data/target/gazelle-tm-ws-data-4.12.0-SNAPSHOT-tests.jar
[INFO] 
[INFO] --- maven-install-plugin:2.1:install (default-install) @ gazelle-tm-ws-data ---
[INFO] Installing /home/jenkins/.hudson/jobs/gazelle-public-SNAPSHOT/workspace/gazelle-tm-ws-data/target/gazelle-tm-ws-data-4.12.0-SNAPSHOT.jar to /home/jenkins/.m2/repository/net/ihe/gazelle/tm/gazelle-tm-ws-data/4.12.0-SNAPSHOT/gazelle-tm-ws-data-4.12.0-SNAPSHOT.jar
[INFO] Installing /home/jenkins/.hudson/jobs/gazelle-public-SNAPSHOT/workspace/gazelle-tm-ws-data/pom.xml to /home/jenkins/.m2/repository/net/ihe/gazelle/tm/gazelle-tm-ws-data/4.12.0-SNAPSHOT/gazelle-tm-ws-data-4.12.0-SNAPSHOT.pom
[INFO] Installing /home/jenkins/.hudson/jobs/gazelle-public-SNAPSHOT/workspace/gazelle-tm-ws-data/target/gazelle-tm-ws-data-4.12.0-SNAPSHOT-tests.jar to /home/jenkins/.m2/repository/net/ihe/gazelle/tm/gazelle-tm-ws-data/4.12.0-SNAPSHOT/gazelle-tm-ws-data-4.12.0-SNAPSHOT-tests.jar
[INFO] 
[INFO] --- maven-deploy-plugin:2.7:deploy (default-deploy) @ gazelle-tm-ws-data ---
[INFO] Downloading: https://gazelle.ihe.net/nexus/content/repositories/snapshots/net/ihe/gazelle/tm/gazelle-tm-ws-data/4.12.0-SNAPSHOT/maven-metadata.xml
[INFO] Downloaded: https://gazelle.ihe.net/nexus/content/repositories/snapshots/net/ihe/gazelle/tm/gazelle-tm-ws-data/4.12.0-SNAPSHOT/maven-metadata.xml (1014 B at 3.0 KB/sec)
[INFO] Uploading: https://gazelle.ihe.net/nexus/content/repositories/snapshots/net/ihe/gazelle/tm/gazelle-tm-ws-data/4.12.0-SNAPSHOT/gazelle-tm-ws-data-4.12.0-20170409.020416-1147.jar
[INFO] Uploaded: https://gazelle.ihe.net/nexus/content/repositories/snapshots/net/ihe/gazelle/tm/gazelle-tm-ws-data/4.12.0-SNAPSHOT/gazelle-tm-ws-data-4.12.0-20170409.020416-1147.jar (37 KB at 42.6 KB/sec)
[INFO] Uploading: https://gazelle.ihe.net/nexus/content/repositories/snapshots/net/ihe/gazelle/tm/gazelle-tm-ws-data/4.12.0-SNAPSHOT/gazelle-tm-ws-data-4.12.0-20170409.020416-1147.pom
[INFO] Uploaded: https://gazelle.ihe.net/nexus/content/repositories/snapshots/net/ihe/gazelle/tm/gazelle-tm-ws-data/4.12.0-SNAPSHOT/gazelle-tm-ws-data-4.12.0-20170409.020416-1147.pom (718 B at 0.9 KB/sec)
[INFO] Downloading: https://gazelle.ihe.net/nexus/content/repositories/snapshots/net/ihe/gazelle/tm/gazelle-tm-ws-data/maven-metadata.xml
[INFO] Downloaded: https://gazelle.ihe.net/nexus/content/repositories/snapshots/net/ihe/gazelle/tm/gazelle-tm-ws-data/maven-metadata.xml (2 KB at 3.7 KB/sec)
[INFO] Uploading: https://gazelle.ihe.net/nexus/content/repositories/snapshots/net/ihe/gazelle/tm/gazelle-tm-ws-data/4.12.0-SNAPSHOT/maven-metadata.xml
[INFO] Uploaded: https://gazelle.ihe.net/nexus/content/repositories/snapshots/net/ihe/gazelle/tm/gazelle-tm-ws-data/4.12.0-SNAPSHOT/maven-metadata.xml (1014 B at 1.0 KB/sec)
[INFO] Uploading: https://gazelle.ihe.net/nexus/content/repositories/snapshots/net/ihe/gazelle/tm/gazelle-tm-ws-data/maven-metadata.xml
[INFO] Uploaded: https://gazelle.ihe.net/nexus/content/repositories/snapshots/net/ihe/gazelle/tm/gazelle-tm-ws-data/maven-metadata.xml (2 KB at 1.4 KB/sec)
[INFO] Uploading: https://gazelle.ihe.net/nexus/content/repositories/snapshots/net/ihe/gazelle/tm/gazelle-tm-ws-data/4.12.0-SNAPSHOT/gazelle-tm-ws-data-4.12.0-20170409.020416-1147-tests.jar
[INFO] Uploaded: https://gazelle.ihe.net/nexus/content/repositories/snapshots/net/ihe/gazelle/tm/gazelle-tm-ws-data/4.12.0-SNAPSHOT/gazelle-tm-ws-data-4.12.0-20170409.020416-1147-tests.jar (5 KB at 5.2 KB/sec)
[INFO] Uploading: https://gazelle.ihe.net/nexus/content/repositories/snapshots/net/ihe/gazelle/tm/gazelle-tm-ws-data/4.12.0-SNAPSHOT/maven-metadata.xml
[INFO] Uploaded: https://gazelle.ihe.net/nexus/content/repositories/snapshots/net/ihe/gazelle/tm/gazelle-tm-ws-data/4.12.0-SNAPSHOT/maven-metadata.xml (1014 B at 1.1 KB/sec)
Started calculate disk usage of build
Finished Calculation of disk usage of build in 0 seconds
Started calculate disk usage of workspace
Finished Calculation of disk usage of workspace in 0 seconds
[INFO]                                                                         
[INFO] ------------------------------------------------------------------------
[INFO] Building gazelle-tm-ejb 4.12.0-SNAPSHOT
[INFO] ------------------------------------------------------------------------
[INFO] Downloading: https://gazelle.ihe.net/nexus/content/groups/public/net/ihe/gazelle/model/gazelle-model-common/3.3.125-SNAPSHOT/maven-metadata.xml
[INFO] Downloaded: https://gazelle.ihe.net/nexus/content/groups/public/net/ihe/gazelle/model/gazelle-model-common/3.3.125-SNAPSHOT/maven-metadata.xml (1011 B at 1.1 KB/sec)
[INFO] Downloading: https://gazelle.ihe.net/nexus/content/groups/public/net/ihe/gazelle/model/gazelle-model-tf/3.3.125-SNAPSHOT/maven-metadata.xml
[INFO] Downloaded: https://gazelle.ihe.net/nexus/content/groups/public/net/ihe/gazelle/model/gazelle-model-tf/3.3.125-SNAPSHOT/maven-metadata.xml (1007 B at 1.3 KB/sec)
[INFO] Downloading: https://gazelle.ihe.net/nexus/content/groups/public/net/ihe/gazelle/model/gazelle-model-users/3.3.125-SNAPSHOT/maven-metadata.xml
[INFO] Downloaded: https://gazelle.ihe.net/nexus/content/groups/public/net/ihe/gazelle/model/gazelle-model-users/3.3.125-SNAPSHOT/maven-metadata.xml (1010 B at 1.4 KB/sec)
[INFO] Downloading: https://gazelle.ihe.net/nexus/content/groups/public/net/ihe/gazelle/model/gazelle-model-tm/3.3.125-SNAPSHOT/maven-metadata.xml
[INFO] Downloaded: https://gazelle.ihe.net/nexus/content/groups/public/net/ihe/gazelle/model/gazelle-model-tm/3.3.125-SNAPSHOT/maven-metadata.xml (1007 B at 1.4 KB/sec)
[INFO] Downloading: https://gazelle.ihe.net/nexus/content/groups/public/net/ihe/gazelle/tm/gazelle-tm-tools/3.5.101-SNAPSHOT/maven-metadata.xml
[INFO] Downloaded: https://gazelle.ihe.net/nexus/content/groups/public/net/ihe/gazelle/tm/gazelle-tm-tools/3.5.101-SNAPSHOT/maven-metadata.xml (2 KB at 1.8 KB/sec)
[INFO] 
[INFO] --- maven-clean-plugin:2.4.1:clean (default-clean) @ gazelle-tm-ejb ---
[INFO] Deleting /home/jenkins/.hudson/jobs/gazelle-public-SNAPSHOT/workspace/gazelle-tm-ejb/target
[INFO] 
[INFO] --- maven-buildmetadata-plugin:1.1.0.IHE.3:provide-buildmetadata (default) @ gazelle-tm-ejb ---
[INFO] Writing properties '/home/jenkins/.hudson/jobs/gazelle-public-SNAPSHOT/workspace/gazelle-tm-ejb/target/classes/META-INF/build.properties'...
[INFO] Writing XML report '/home/jenkins/.hudson/jobs/gazelle-public-SNAPSHOT/workspace/gazelle-tm-ejb/target/buildmetadata.xml'...
[INFO] 
[INFO] --- maven-resources-plugin:2.5:resources (default-resources) @ gazelle-tm-ejb ---
[debug] execute contextualize
[INFO] Using 'UTF-8' encoding to copy filtered resources.
[INFO] Copying 13 resources
[INFO] 
[INFO] --- maven-compiler-plugin:2.3.2:compile (default-compile) @ gazelle-tm-ejb ---
[INFO] Compiling 366 source files to /home/jenkins/.hudson/jobs/gazelle-public-SNAPSHOT/workspace/gazelle-tm-ejb/target/classes
net.ihe.gazelle.common.interfacegenerator.InterfaceGeneratorProcessor processor
Generating interfaces thanks to @GenerateInterface
Generated net.ihe.gazelle.tm.gazelletest.action.MetaTestAdministrationManagerLocal
Generated net.ihe.gazelle.tm.gazelletest.action.MonitorInSessionAdministrationManagerLocal
Generated net.ihe.gazelle.tm.gazelletest.action.TMCheckListManagerLocal
Generated net.ihe.gazelle.tf.ws.Hl7MessageProfileRemote
Generated net.ihe.gazelle.tm.users.action.UserManagerExtraLocal
Generated net.ihe.gazelle.tm.patient.action.PatientSharingManagerLocal
Generated net.ihe.gazelle.tm.systems.action.SystemSelectorLocal
Generated net.ihe.gazelle.tm.configurations.action.OidsAndIPParamForSessionManagerLocal
Generated net.ihe.gazelle.objects.action.AnnotationManagerLocal
Generated net.ihe.gazelle.IO.TestIOManagerLocal
Generated net.ihe.gazelle.tm.tee.status.TestStepsInstanceExecutionStatusManagerLocal
Generated net.ihe.gazelle.tf.action.TFConsistencyCheckManagerLocal
Generated net.ihe.gazelle.tm.gazelletest.action.ConnecthatonTestingManagerLocal
Generated net.ihe.gazelle.users.action.SessionTimeoutManagerLocal
Generated net.ihe.gazelle.pr.action.PRStatusManagerLocal
Generated net.ihe.gazelle.users.action.EmailManagerLocal
Generated net.ihe.gazelle.tf.action.IntegrationProfileManagerLocal
Generated net.ihe.gazelle.tm.gazelletest.action.PathManagerLocal
Generated net.ihe.gazelle.tm.gazelletest.test.TestDefinitionManagerLocal
Generated net.ihe.gazelle.tf.action.TransactionManagerLocal
Generated net.ihe.gazelle.tm.users.action.InstitutionManagerTMLocal
Generated net.ihe.gazelle.tf.action.AipoManagerLocal
Generated net.ihe.gazelle.tf.action.Hl7MessageProfileManagerLocal
Generated net.ihe.gazelle.objects.admin.ObjectTypeManagerLocal
Generated net.ihe.gazelle.objects.action.ObjectManagerLocal
Generated net.ihe.gazelle.tm.systems.action.TabManagerLocal
Generated net.ihe.gazelle.tm.gazelletest.action.TestInstanceUploadManagerLocal
Generated net.ihe.gazelle.tm.configurations.action.SystemConfigurationManagerLocal
Generated net.ihe.gazelle.tm.systems.action.SystemDemonstrationManagerLocal
Generated net.ihe.gazelle.tm.tf.action.TFExtraManagerLocal
Generated net.ihe.gazelle.users.action.AddressManagerLocal
Generated net.ihe.gazelle.tm.tee.execution.TEEManagerLocal
Generated net.ihe.gazelle.tf.action.ActorSelectorLocal
Generated net.ihe.gazelle.tf.action.WSTransactionUsageManagerLocal
Generated net.ihe.gazelle.tm.systems.action.TabManagerForSystemRegistrationLocal
Generated net.ihe.gazelle.tm.systems.action.TestingSessionManagerLocal
Generated net.ihe.gazelle.tf.action.TransactionLinkManagerLocal
Generated net.ihe.gazelle.users.action.PersonManagerLocal
Generated net.ihe.gazelle.tf.action.IntegrationProfileOptionManagerLocal
Generated net.ihe.gazelle.tf.action.ProfileProfileOptionSelectorLocal
Generated net.ihe.gazelle.tm.financial.action.FinancialManagerLocal
Generated net.ihe.gazelle.tm.configurations.action.ConfigurationTypeMappingWithAIPOManagerLocal
Generated net.ihe.gazelle.tm.users.action.ConnectathonParticipantManagerLocal
Generated net.ihe.gazelle.tm.gazelletest.test.EditTestDefinitionLocal
Generated net.ihe.gazelle.tm.tee.status.TestInstanceExecutionStatusManagerLocal
Generated net.ihe.gazelle.tf.action.DomainManagerLocal
Generated net.ihe.gazelle.tm.gazelletest.action.CookiesPresetLocal
Generated net.ihe.gazelle.tm.gazelletest.action.TestSequenceManagerLocal
Generated net.ihe.gazelle.tm.gazelletest.action.MesaTestManagerLocal
Generated net.ihe.gazelle.tm.application.action.ApplicationManagerLocal
Generated net.ihe.gazelle.tm.systems.action.IHEImplementationForSystemManagerLocal
Generated net.ihe.gazelle.tm.gazelletest.test.EditTestStepsManagerLocal
Generated net.ihe.gazelle.objects.action.ObjectInstanceManagerLocal
Generated net.ihe.gazelle.tm.systems.action.SystemManagerLocal
Generated net.ihe.gazelle.tm.users.action.UserPreferencesManagerLocal
Generated net.ihe.gazelle.tm.gazelletest.action.RoleInTestManagerLocal
Generated net.ihe.gazelle.tm.configurations.action.ViewConfigurationManagerLocal
Generated net.ihe.gazelle.tf.action.ProfileLinksManagerLocal
Generated net.ihe.gazelle.menu.GazelleOldSecurityLocal
Generated net.ihe.gazelle.tf.action.ActorManagerLocal
Generated net.ihe.gazelle.tm.skin.SkinLocal
Generated net.ihe.gazelle.tm.financial.action.InvoiceManagerLocal
Generated net.ihe.gazelle.users.action.UserManagerLocal
Generated net.ihe.gazelle.tf.action.ActorIntegrationProfileManagerLocal
Generated net.ihe.gazelle.users.action.InstitutionManagerLocal
Generated net.ihe.gazelle.pr.action.PRCrawlerManagerLocal
Generated net.ihe.gazelle.tm.gazelletest.test.AssertionsManagerLocal
Generated net.ihe.gazelle.tm.systems.action.SystemInSessionSelectorLocal
Generated net.ihe.gazelle.tm.systems.action.TestingTypeManagerLocal
Generated net.ihe.gazelle.tm.configurations.action.GenerateSystemConfigurationLocal
Generated net.ihe.gazelle.form.ValidateLocal
Generated net.ihe.gazelle.tm.gazelletest.action.ContextualInformationManagerLocal
Generated net.ihe.gazelle.tm.gazelletest.action.TestsRequirementsManagerLocal
Generated net.ihe.gazelle.tm.configurations.action.NetworkConfigurationManagerLocal
Generated net.ihe.gazelle.tm.systems.action.SystemInSessionManagerLocal
Generated net.ihe.gazelle.tm.configurations.action.OIDManagerLocal
Generated net.ihe.gazelle.IO.TestImporterJobLocal
Generated net.ihe.gazelle.tm.configurations.action.ActorDefaultPortsManagerLocal
Generated net.ihe.gazelle.tm.systems.action.SimulatorInSessionManagerLocal
[INFO] -------------------------------------------------------------
[ERROR] COMPILATION ERROR : 
[INFO] -------------------------------------------------------------
[ERROR] /home/jenkins/.hudson/jobs/gazelle-public-SNAPSHOT/workspace/gazelle-tm-ejb/src/main/java/net/ihe/gazelle/tm/financial/action/FinancialCalc.java:[50,35] error: cannot find symbol
[ERROR]  variable ts of type TestingSession
/home/jenkins/.hudson/jobs/gazelle-public-SNAPSHOT/workspace/gazelle-tm-ejb/src/main/java/net/ihe/gazelle/tm/financial/action/FinancialCalc.java:[52,95] error: cannot find symbol
[ERROR]  variable ts of type TestingSession
/home/jenkins/.hudson/jobs/gazelle-public-SNAPSHOT/workspace/gazelle-tm-ejb/src/main/java/net/ihe/gazelle/tm/financial/action/FinancialManager.java:[340,64] error: cannot find symbol
[INFO] 3 errors 
[INFO] -------------------------------------------------------------
[BFA] Scanning build for known causes...
[BFA] No failure causes found
[BFA] Done. 0s
Started calculate disk usage of build
Finished Calculation of disk usage of build in 0 seconds
Started calculate disk usage of workspace
Finished Calculation of disk usage of workspace in 0 seconds
[INFO] ------------------------------------------------------------------------
[INFO] Reactor Summary:
[INFO] 
[INFO] Gazelle Test Management Platform ................... SUCCESS [  7.759 s]
[INFO] gazelle-tm-ws-data ................................. SUCCESS [  7.801 s]
[INFO] gazelle-tm-ejb ..................................... FAILURE [ 10.259 s]
[INFO] gazelle-tm-war ..................................... SKIPPED
[INFO] gazelle-tm-ear ..................................... SKIPPED
[INFO] gazelle-tm-ws-client ............................... SKIPPED
[INFO] ------------------------------------------------------------------------
[INFO] BUILD FAILURE
[INFO] ------------------------------------------------------------------------
[INFO] Total time: 27.687 s
[INFO] Finished at: 2017-04-09T04:04:32+02:00
[INFO] Final Memory: 62M/428M
[INFO] ------------------------------------------------------------------------
Waiting for Jenkins to finish collecting data
[ERROR] Failed to execute goal org.apache.maven.plugins:maven-compiler-plugin:2.3.2:compile (default-compile) on project gazelle-tm-ejb: Compilation failure: Compilation failure:
[ERROR] /home/jenkins/.hudson/jobs/gazelle-public-SNAPSHOT/workspace/gazelle-tm-ejb/src/main/java/net/ihe/gazelle/tm/financial/action/FinancialCalc.java:[50,35] error: cannot find symbol
[ERROR] variable ts of type TestingSession
[ERROR] /home/jenkins/.hudson/jobs/gazelle-public-SNAPSHOT/workspace/gazelle-tm-ejb/src/main/java/net/ihe/gazelle/tm/financial/action/FinancialCalc.java:[52,95] error: cannot find symbol
[ERROR] variable ts of type TestingSession
[ERROR] /home/jenkins/.hudson/jobs/gazelle-public-SNAPSHOT/workspace/gazelle-tm-ejb/src/main/java/net/ihe/gazelle/tm/financial/action/FinancialManager.java:[340,64] error: cannot find symbol
[ERROR] -> [Help 1]
[ERROR] 
[ERROR] To see the full stack trace of the errors, re-run Maven with the -e switch.
[ERROR] Re-run Maven using the -X switch to enable full debug logging.
[ERROR] 
[ERROR] For more information about the errors and possible solutions, please read the following articles:
[ERROR] [Help 1] http://cwiki.apache.org/confluence/display/MAVEN/MojoFailureException
[ERROR] 
[ERROR] After correcting the problems, you can resume the build with the command
[ERROR]   mvn <goals> -rf :gazelle-tm-ejb
[JENKINS] Archiving /home/jenkins/.hudson/jobs/gazelle-public-SNAPSHOT/workspace/gazelle-tm-ws-data/pom.xml to net.ihe.gazelle.tm/gazelle-tm-ws-data/4.12.0-SNAPSHOT/gazelle-tm-ws-data-4.12.0-SNAPSHOT.pom
[JENKINS] Archiving /home/jenkins/.hudson/jobs/gazelle-public-SNAPSHOT/workspace/gazelle-tm-ws-data/target/gazelle-tm-ws-data-4.12.0-SNAPSHOT.jar to net.ihe.gazelle.tm/gazelle-tm-ws-data/4.12.0-20170409.020416-1147/gazelle-tm-ws-data-4.12.0-20170409.020416-1147.jar
[JENKINS] Archiving /home/jenkins/.hudson/jobs/gazelle-public-SNAPSHOT/workspace/gazelle-tm-ws-data/target/gazelle-tm-ws-data-4.12.0-SNAPSHOT-tests.jar to net.ihe.gazelle.tm/gazelle-tm-ws-data/4.12.0-20170409.020416-1147/gazelle-tm-ws-data-4.12.0-20170409.020416-1147-tests.jar
[JENKINS] Archiving /home/jenkins/.hudson/jobs/gazelle-public-SNAPSHOT/workspace/gazelle-tm-ear/pom.xml to net.ihe.gazelle.tm/gazelle-tm-ear/4.12.0-SNAPSHOT/gazelle-tm-ear-4.12.0-SNAPSHOT.pom
[JENKINS] Archiving /home/jenkins/.hudson/jobs/gazelle-public-SNAPSHOT/workspace/pom.xml to net.ihe.gazelle.tm/gazelle-tm/4.12.0-SNAPSHOT/gazelle-tm-4.12.0-SNAPSHOT.pom
[JENKINS] Archiving /home/jenkins/.hudson/jobs/gazelle-public-SNAPSHOT/workspace/target/gazelle-tm-4.12.0-SNAPSHOT-metadata.zip to net.ihe.gazelle.tm/gazelle-tm/4.12.0-20170409.020408-725/gazelle-tm-4.12.0-20170409.020408-725-metadata.zip
[JENKINS] Archiving /home/jenkins/.hudson/jobs/gazelle-public-SNAPSHOT/workspace/gazelle-tm-ejb/pom.xml to net.ihe.gazelle.tm/gazelle-tm-ejb/4.12.0-SNAPSHOT/gazelle-tm-ejb-4.12.0-SNAPSHOT.pom
[JENKINS] Archiving /home/jenkins/.hudson/jobs/gazelle-public-SNAPSHOT/workspace/gazelle-tm-war/pom.xml to net.ihe.gazelle.tm/gazelle-tm-war/4.12.0-SNAPSHOT/gazelle-tm-war-4.12.0-SNAPSHOT.pom
[JENKINS] Archiving /home/jenkins/.hudson/jobs/gazelle-public-SNAPSHOT/workspace/gazelle-tm-ws-client/pom.xml to net.ihe.gazelle.tm/gazelle-tm-ws-client/4.12.0-SNAPSHOT/gazelle-tm-ws-client-4.12.0-SNAPSHOT.pom
Sending e-mails to: abderrazek.boufahja@ihe-europe.net anne-gaelle.berge@ihe-europe.net eric.poiseau@inria.fr guillaume.thomazon@ihe-europe.net
channel stopped
[BFA] Scanning build for known causes...
[BFA] No failure causes found
[BFA] Done. 0s
Started calculate disk usage of build
Finished Calculation of disk usage of build in 0 seconds
Started calculate disk usage of workspace
Finished Calculation of disk usage of workspace in 0 seconds
Sending e-mails to: abderrazek.boufahja@ihe-europe.net anne-gaelle.berge@ihe-europe.net eric.poiseau@inria.fr guillaume.thomazon@ihe-europe.net
Warning: you have no plugins providing access control for builds, so falling back to legacy behavior of permitting any downstream builds to be triggered
Finished: FAILURE