FailedConsole Output

Started by timer
[EnvInject] - Loading node environment variables.
Building on master in workspace /home/jenkins/.hudson/jobs/gazelle-public-SNAPSHOT/workspace
Reverting /home/jenkins/.hudson/jobs/gazelle-public-SNAPSHOT/workspace/. to depth infinity with ignoreExternals: false
Updating svn+ssh://scm.gforge.inria.fr/svn/gazelle/Maven/gazelle-tm/trunk at revision '2017-04-10T04:04:00.368 +0200'
At revision 56669

No changes for svn+ssh://scm.gforge.inria.fr/svn/gazelle/Maven/gazelle-tm/trunk since the previous build
Parsing POMs
Failed to transfer Could not transfer metadata net.ihe.gazelle.model:gazelle-model:3.3.125-SNAPSHOT/maven-metadata.xml from/to nexus (https://gazelle.ihe.net/nexus/content/groups/public): Connection reset
Established TCP socket on 36690
[workspace] $ /usr/lib/jvm/java-8-oracle//bin/java -Djava.net.preferIPv4Stack=true -Dfile.encoding=UTF8 -Xmx512m -XX:MaxPermSize=128m -cp /home/jenkins/.hudson/plugins/maven-plugin/WEB-INF/lib/maven33-agent-1.8.1.jar:/home/jenkins/.hudson/tools/hudson.tasks.Maven_MavenInstallation/Maven3/boot/plexus-classworlds-2.5.2.jar:/home/jenkins/.hudson/tools/hudson.tasks.Maven_MavenInstallation/Maven3/conf/logging jenkins.maven3.agent.Maven33Main /home/jenkins/.hudson/tools/hudson.tasks.Maven_MavenInstallation/Maven3 /home/jenkins/.hudson/war/WEB-INF/lib/remoting-3.7.jar /home/jenkins/.hudson/plugins/maven-plugin/WEB-INF/lib/maven33-interceptor-1.8.1.jar /home/jenkins/.hudson/plugins/maven-plugin/WEB-INF/lib/maven3-interceptor-commons-1.8.1.jar 36690
Java HotSpot(TM) 64-Bit Server VM warning: ignoring option MaxPermSize=128m; support was removed in 8.0
<===[JENKINS REMOTING CAPACITY]===>channel started
Executing Maven:  -B -f /home/jenkins/.hudson/jobs/gazelle-public-SNAPSHOT/workspace/pom.xml -Ppublic,distribution clean deploy
[INFO] Scanning for projects...
[WARNING] 
[WARNING] Some problems were encountered while building the effective model for net.ihe.gazelle.tm:gazelle-tm-war:war:4.12.0-SNAPSHOT
[WARNING] The expression ${artifactId} is deprecated. Please use ${project.artifactId} instead.
[WARNING] The expression ${version} is deprecated. Please use ${project.version} instead.
[WARNING] 
[WARNING] It is highly recommended to fix these problems because they threaten the stability of your build.
[WARNING] 
[WARNING] For this reason, future Maven versions might no longer support building such malformed projects.
[WARNING] 
[INFO] ------------------------------------------------------------------------
[INFO] Reactor Build Order:
[INFO] 
[INFO] Gazelle Test Management Platform
[INFO] gazelle-tm-ws-data
[INFO] gazelle-tm-ejb
[INFO] gazelle-tm-war
[INFO] gazelle-tm-ear
[INFO] gazelle-tm-ws-client
[INFO]                                                                         
[INFO] ------------------------------------------------------------------------
[INFO] Building Gazelle Test Management Platform 4.12.0-SNAPSHOT
[INFO] ------------------------------------------------------------------------
[INFO] 
[INFO] --- maven-clean-plugin:2.4.1:clean (default-clean) @ gazelle-tm ---
[INFO] Deleting /home/jenkins/.hudson/jobs/gazelle-public-SNAPSHOT/workspace/target
[INFO] 
[INFO] --- maven-buildmetadata-plugin:1.1.0.IHE.3:provide-buildmetadata (default) @ gazelle-tm ---
[INFO] Writing properties '/home/jenkins/.hudson/jobs/gazelle-public-SNAPSHOT/workspace/target/build.properties'...
[INFO] Writing XML report '/home/jenkins/.hudson/jobs/gazelle-public-SNAPSHOT/workspace/target/buildmetadata.xml'...
[INFO] 
[INFO] --- maven-assembly-plugin:2.2.1:single (make-assembly-metadata) @ gazelle-tm ---
[INFO] Building zip: /home/jenkins/.hudson/jobs/gazelle-public-SNAPSHOT/workspace/target/gazelle-tm-4.12.0-SNAPSHOT-metadata.zip
[INFO] 
[INFO] --- maven-install-plugin:2.1:install (default-install) @ gazelle-tm ---
[INFO] Installing /home/jenkins/.hudson/jobs/gazelle-public-SNAPSHOT/workspace/pom.xml to /home/jenkins/.m2/repository/net/ihe/gazelle/tm/gazelle-tm/4.12.0-SNAPSHOT/gazelle-tm-4.12.0-SNAPSHOT.pom
[INFO] Installing /home/jenkins/.hudson/jobs/gazelle-public-SNAPSHOT/workspace/target/gazelle-tm-4.12.0-SNAPSHOT-metadata.zip to /home/jenkins/.m2/repository/net/ihe/gazelle/tm/gazelle-tm/4.12.0-SNAPSHOT/gazelle-tm-4.12.0-SNAPSHOT-metadata.zip
[INFO] 
[INFO] --- maven-deploy-plugin:2.7:deploy (default-deploy) @ gazelle-tm ---
[INFO] Downloading: https://gazelle.ihe.net/nexus/content/repositories/snapshots/net/ihe/gazelle/tm/gazelle-tm/4.12.0-SNAPSHOT/maven-metadata.xml
[WARNING] Could not transfer metadata net.ihe.gazelle.tm:gazelle-tm:4.12.0-SNAPSHOT/maven-metadata.xml from/to sumo (https://gazelle.ihe.net/nexus/content/repositories/snapshots/): Connection reset
[BFA] Scanning build for known causes...
[BFA] No failure causes found
[BFA] Done. 0s
Started calculate disk usage of build
Finished Calculation of disk usage of build in 0 seconds
Started calculate disk usage of workspace
Finished Calculation of disk usage of workspace in 0 seconds
[INFO] ------------------------------------------------------------------------
[INFO] Reactor Summary:
[INFO] 
[INFO] Gazelle Test Management Platform ................... FAILURE [07:00 min]
[INFO] gazelle-tm-ws-data ................................. SKIPPED
[INFO] gazelle-tm-ejb ..................................... SKIPPED
[INFO] gazelle-tm-war ..................................... SKIPPED
[INFO] gazelle-tm-ear ..................................... SKIPPED
[INFO] gazelle-tm-ws-client ............................... SKIPPED
[INFO] ------------------------------------------------------------------------
[INFO] BUILD FAILURE
[INFO] ------------------------------------------------------------------------
[INFO] Total time: 07:01 min
[INFO] Finished at: 2017-04-10T04:18:04+02:00
[INFO] Final Memory: 32M/365M
[INFO] ------------------------------------------------------------------------
[ERROR] Failed to execute goal org.apache.maven.plugins:maven-deploy-plugin:2.7:deploy (default-deploy) on project gazelle-tm: Failed to retrieve remote metadata net.ihe.gazelle.tm:gazelle-tm:4.12.0-SNAPSHOT/maven-metadata.xml: Could not transfer metadata net.ihe.gazelle.tm:gazelle-tm:4.12.0-SNAPSHOT/maven-metadata.xml from/to sumo (https://gazelle.ihe.net/nexus/content/repositories/snapshots/): Connection reset -> [Help 1]
[ERROR] 
[ERROR] To see the full stack trace of the errors, re-run Maven with the -e switch.
[ERROR] Re-run Maven using the -X switch to enable full debug logging.
[ERROR] 
[JENKINS] Archiving /home/jenkins/.hudson/jobs/gazelle-public-SNAPSHOT/workspace/gazelle-tm-ws-data/pom.xml to net.ihe.gazelle.tm/gazelle-tm-ws-data/4.12.0-SNAPSHOT/gazelle-tm-ws-data-4.12.0-SNAPSHOT.pom
[ERROR] For more information about the errors and possible solutions, please read the following articles:
[ERROR] [Help 1] http://cwiki.apache.org/confluence/display/MAVEN/MojoExecutionException
[JENKINS] Archiving /home/jenkins/.hudson/jobs/gazelle-public-SNAPSHOT/workspace/gazelle-tm-ear/pom.xml to net.ihe.gazelle.tm/gazelle-tm-ear/4.12.0-SNAPSHOT/gazelle-tm-ear-4.12.0-SNAPSHOT.pom
[JENKINS] Archiving /home/jenkins/.hudson/jobs/gazelle-public-SNAPSHOT/workspace/pom.xml to net.ihe.gazelle.tm/gazelle-tm/4.12.0-SNAPSHOT/gazelle-tm-4.12.0-SNAPSHOT.pom
[JENKINS] Archiving /home/jenkins/.hudson/jobs/gazelle-public-SNAPSHOT/workspace/target/gazelle-tm-4.12.0-SNAPSHOT-metadata.zip to net.ihe.gazelle.tm/gazelle-tm/4.12.0-SNAPSHOT/gazelle-tm-4.12.0-SNAPSHOT-metadata.zip
[JENKINS] Archiving /home/jenkins/.hudson/jobs/gazelle-public-SNAPSHOT/workspace/gazelle-tm-ejb/pom.xml to net.ihe.gazelle.tm/gazelle-tm-ejb/4.12.0-SNAPSHOT/gazelle-tm-ejb-4.12.0-SNAPSHOT.pom
[JENKINS] Archiving /home/jenkins/.hudson/jobs/gazelle-public-SNAPSHOT/workspace/gazelle-tm-war/pom.xml to net.ihe.gazelle.tm/gazelle-tm-war/4.12.0-SNAPSHOT/gazelle-tm-war-4.12.0-SNAPSHOT.pom
[JENKINS] Archiving /home/jenkins/.hudson/jobs/gazelle-public-SNAPSHOT/workspace/gazelle-tm-ws-client/pom.xml to net.ihe.gazelle.tm/gazelle-tm-ws-client/4.12.0-SNAPSHOT/gazelle-tm-ws-client-4.12.0-SNAPSHOT.pom
Sending e-mails to: abderrazek.boufahja@ihe-europe.net anne-gaelle.berge@ihe-europe.net eric.poiseau@inria.fr guillaume.thomazon@ihe-europe.net
channel stopped
[BFA] Scanning build for known causes...
[BFA] No failure causes found
[BFA] Done. 0s
Started calculate disk usage of build
Finished Calculation of disk usage of build in 0 seconds
Started calculate disk usage of workspace
Finished Calculation of disk usage of workspace in 0 seconds
Sending e-mails to: abderrazek.boufahja@ihe-europe.net anne-gaelle.berge@ihe-europe.net eric.poiseau@inria.fr guillaume.thomazon@ihe-europe.net
Warning: you have no plugins providing access control for builds, so falling back to legacy behavior of permitting any downstream builds to be triggered
Finished: FAILURE