SuccessConsole Output

Started calculate disk usage of build
Finished Calculation of disk usage of build in 0 seconds
Started calculate disk usage of workspace
Finished Calculation of disk usage of workspace in 0 seconds
[INFO]                                                                         
[INFO] ------------------------------------------------------------------------
[INFO] Building gazelle-tm-ws-data 4.12.0-SNAPSHOT
[INFO] ------------------------------------------------------------------------
[INFO] 
[INFO] --- maven-clean-plugin:2.4.1:clean (default-clean) @ gazelle-tm-ws-data ---
[INFO] Deleting /home/jenkins/.hudson/jobs/gazelle-public-SNAPSHOT/workspace/gazelle-tm-ws-data/target
[INFO] 
[INFO] --- maven-buildmetadata-plugin:1.1.0.IHE.3:provide-buildmetadata (default) @ gazelle-tm-ws-data ---
[INFO] Writing properties '/home/jenkins/.hudson/jobs/gazelle-public-SNAPSHOT/workspace/gazelle-tm-ws-data/target/classes/META-INF/build.properties'...
[INFO] Writing XML report '/home/jenkins/.hudson/jobs/gazelle-public-SNAPSHOT/workspace/gazelle-tm-ws-data/target/buildmetadata.xml'...
[INFO] 
[INFO] --- maven-resources-plugin:2.5:resources (default-resources) @ gazelle-tm-ws-data ---
[debug] execute contextualize
[INFO] Using 'UTF-8' encoding to copy filtered resources.
[INFO] skip non existing resourceDirectory /home/jenkins/.hudson/jobs/gazelle-public-SNAPSHOT/workspace/gazelle-tm-ws-data/src/main/resources
[INFO] 
[INFO] --- maven-compiler-plugin:2.3.2:compile (default-compile) @ gazelle-tm-ws-data ---
[INFO] Compiling 33 source files to /home/jenkins/.hudson/jobs/gazelle-public-SNAPSHOT/workspace/gazelle-tm-ws-data/target/classes
[INFO] 
[INFO] --- maven-resources-plugin:2.5:testResources (default-testResources) @ gazelle-tm-ws-data ---
[debug] execute contextualize
[INFO] Using 'UTF-8' encoding to copy filtered resources.
[INFO] skip non existing resourceDirectory /home/jenkins/.hudson/jobs/gazelle-public-SNAPSHOT/workspace/gazelle-tm-ws-data/src/test/resources
[INFO] 
[INFO] --- maven-compiler-plugin:2.3.2:testCompile (default-testCompile) @ gazelle-tm-ws-data ---
[INFO] Compiling 2 source files to /home/jenkins/.hudson/jobs/gazelle-public-SNAPSHOT/workspace/gazelle-tm-ws-data/target/test-classes
[INFO] 
[INFO] --- maven-surefire-plugin:2.13:test (default-test) @ gazelle-tm-ws-data ---
[INFO] Tests are skipped.
[INFO] 
[INFO] --- maven-jar-plugin:2.3:jar (default-jar) @ gazelle-tm-ws-data ---
[INFO] Building jar: /home/jenkins/.hudson/jobs/gazelle-public-SNAPSHOT/workspace/gazelle-tm-ws-data/target/gazelle-tm-ws-data-4.12.0-SNAPSHOT.jar
[INFO] 
[INFO] --- maven-jar-plugin:2.3:test-jar (default) @ gazelle-tm-ws-data ---
[INFO] Building jar: /home/jenkins/.hudson/jobs/gazelle-public-SNAPSHOT/workspace/gazelle-tm-ws-data/target/gazelle-tm-ws-data-4.12.0-SNAPSHOT-tests.jar
[INFO] 
[INFO] --- maven-install-plugin:2.1:install (default-install) @ gazelle-tm-ws-data ---
[INFO] Installing /home/jenkins/.hudson/jobs/gazelle-public-SNAPSHOT/workspace/gazelle-tm-ws-data/target/gazelle-tm-ws-data-4.12.0-SNAPSHOT.jar to /home/jenkins/.m2/repository/net/ihe/gazelle/tm/gazelle-tm-ws-data/4.12.0-SNAPSHOT/gazelle-tm-ws-data-4.12.0-SNAPSHOT.jar
[INFO] Installing /home/jenkins/.hudson/jobs/gazelle-public-SNAPSHOT/workspace/gazelle-tm-ws-data/pom.xml to /home/jenkins/.m2/repository/net/ihe/gazelle/tm/gazelle-tm-ws-data/4.12.0-SNAPSHOT/gazelle-tm-ws-data-4.12.0-SNAPSHOT.pom
[INFO] Installing /home/jenkins/.hudson/jobs/gazelle-public-SNAPSHOT/workspace/gazelle-tm-ws-data/target/gazelle-tm-ws-data-4.12.0-SNAPSHOT-tests.jar to /home/jenkins/.m2/repository/net/ihe/gazelle/tm/gazelle-tm-ws-data/4.12.0-SNAPSHOT/gazelle-tm-ws-data-4.12.0-SNAPSHOT-tests.jar
[INFO] 
[INFO] --- maven-deploy-plugin:2.7:deploy (default-deploy) @ gazelle-tm-ws-data ---
[INFO] Downloading: https://gazelle.ihe.net/nexus/content/repositories/snapshots/net/ihe/gazelle/tm/gazelle-tm-ws-data/4.12.0-SNAPSHOT/maven-metadata.xml
[INFO] Downloaded: https://gazelle.ihe.net/nexus/content/repositories/snapshots/net/ihe/gazelle/tm/gazelle-tm-ws-data/4.12.0-SNAPSHOT/maven-metadata.xml (1014 B at 2.3 KB/sec)
[INFO] Uploading: https://gazelle.ihe.net/nexus/content/repositories/snapshots/net/ihe/gazelle/tm/gazelle-tm-ws-data/4.12.0-SNAPSHOT/gazelle-tm-ws-data-4.12.0-20170405.020416-1139.jar
[INFO] Uploaded: https://gazelle.ihe.net/nexus/content/repositories/snapshots/net/ihe/gazelle/tm/gazelle-tm-ws-data/4.12.0-SNAPSHOT/gazelle-tm-ws-data-4.12.0-20170405.020416-1139.jar (37 KB at 42.4 KB/sec)
[INFO] Uploading: https://gazelle.ihe.net/nexus/content/repositories/snapshots/net/ihe/gazelle/tm/gazelle-tm-ws-data/4.12.0-SNAPSHOT/gazelle-tm-ws-data-4.12.0-20170405.020416-1139.pom
[INFO] Uploaded: https://gazelle.ihe.net/nexus/content/repositories/snapshots/net/ihe/gazelle/tm/gazelle-tm-ws-data/4.12.0-SNAPSHOT/gazelle-tm-ws-data-4.12.0-20170405.020416-1139.pom (718 B at 0.9 KB/sec)
[INFO] Downloading: https://gazelle.ihe.net/nexus/content/repositories/snapshots/net/ihe/gazelle/tm/gazelle-tm-ws-data/maven-metadata.xml
[INFO] Downloaded: https://gazelle.ihe.net/nexus/content/repositories/snapshots/net/ihe/gazelle/tm/gazelle-tm-ws-data/maven-metadata.xml (2 KB at 3.6 KB/sec)
[INFO] Uploading: https://gazelle.ihe.net/nexus/content/repositories/snapshots/net/ihe/gazelle/tm/gazelle-tm-ws-data/4.12.0-SNAPSHOT/maven-metadata.xml
[INFO] Uploaded: https://gazelle.ihe.net/nexus/content/repositories/snapshots/net/ihe/gazelle/tm/gazelle-tm-ws-data/4.12.0-SNAPSHOT/maven-metadata.xml (1014 B at 1.2 KB/sec)
[INFO] Uploading: https://gazelle.ihe.net/nexus/content/repositories/snapshots/net/ihe/gazelle/tm/gazelle-tm-ws-data/maven-metadata.xml
[INFO] Uploaded: https://gazelle.ihe.net/nexus/content/repositories/snapshots/net/ihe/gazelle/tm/gazelle-tm-ws-data/maven-metadata.xml (2 KB at 1.3 KB/sec)
[INFO] Uploading: https://gazelle.ihe.net/nexus/content/repositories/snapshots/net/ihe/gazelle/tm/gazelle-tm-ws-data/4.12.0-SNAPSHOT/gazelle-tm-ws-data-4.12.0-20170405.020416-1139-tests.jar
[INFO] Uploaded: https://gazelle.ihe.net/nexus/content/repositories/snapshots/net/ihe/gazelle/tm/gazelle-tm-ws-data/4.12.0-SNAPSHOT/gazelle-tm-ws-data-4.12.0-20170405.020416-1139-tests.jar (5 KB at 4.6 KB/sec)
[INFO] Uploading: https://gazelle.ihe.net/nexus/content/repositories/snapshots/net/ihe/gazelle/tm/gazelle-tm-ws-data/4.12.0-SNAPSHOT/maven-metadata.xml
[INFO] Uploaded: https://gazelle.ihe.net/nexus/content/repositories/snapshots/net/ihe/gazelle/tm/gazelle-tm-ws-data/4.12.0-SNAPSHOT/maven-metadata.xml (1014 B at 1.1 KB/sec)
[BFA] Scanning build for known causes...
[BFA] No failure causes found
[BFA] Done. 0s
Started calculate disk usage of build
Finished Calculation of disk usage of build in 0 seconds
Started calculate disk usage of workspace
Finished Calculation of disk usage of workspace in 0 seconds
[INFO] ------------------------------------------------------------------------
[INFO] Reactor Summary:
[INFO] 
[INFO] Gazelle Test Management Platform ................... SUCCESS [  7.366 s]
[INFO] gazelle-tm-ws-data ................................. SUCCESS [  7.689 s]
[INFO] gazelle-tm-ejb ..................................... FAILURE [ 10.448 s]
[INFO] gazelle-tm-war ..................................... SKIPPED
[INFO] gazelle-tm-ear ..................................... SKIPPED
[INFO] gazelle-tm-ws-client ............................... SKIPPED
[INFO] ------------------------------------------------------------------------
[INFO] BUILD FAILURE
[INFO] ------------------------------------------------------------------------
[INFO] Total time: 27.432 s
[INFO] Finished at: 2017-04-05T04:04:33+02:00
[INFO] Final Memory: 62M/421M
[INFO] ------------------------------------------------------------------------
[ERROR] Failed to execute goal org.apache.maven.plugins:maven-compiler-plugin:2.3.2:compile (default-compile) on project gazelle-tm-ejb: Compilation failure: Compilation failure:
[ERROR] /home/jenkins/.hudson/jobs/gazelle-public-SNAPSHOT/workspace/gazelle-tm-ejb/src/main/java/net/ihe/gazelle/tm/financial/action/FinancialCalc.java:[50,35] error: cannot find symbol
[ERROR] variable ts of type TestingSession
[ERROR] /home/jenkins/.hudson/jobs/gazelle-public-SNAPSHOT/workspace/gazelle-tm-ejb/src/main/java/net/ihe/gazelle/tm/financial/action/FinancialCalc.java:[52,95] error: cannot find symbol
[ERROR] variable ts of type TestingSession
[ERROR] /home/jenkins/.hudson/jobs/gazelle-public-SNAPSHOT/workspace/gazelle-tm-ejb/src/main/java/net/ihe/gazelle/tm/financial/action/FinancialManager.java:[340,64] error: cannot find symbol
[ERROR] -> [Help 1]
[ERROR] 
[ERROR] To see the full stack trace of the errors, re-run Maven with the -e switch.
[ERROR] Re-run Maven using the -X switch to enable full debug logging.
[ERROR] 
[ERROR] For more information about the errors and possible solutions, please read the following articles:
[ERROR] [Help 1] http://cwiki.apache.org/confluence/display/MAVEN/MojoFailureException
[ERROR] 
[ERROR] After correcting the problems, you can resume the build with the command
[ERROR]   mvn <goals> -rf :gazelle-tm-ejb