FailedConsole Output

Started by user Anne-Gaelle Berge
[EnvInject] - Loading node environment variables.
Building on master in workspace /home/jenkins/.hudson/jobs/gazelle-security-adaptor-jar/workspace
Cleaning local Directory .
Checking out svn+ssh://scm.gforge.inria.fr/svn/gazelle/Maven/gazelle-security-adaptor-jar/trunk at revision '2018-06-22T11:02:53.378 +0200'
Using sole credentials gazelle-jenkins in realm ‘svn+ssh://scm.gforge.inria.fr’
Using sole credentials gazelle-jenkins in realm ‘svn+ssh://scm.gforge.inria.fr’
A         src
A         src/main
A         src/main/java
A         src/main/java/net
A         src/main/java/net/ihe
A         src/main/java/net/ihe/gazelle
A         src/main/java/net/ihe/gazelle/security
A         src/main/java/net/ihe/gazelle/security/utils
AU        src/main/java/net/ihe/gazelle/security/utils/MarshallUtils.java
AU        src/main/java/net/ihe/gazelle/security/utils/UnmarshallUtils.java
A         src/main/java/net/ihe/gazelle/security/builders
AU        src/main/java/net/ihe/gazelle/security/builders/TimestampBuilder.java
AU        src/main/java/net/ihe/gazelle/security/builders/AbstractSignatureBuilder.java
AU        src/main/java/net/ihe/gazelle/security/builders/AssertionBuilder.java
AU        src/main/java/net/ihe/gazelle/security/builders/SignatureType.java
A         src/main/resources
A         src/test
A         src/test/java
AU        pom.xml
 U        .
At revision 63309

No changes for svn+ssh://scm.gforge.inria.fr/svn/gazelle/Maven/gazelle-security-adaptor-jar/trunk since the previous build
Injecting SonarQube environment variables using the configuration: Sonar
Parsing POMs
Established TCP socket on 54012
[workspace] $ /usr/lib/jvm/java-8-oracle//bin/java -Djava.net.preferIPv4Stack=true -Dfile.encoding=UTF8 -Xmx4096m -XX:MaxPermSize=1024m -cp /home/jenkins/.hudson/plugins/maven-plugin/WEB-INF/lib/maven35-agent-1.12-alpha-1.jar:/home/jenkins/.hudson/tools/hudson.tasks.Maven_MavenInstallation/Maven3/boot/plexus-classworlds-2.5.2.jar:/home/jenkins/.hudson/tools/hudson.tasks.Maven_MavenInstallation/Maven3/conf/logging jenkins.maven3.agent.Maven35Main /home/jenkins/.hudson/tools/hudson.tasks.Maven_MavenInstallation/Maven3 /home/jenkins/.hudson/war/WEB-INF/lib/remoting-3.21.jar /home/jenkins/.hudson/plugins/maven-plugin/WEB-INF/lib/maven35-interceptor-1.12-alpha-1.jar /home/jenkins/.hudson/plugins/maven-plugin/WEB-INF/lib/maven3-interceptor-commons-1.12-alpha-1.jar 54012
Java HotSpot(TM) 64-Bit Server VM warning: ignoring option MaxPermSize=1024m; support was removed in 8.0
<===[JENKINS REMOTING CAPACITY]===>channel started
Executing Maven:  -B -f /home/jenkins/.hudson/jobs/gazelle-security-adaptor-jar/workspace/pom.xml -DdevelopmentVersion=1.0.2-SNAPSHOT -DreleaseVersion=1.0.1 -Dresume=false release:prepare release:perform
[INFO] Scanning for projects...
[WARNING] 
[WARNING] Some problems were encountered while building the effective model for net.ihe.gazelle:gazelle-security-adaptor-jar:jar:1.0.1-SNAPSHOT
[WARNING] 'build.plugins.plugin.version' for org.apache.maven.plugins:maven-compiler-plugin is missing. @ line 26, column 21
[WARNING] 
[WARNING] It is highly recommended to fix these problems because they threaten the stability of your build.
[WARNING] 
[WARNING] For this reason, future Maven versions might no longer support building such malformed projects.
[WARNING] 
[INFO] 
[INFO] ------------------------------------------------------------------------
[INFO] Building gazelle-security-adaptor-jar 1.0.1-SNAPSHOT
[INFO] ------------------------------------------------------------------------
[INFO] 
[INFO] --- maven-release-plugin:2.3.2:prepare (default-cli) @ gazelle-security-adaptor-jar ---
[INFO] Verifying that there are no local modifications...
[INFO]   ignoring changes on: **/pom.xml.releaseBackup, **/pom.xml.next, **/pom.xml.tag, **/pom.xml.branch, **/release.properties, **/pom.xml.backup
[INFO] Executing: /bin/sh -c cd /home/jenkins/.hudson/jobs/gazelle-security-adaptor-jar/workspace && svn --non-interactive status
[INFO] Working directory: /home/jenkins/.hudson/jobs/gazelle-security-adaptor-jar/workspace
[INFO] Checking dependencies and plugins for snapshots ...
[WARNING] Attempt to (de-)serialize anonymous class hudson.maven.reporters.MavenArtifactArchiver$2; see: https://jenkins.io/redirect/serialization-of-anonymous-classes/
[WARNING] Attempt to (de-)serialize anonymous class hudson.maven.reporters.MavenFingerprinter$1; see: https://jenkins.io/redirect/serialization-of-anonymous-classes/
[BFA] Scanning build for known causes...
[BFA] No failure causes found
[BFA] Done. 0s
Started calculate disk usage of build
Finished Calculation of disk usage of build in 0 seconds
Started calculate disk usage of workspace
Finished Calculation of disk usage of workspace in 0 seconds
[INFO] ------------------------------------------------------------------------
[INFO] BUILD FAILURE
[INFO] ------------------------------------------------------------------------
[INFO] Total time: 1.567 s
[INFO] Finished at: 2018-06-22T11:02:58+02:00
[INFO] Final Memory: 17M/348M
[INFO] ------------------------------------------------------------------------
[ERROR] Failed to execute goal org.apache.maven.plugins:maven-release-plugin:2.3.2:prepare (default-cli) on project gazelle-security-adaptor-jar: Can't release project due to non released dependencies :
[ERROR] net.ihe.gazelle:gazelle-sts-client:jar:1.1.2-SNAPSHOT:compile
[ERROR] in project 'gazelle-security-adaptor-jar' (net.ihe.gazelle:gazelle-security-adaptor-jar:jar:1.0.1-SNAPSHOT)
[ERROR] -> [Help 1]
[ERROR] 
[ERROR] To see the full stack trace of the errors, re-run Maven with the -e switch.
[ERROR] Re-run Maven using the -X switch to enable full debug logging.
[ERROR] 
[ERROR] For more information about the errors and possible solutions, please read the following articles:
[ERROR] [Help 1] http://cwiki.apache.org/confluence/display/MAVEN/MojoFailureException
[JENKINS] Archiving /home/jenkins/.hudson/jobs/gazelle-security-adaptor-jar/workspace/pom.xml to net.ihe.gazelle/gazelle-security-adaptor-jar/1.0.1-SNAPSHOT/gazelle-security-adaptor-jar-1.0.1-SNAPSHOT.pom
WARN: Unable to locate 'report-task.txt' in the workspace. Did the SonarScanner succedeed?
channel stopped
[BFA] Scanning build for known causes...
[BFA] No failure causes found
[BFA] Done. 0s
Started calculate disk usage of build
Finished Calculation of disk usage of build in 0 seconds
Started calculate disk usage of workspace
Finished Calculation of disk usage of workspace in 0 seconds
Sending e-mails to: abderrazek.boufahja@ihe-europe.net anne-gaelle.berge@ihe-europe.net cel@kereval.com eric.poiseau@inria.fr guillaume.thomazon@ihe-europe.net hra@kereval.com mtc@kereval.com yct@kereval.com
Finished: FAILURE