FailedConsole Output

Collecting metadata...
Metadata collection done.
Started calculate disk usage of build
Finished Calculation of disk usage of build in 0 seconds
Started calculate disk usage of workspace
Finished Calculation of disk usage of workspace in 0 seconds
[INFO] 
[INFO] ------------------------------------------------------------------------
[INFO] Building gazelle-sts-service 1.2.1-SNAPSHOT
[INFO] ------------------------------------------------------------------------
[INFO] 
[INFO] --- maven-clean-plugin:2.5:clean (default-clean) @ gazelle-sts-service ---
[INFO] 
[INFO] --- maven-resources-plugin:2.7:resources (default-resources) @ gazelle-sts-service ---
[INFO] Using 'UTF-8' encoding to copy filtered resources.
[INFO] Copying 18 resources
[INFO] 
[INFO] --- maven-compiler-plugin:3.1:compile (default-compile) @ gazelle-sts-service ---
[INFO] Changes detected - recompiling the module!
[INFO] Compiling 34 source files to /home/jenkins/.hudson/jobs/gazelle-sts/workspace/gazelle-sts-service/target/classes
[INFO] 
[INFO] --- maven-resources-plugin:2.7:testResources (default-testResources) @ gazelle-sts-service ---
[INFO] Using 'UTF-8' encoding to copy filtered resources.
[INFO] Copying 1 resource
[INFO] 
[INFO] --- maven-compiler-plugin:3.1:testCompile (default-testCompile) @ gazelle-sts-service ---
[INFO] Nothing to compile - all classes are up to date
[INFO] 
[INFO] --- maven-surefire-plugin:2.12.4:test (default-test) @ gazelle-sts-service ---
[JENKINS] Recording test results
[INFO] 
[INFO] --- maven-war-plugin:2.2:war (default-war) @ gazelle-sts-service ---
[INFO] Packaging webapp
[INFO] Assembling webapp [gazelle-sts-service] in [/home/jenkins/.hudson/jobs/gazelle-sts/workspace/gazelle-sts-service/target/gazelle-sts-service-1.2.1-SNAPSHOT]
[INFO] Processing war project
[INFO] Copying webapp resources [/home/jenkins/.hudson/jobs/gazelle-sts/workspace/gazelle-sts-service/src/main/webapp]
[INFO] Webapp assembled in [113 msecs]
[INFO] Building war: /home/jenkins/.hudson/jobs/gazelle-sts/workspace/gazelle-sts-service/target/gazelle-sts-service-1.2.1-SNAPSHOT.war
[INFO] WEB-INF/web.xml already added, skipping
[INFO] 
[INFO] --- maven-assembly-plugin:2.3:single (make-assembly) @ gazelle-sts-service ---
[INFO] Reading assembly descriptor: src/main/assembly/zip-config.xml
[INFO] Reading assembly descriptor: src/main/assembly/zip-soapui.xml
[INFO] Building zip: /home/jenkins/.hudson/jobs/gazelle-sts/workspace/gazelle-sts-service/target/gazelle-sts-service-1.2.1-SNAPSHOT-config.zip
[INFO] Building zip: /home/jenkins/.hudson/jobs/gazelle-sts/workspace/gazelle-sts-service/target/gazelle-sts-service-1.2.1-SNAPSHOT-soapui.zip
[INFO] 
[INFO] --- maven-install-plugin:2.4:install (default-install) @ gazelle-sts-service ---
[INFO] Installing /home/jenkins/.hudson/jobs/gazelle-sts/workspace/gazelle-sts-service/target/gazelle-sts-service-1.2.1-SNAPSHOT.war to /home/jenkins/.m2/repository/net/ihe/gazelle/gazelle-sts-service/1.2.1-SNAPSHOT/gazelle-sts-service-1.2.1-SNAPSHOT.war
[INFO] Installing /home/jenkins/.hudson/jobs/gazelle-sts/workspace/gazelle-sts-service/pom.xml to /home/jenkins/.m2/repository/net/ihe/gazelle/gazelle-sts-service/1.2.1-SNAPSHOT/gazelle-sts-service-1.2.1-SNAPSHOT.pom
[INFO] Installing /home/jenkins/.hudson/jobs/gazelle-sts/workspace/gazelle-sts-service/target/gazelle-sts-service-1.2.1-SNAPSHOT-config.zip to /home/jenkins/.m2/repository/net/ihe/gazelle/gazelle-sts-service/1.2.1-SNAPSHOT/gazelle-sts-service-1.2.1-SNAPSHOT-config.zip
[BFA] Scanning build for known causes...
[BFA] No failure causes found
[BFA] Done. 0s
Collecting metadata...
Metadata collection done.
Started calculate disk usage of build
Finished Calculation of disk usage of build in 0 seconds
Started calculate disk usage of workspace
Finished Calculation of disk usage of workspace in 0 seconds
[INFO] 
[INFO] ------------------------------------------------------------------------
[INFO] Skipping gazelle-sts
[INFO] This project has been banned from the build due to previous failures.
[INFO] ------------------------------------------------------------------------
[INFO] ------------------------------------------------------------------------
[INFO] Reactor Summary:
[INFO] 
[INFO] gazelle-sts ........................................ SUCCESS [  0.573 s]
[INFO] gazelle-sts-constants .............................. SUCCESS [  4.968 s]
[INFO] gazelle-sts-service ................................ FAILURE [  4.951 s]
[INFO] gazelle-sts-client ................................. SKIPPED
[INFO] ------------------------------------------------------------------------
[INFO] BUILD FAILURE
[INFO] ------------------------------------------------------------------------
[INFO] Total time: 12.775 s
[INFO] Finished at: 2019-09-19T20:00:58+02:00
[INFO] Final Memory: 36M/593M
[INFO] ------------------------------------------------------------------------
Waiting for Jenkins to finish collecting data
[ERROR] Failed to execute goal org.apache.maven.plugins:maven-install-plugin:2.4:install (default-install) on project gazelle-sts-service: Failed to install metadata net.ihe.gazelle:gazelle-sts-service/maven-metadata.xml: Could not parse metadata /home/jenkins/.m2/repository/net/ihe/gazelle/gazelle-sts-service/maven-metadata-local.xml: in epilog non whitespace content is not allowed but got a (position: END_TAG seen ...</metadata>\na... @15:2) -> [Help 1]
[ERROR] 
[ERROR] To see the full stack trace of the errors, re-run Maven with the -e switch.
[ERROR] Re-run Maven using the -X switch to enable full debug logging.
[ERROR] 
[ERROR] For more information about the errors and possible solutions, please read the following articles:
[ERROR] [Help 1] http://cwiki.apache.org/confluence/display/MAVEN/MojoExecutionException
[ERROR] 
[ERROR] After correcting the problems, you can resume the build with the command
[ERROR]   mvn <goals> -rf :gazelle-sts-service