FailedConsole Output

Started by timer
[EnvInject] - Loading node environment variables.
Building on master in workspace /home/jenkins/.hudson/jobs/gazelle-tm-ws-client/workspace
Reverting /home/jenkins/.hudson/jobs/gazelle-tm-ws-client/workspace/. to depth infinity with ignoreExternals: false
Updating svn+ssh://scm.gforge.inria.fr/svn/gazelle/Maven/gazelle-tm/trunk/gazelle-tm-ws-client at revision '2017-09-06T04:36:00.031 +0200'
Using sole credentials gazelle-jenkins in realm ‘svn+ssh://scm.gforge.inria.fr’
Using sole credentials gazelle-jenkins in realm ‘svn+ssh://scm.gforge.inria.fr’
At revision 59147

No changes for svn+ssh://scm.gforge.inria.fr/svn/gazelle/Maven/gazelle-tm/trunk/gazelle-tm-ws-client since the previous build
Injecting SonarQube environment variables using the configuration: Sonar
Parsing POMs
Downloaded artifact https://gazelle.ihe.net/nexus/content/groups/public/net/ihe/gazelle/model/gazelle-model/3.3.125-SNAPSHOT/maven-metadata.xml
Downloaded artifact https://gazelle.ihe.net/nexus/content/groups/public/net/ihe/gazelle/tm/gazelle-tm/4.12.0-SNAPSHOT/maven-metadata.xml
Established TCP socket on 60220
[workspace] $ /usr/lib/jvm/java-8-oracle//bin/java -Djava.net.preferIPv4Stack=true -Dfile.encoding=UTF8 -Xmx512m -XX:MaxPermSize=128m -cp /home/jenkins/.hudson/plugins/maven-plugin/WEB-INF/lib/maven33-agent-1.11.jar:/home/jenkins/.hudson/tools/hudson.tasks.Maven_MavenInstallation/Maven3/boot/plexus-classworlds-2.5.2.jar:/home/jenkins/.hudson/tools/hudson.tasks.Maven_MavenInstallation/Maven3/conf/logging jenkins.maven3.agent.Maven33Main /home/jenkins/.hudson/tools/hudson.tasks.Maven_MavenInstallation/Maven3 /home/jenkins/.hudson/war/WEB-INF/lib/remoting-3.11.jar /home/jenkins/.hudson/plugins/maven-plugin/WEB-INF/lib/maven33-interceptor-1.11.jar /home/jenkins/.hudson/plugins/maven-plugin/WEB-INF/lib/maven3-interceptor-commons-1.11.jar 60220
Java HotSpot(TM) 64-Bit Server VM warning: ignoring option MaxPermSize=128m; support was removed in 8.0
<===[JENKINS REMOTING CAPACITY]===>channel started
Executing Maven:  -B -f /home/jenkins/.hudson/jobs/gazelle-tm-ws-client/workspace/pom.xml clean package org.sonarsource.scanner.maven:sonar-maven-plugin:sonar
[INFO] Scanning for projects...
[INFO]                                                                         
[INFO] ------------------------------------------------------------------------
[INFO] Building gazelle-tm-ws-client 4.12.0-SNAPSHOT
[INFO] ------------------------------------------------------------------------
[INFO] Downloading: https://gazelle.ihe.net/nexus/content/groups/public/net/ihe/gazelle/tm/gazelle-tm-ws-data/4.12.0-SNAPSHOT/maven-metadata.xml
[INFO] Downloaded: https://gazelle.ihe.net/nexus/content/groups/public/net/ihe/gazelle/tm/gazelle-tm-ws-data/4.12.0-SNAPSHOT/maven-metadata.xml (1014 B at 1.0 KB/sec)
[INFO] 
[INFO] --- maven-clean-plugin:2.4.1:clean (default-clean) @ gazelle-tm-ws-client ---
[INFO] Deleting /home/jenkins/.hudson/jobs/gazelle-tm-ws-client/workspace/target
[INFO] 
[INFO] --- maven-buildmetadata-plugin:1.1.0.IHE.3:provide-buildmetadata (default) @ gazelle-tm-ws-client ---
[INFO] Writing properties '/home/jenkins/.hudson/jobs/gazelle-tm-ws-client/workspace/target/classes/META-INF/build.properties'...
[INFO] Writing XML report '/home/jenkins/.hudson/jobs/gazelle-tm-ws-client/workspace/target/buildmetadata.xml'...
[INFO] 
[INFO] --- maven-resources-plugin:2.5:resources (default-resources) @ gazelle-tm-ws-client ---
[debug] execute contextualize
[INFO] Using 'UTF-8' encoding to copy filtered resources.
[INFO] skip non existing resourceDirectory /home/jenkins/.hudson/jobs/gazelle-tm-ws-client/workspace/src/main/resources
[INFO] 
[INFO] --- maven-compiler-plugin:2.3.2:compile (default-compile) @ gazelle-tm-ws-client ---
[INFO] Compiling 15 source files to /home/jenkins/.hudson/jobs/gazelle-tm-ws-client/workspace/target/classes
[INFO] 
[INFO] --- maven-resources-plugin:2.5:testResources (default-testResources) @ gazelle-tm-ws-client ---
[debug] execute contextualize
[INFO] Using 'UTF-8' encoding to copy filtered resources.
[INFO] Copying 1 resource
[INFO] 
[INFO] --- maven-compiler-plugin:2.3.2:testCompile (default-testCompile) @ gazelle-tm-ws-client ---
[INFO] Compiling 1 source file to /home/jenkins/.hudson/jobs/gazelle-tm-ws-client/workspace/target/test-classes
[INFO] 
[INFO] --- maven-surefire-plugin:2.13:test (default-test) @ gazelle-tm-ws-client ---
[INFO] Tests are skipped.
[INFO] 
[INFO] --- maven-jar-plugin:2.3:jar (default-jar) @ gazelle-tm-ws-client ---
[INFO] Building jar: /home/jenkins/.hudson/jobs/gazelle-tm-ws-client/workspace/target/gazelle-tm-ws-client-4.12.0-SNAPSHOT.jar
[INFO] 
[INFO] --- maven-jar-plugin:2.3:test-jar (default) @ gazelle-tm-ws-client ---
[INFO] Building jar: /home/jenkins/.hudson/jobs/gazelle-tm-ws-client/workspace/target/gazelle-tm-ws-client-4.12.0-SNAPSHOT-tests.jar
Started calculate disk usage of build
Finished Calculation of disk usage of build in 0 seconds
Started calculate disk usage of workspace
Finished Calculation of disk usage of workspace in 0 seconds
[INFO]                                                                         
[INFO] ------------------------------------------------------------------------
[INFO] Building gazelle-tm-ws-client 4.12.0-SNAPSHOT
[INFO] ------------------------------------------------------------------------
[INFO] 
[INFO] --- sonar-maven-plugin:3.3.0.603:sonar (default-cli) @ gazelle-tm-ws-client ---
[INFO] User cache: /home/jenkins/.sonar/cache
[BFA] Scanning build for known causes...
[BFA] No failure causes found
[BFA] Done. 0s
Started calculate disk usage of build
Finished Calculation of disk usage of build in 0 seconds
Started calculate disk usage of workspace
Finished Calculation of disk usage of workspace in 0 seconds
[INFO] ------------------------------------------------------------------------
[INFO] BUILD FAILURE
[INFO] ------------------------------------------------------------------------
[INFO] Total time: 7.402 s
[INFO] Finished at: 2017-09-06T04:36:13+02:00
[INFO] Final Memory: 43M/489M
[INFO] ------------------------------------------------------------------------
[ERROR] Failed to execute goal org.sonarsource.scanner.maven:sonar-maven-plugin:3.3.0.603:sonar (default-cli) on project gazelle-tm-ws-client: Unable to execute SonarQube: Fail to bootstrap from server. Bootstrap index was:
[ERROR] <!DOCTYPE html><html lang="en"><head><meta http-equiv="content-type" content="text/html; charset=UTF-8" charset="UTF-8"/><meta http-equiv="X-UA-Compatible" content="IE=edge"><link rel="apple-touch-icon" href="/sonar/apple-touch-icon.png"><link rel="apple-touch-icon" sizes="57x57" href="/sonar/apple-touch-icon-57x57.png"><link rel="apple-touch-icon" sizes="60x60" href="/sonar/apple-touch-icon-60x60.png"><link rel="apple-touch-icon" sizes="72x72" href="/sonar/apple-touch-icon-72x72.png"><link rel="apple-touch-icon" sizes="76x76" href="/sonar/apple-touch-icon-76x76.png"><link rel="apple-touch-icon" sizes="114x114" href="/sonar/apple-touch-icon-114x114.png"><link rel="apple-touch-icon" sizes="120x120" href="/sonar/apple-touch-icon-120x120.png"><link rel="apple-touch-icon" sizes="144x144" href="/sonar/apple-touch-icon-144x144.png"><link rel="apple-touch-icon" sizes="152x152" href="/sonar/apple-touch-icon-152x152.png"><link rel="apple-touch-icon" sizes="180x180" href="/sonar/apple-touch-icon-180x180.png"><link rel="icon" type="image/x-icon" href="/sonar/favicon.ico"><meta name="application-name" content="SonarQube"/><meta name="msapplication-TileColor" content="#FFFFFF"/><meta name="msapplication-TileImage" content="/sonar/mstile-512x512.png"/><link href="/sonar/css/sonar.bf342fee.css" rel="stylesheet"><title>SonarQube</title></head><body><div id="content"><div class="global-loading"><i class="spinner global-loading-spinner"></i> <span class="global-loading-text">Loading...</span></div></div><script>window.baseUrl="/sonar"</script><script src="/sonar/js/vendor.0ba4fd94.js"></script><script src="/sonar/js/app.bf342fee.js"></script></body></html>
[JENKINS] Archiving /home/jenkins/.hudson/jobs/gazelle-tm-ws-client/workspace/pom.xml to net.ihe.gazelle.tm/gazelle-tm-ws-client/4.12.0-SNAPSHOT/gazelle-tm-ws-client-4.12.0-SNAPSHOT.pom
[JENKINS] Archiving /home/jenkins/.hudson/jobs/gazelle-tm-ws-client/workspace/target/gazelle-tm-ws-client-4.12.0-SNAPSHOT.jar to net.ihe.gazelle.tm/gazelle-tm-ws-client/4.12.0-SNAPSHOT/gazelle-tm-ws-client-4.12.0-SNAPSHOT.jar
[JENKINS] Archiving /home/jenkins/.hudson/jobs/gazelle-tm-ws-client/workspace/target/gazelle-tm-ws-client-4.12.0-SNAPSHOT-tests.jar to net.ihe.gazelle.tm/gazelle-tm-ws-client/4.12.0-SNAPSHOT/gazelle-tm-ws-client-4.12.0-SNAPSHOT-tests.jar
[ERROR] -> [Help 1]
[ERROR] 
[ERROR] To see the full stack trace of the errors, re-run Maven with the -e switch.
[ERROR] Re-run Maven using the -X switch to enable full debug logging.
[ERROR] 
[ERROR] For more information about the errors and possible solutions, please read the following articles:
[ERROR] [Help 1] http://cwiki.apache.org/confluence/display/MAVEN/MojoExecutionException
channel stopped
[BFA] Scanning build for known causes...
[BFA] No failure causes found
[BFA] Done. 0s
Started calculate disk usage of build
Finished Calculation of disk usage of build in 0 seconds
Started calculate disk usage of workspace
Finished Calculation of disk usage of workspace in 0 seconds
An attempt to send an e-mail to empty list of recipients, ignored.
Finished: FAILURE