FailedConsole Output

Started by timer
[EnvInject] - Loading node environment variables.
Building on master in workspace /home/jenkins/.hudson/jobs/gazelle-tm-ws-client/workspace
Reverting /home/jenkins/.hudson/jobs/gazelle-tm-ws-client/workspace/. to depth infinity with ignoreExternals: false
Updating svn+ssh://scm.gforge.inria.fr/svn/gazelle/Maven/gazelle-tm/trunk/gazelle-tm-ws-client at revision '2017-09-07T04:36:00.526 +0200'
Using sole credentials gazelle-jenkins in realm ‘svn+ssh://scm.gforge.inria.fr’
Using sole credentials gazelle-jenkins in realm ‘svn+ssh://scm.gforge.inria.fr’
At revision 59185

No changes for svn+ssh://scm.gforge.inria.fr/svn/gazelle/Maven/gazelle-tm/trunk/gazelle-tm-ws-client since the previous build
Injecting SonarQube environment variables using the configuration: Sonar
Parsing POMs
Downloaded artifact https://gazelle.ihe.net/nexus/content/groups/public/net/ihe/gazelle/model/gazelle-model/3.3.125-SNAPSHOT/maven-metadata.xml
Downloaded artifact https://gazelle.ihe.net/nexus/content/groups/public/net/ihe/gazelle/tm/gazelle-tm/4.12.0-SNAPSHOT/maven-metadata.xml
Established TCP socket on 52679
[workspace] $ /usr/lib/jvm/java-8-oracle//bin/java -Djava.net.preferIPv4Stack=true -Dfile.encoding=UTF8 -Xmx512m -XX:MaxPermSize=128m -cp /home/jenkins/.hudson/plugins/maven-plugin/WEB-INF/lib/maven33-agent-1.11.jar:/home/jenkins/.hudson/tools/hudson.tasks.Maven_MavenInstallation/Maven3/boot/plexus-classworlds-2.5.2.jar:/home/jenkins/.hudson/tools/hudson.tasks.Maven_MavenInstallation/Maven3/conf/logging jenkins.maven3.agent.Maven33Main /home/jenkins/.hudson/tools/hudson.tasks.Maven_MavenInstallation/Maven3 /home/jenkins/.hudson/war/WEB-INF/lib/remoting-3.11.jar /home/jenkins/.hudson/plugins/maven-plugin/WEB-INF/lib/maven33-interceptor-1.11.jar /home/jenkins/.hudson/plugins/maven-plugin/WEB-INF/lib/maven3-interceptor-commons-1.11.jar 52679
Java HotSpot(TM) 64-Bit Server VM warning: ignoring option MaxPermSize=128m; support was removed in 8.0
<===[JENKINS REMOTING CAPACITY]===>channel started
Executing Maven:  -B -f /home/jenkins/.hudson/jobs/gazelle-tm-ws-client/workspace/pom.xml clean package org.sonarsource.scanner.maven:sonar-maven-plugin:sonar
[INFO] Scanning for projects...
[INFO]                                                                         
[INFO] ------------------------------------------------------------------------
[INFO] Building gazelle-tm-ws-client 4.12.0-SNAPSHOT
[INFO] ------------------------------------------------------------------------
[INFO] Downloading: https://gazelle.ihe.net/nexus/content/groups/public/net/ihe/gazelle/tm/gazelle-tm-ws-data/4.12.0-SNAPSHOT/maven-metadata.xml
[INFO] Downloaded: https://gazelle.ihe.net/nexus/content/groups/public/net/ihe/gazelle/tm/gazelle-tm-ws-data/4.12.0-SNAPSHOT/maven-metadata.xml (1014 B at 1.1 KB/sec)
[INFO] Downloading: https://gazelle.ihe.net/nexus/content/groups/public/net/ihe/gazelle/tm/gazelle-tm-ws-data/4.12.0-SNAPSHOT/gazelle-tm-ws-data-4.12.0-20170906.023908-1299.pom
[INFO] Downloaded: https://gazelle.ihe.net/nexus/content/groups/public/net/ihe/gazelle/tm/gazelle-tm-ws-data/4.12.0-SNAPSHOT/gazelle-tm-ws-data-4.12.0-20170906.023908-1299.pom (718 B at 2.4 KB/sec)
[INFO] Downloading: https://gazelle.ihe.net/nexus/content/groups/public/net/ihe/gazelle/tm/gazelle-tm-ws-data/4.12.0-SNAPSHOT/gazelle-tm-ws-data-4.12.0-20170906.023908-1299.jar
[INFO] Downloaded: https://gazelle.ihe.net/nexus/content/groups/public/net/ihe/gazelle/tm/gazelle-tm-ws-data/4.12.0-SNAPSHOT/gazelle-tm-ws-data-4.12.0-20170906.023908-1299.jar (37 KB at 113.8 KB/sec)
[INFO] 
[INFO] --- maven-clean-plugin:2.4.1:clean (default-clean) @ gazelle-tm-ws-client ---
[INFO] Deleting /home/jenkins/.hudson/jobs/gazelle-tm-ws-client/workspace/target
[INFO] 
[INFO] --- maven-buildmetadata-plugin:1.1.0.IHE.3:provide-buildmetadata (default) @ gazelle-tm-ws-client ---
[INFO] Writing properties '/home/jenkins/.hudson/jobs/gazelle-tm-ws-client/workspace/target/classes/META-INF/build.properties'...
[INFO] Writing XML report '/home/jenkins/.hudson/jobs/gazelle-tm-ws-client/workspace/target/buildmetadata.xml'...
[INFO] 
[INFO] --- maven-resources-plugin:2.5:resources (default-resources) @ gazelle-tm-ws-client ---
[debug] execute contextualize
[INFO] Using 'UTF-8' encoding to copy filtered resources.
[INFO] skip non existing resourceDirectory /home/jenkins/.hudson/jobs/gazelle-tm-ws-client/workspace/src/main/resources
[INFO] 
[INFO] --- maven-compiler-plugin:2.3.2:compile (default-compile) @ gazelle-tm-ws-client ---
[INFO] Compiling 15 source files to /home/jenkins/.hudson/jobs/gazelle-tm-ws-client/workspace/target/classes
[INFO] 
[INFO] --- maven-resources-plugin:2.5:testResources (default-testResources) @ gazelle-tm-ws-client ---
[debug] execute contextualize
[INFO] Using 'UTF-8' encoding to copy filtered resources.
[INFO] Copying 1 resource
[INFO] 
[INFO] --- maven-compiler-plugin:2.3.2:testCompile (default-testCompile) @ gazelle-tm-ws-client ---
[INFO] Compiling 1 source file to /home/jenkins/.hudson/jobs/gazelle-tm-ws-client/workspace/target/test-classes
[INFO] 
[INFO] --- maven-surefire-plugin:2.13:test (default-test) @ gazelle-tm-ws-client ---
[INFO] Tests are skipped.
[INFO] 
[INFO] --- maven-jar-plugin:2.3:jar (default-jar) @ gazelle-tm-ws-client ---
[INFO] Building jar: /home/jenkins/.hudson/jobs/gazelle-tm-ws-client/workspace/target/gazelle-tm-ws-client-4.12.0-SNAPSHOT.jar
[INFO] 
[INFO] --- maven-jar-plugin:2.3:test-jar (default) @ gazelle-tm-ws-client ---
[INFO] Building jar: /home/jenkins/.hudson/jobs/gazelle-tm-ws-client/workspace/target/gazelle-tm-ws-client-4.12.0-SNAPSHOT-tests.jar
Started calculate disk usage of build
Finished Calculation of disk usage of build in 0 seconds
Started calculate disk usage of workspace
Finished Calculation of disk usage of workspace in 0 seconds
[INFO]                                                                         
[INFO] ------------------------------------------------------------------------
[INFO] Building gazelle-tm-ws-client 4.12.0-SNAPSHOT
[INFO] ------------------------------------------------------------------------
[INFO] 
[INFO] --- sonar-maven-plugin:3.3.0.603:sonar (default-cli) @ gazelle-tm-ws-client ---
[INFO] User cache: /home/jenkins/.sonar/cache
[ERROR] SonarQube server [https://gazelle.ihe.net/sonar] can not be reached
[BFA] Scanning build for known causes...
[BFA] No failure causes found
[BFA] Done. 0s
Started calculate disk usage of build
Finished Calculation of disk usage of build in 0 seconds
Started calculate disk usage of workspace
Finished Calculation of disk usage of workspace in 0 seconds
[INFO] ------------------------------------------------------------------------
[INFO] BUILD FAILURE
[INFO] ------------------------------------------------------------------------
[INFO] Total time: 8.682 s
[INFO] Finished at: 2017-09-07T04:36:15+02:00
[INFO] Final Memory: 43M/443M
[INFO] ------------------------------------------------------------------------
[ERROR] Failed to execute goal org.sonarsource.scanner.maven:sonar-maven-plugin:3.3.0.603:sonar (default-cli) on project gazelle-tm-ws-client: Unable to execute SonarQube: Fail to get bootstrap index from server: Status returned by url [https://gazelle.ihe.net/sonar/batch/index] is not valid: [404] -> [Help 1]
[ERROR] 
[ERROR] To see the full stack trace of the errors, re-run Maven with the -e switch.
[ERROR] Re-run Maven using the -X switch to enable full debug logging.
[ERROR] 
[ERROR] For more information about the errors and possible solutions, please read the following articles:
[ERROR] [Help 1] http://cwiki.apache.org/confluence/display/MAVEN/MojoExecutionException
[JENKINS] Archiving /home/jenkins/.hudson/jobs/gazelle-tm-ws-client/workspace/pom.xml to net.ihe.gazelle.tm/gazelle-tm-ws-client/4.12.0-SNAPSHOT/gazelle-tm-ws-client-4.12.0-SNAPSHOT.pom
[JENKINS] Archiving /home/jenkins/.hudson/jobs/gazelle-tm-ws-client/workspace/target/gazelle-tm-ws-client-4.12.0-SNAPSHOT.jar to net.ihe.gazelle.tm/gazelle-tm-ws-client/4.12.0-SNAPSHOT/gazelle-tm-ws-client-4.12.0-SNAPSHOT.jar
[JENKINS] Archiving /home/jenkins/.hudson/jobs/gazelle-tm-ws-client/workspace/target/gazelle-tm-ws-client-4.12.0-SNAPSHOT-tests.jar to net.ihe.gazelle.tm/gazelle-tm-ws-client/4.12.0-SNAPSHOT/gazelle-tm-ws-client-4.12.0-SNAPSHOT-tests.jar
channel stopped
[BFA] Scanning build for known causes...
[BFA] No failure causes found
[BFA] Done. 0s
Started calculate disk usage of build
Finished Calculation of disk usage of build in 0 seconds
Started calculate disk usage of workspace
Finished Calculation of disk usage of workspace in 0 seconds
An attempt to send an e-mail to empty list of recipients, ignored.
Finished: FAILURE