FailedConsole Output

Established TCP socket on 54257
Java HotSpot(TM) 64-Bit Server VM warning: ignoring option MaxPermSize=128m; support was removed in 8.0
<===[JENKINS REMOTING CAPACITY]===>channel started
Executing Maven:  -B -f /home/jenkins/.hudson/jobs/gazelle-tm-ws-data/workspace/pom.xml clean install deploy org.sonarsource.scanner.maven:sonar-maven-plugin:sonar
[INFO] Scanning for projects...
[INFO]                                                                         
[INFO] ------------------------------------------------------------------------
[INFO] Building gazelle-tm-ws-data 4.12.0-SNAPSHOT
[INFO] ------------------------------------------------------------------------
[INFO] 
[INFO] --- maven-clean-plugin:2.4.1:clean (default-clean) @ gazelle-tm-ws-data ---
[INFO] Deleting /home/jenkins/.hudson/jobs/gazelle-tm-ws-data/workspace/target
[INFO] 
[INFO] --- maven-buildmetadata-plugin:1.1.0.IHE.3:provide-buildmetadata (default) @ gazelle-tm-ws-data ---
[INFO] Writing properties '/home/jenkins/.hudson/jobs/gazelle-tm-ws-data/workspace/target/classes/META-INF/build.properties'...
[INFO] Writing XML report '/home/jenkins/.hudson/jobs/gazelle-tm-ws-data/workspace/target/buildmetadata.xml'...
[INFO] 
[INFO] --- maven-resources-plugin:2.5:resources (default-resources) @ gazelle-tm-ws-data ---
[debug] execute contextualize
[INFO] Using 'UTF-8' encoding to copy filtered resources.
[INFO] skip non existing resourceDirectory /home/jenkins/.hudson/jobs/gazelle-tm-ws-data/workspace/src/main/resources
[INFO] 
[INFO] --- maven-compiler-plugin:2.3.2:compile (default-compile) @ gazelle-tm-ws-data ---
[INFO] Compiling 33 source files to /home/jenkins/.hudson/jobs/gazelle-tm-ws-data/workspace/target/classes
[INFO] 
[INFO] --- maven-resources-plugin:2.5:testResources (default-testResources) @ gazelle-tm-ws-data ---
[debug] execute contextualize
[INFO] Using 'UTF-8' encoding to copy filtered resources.
[INFO] skip non existing resourceDirectory /home/jenkins/.hudson/jobs/gazelle-tm-ws-data/workspace/src/test/resources
[INFO] 
[INFO] --- maven-compiler-plugin:2.3.2:testCompile (default-testCompile) @ gazelle-tm-ws-data ---
[INFO] Compiling 2 source files to /home/jenkins/.hudson/jobs/gazelle-tm-ws-data/workspace/target/test-classes
[INFO] 
[INFO] --- maven-surefire-plugin:2.13:test (default-test) @ gazelle-tm-ws-data ---
[INFO] Tests are skipped.
[INFO] 
[INFO] --- maven-jar-plugin:2.3:jar (default-jar) @ gazelle-tm-ws-data ---
[INFO] Building jar: /home/jenkins/.hudson/jobs/gazelle-tm-ws-data/workspace/target/gazelle-tm-ws-data-4.12.0-SNAPSHOT.jar
[INFO] 
[INFO] --- maven-jar-plugin:2.3:test-jar (default) @ gazelle-tm-ws-data ---
[INFO] Building jar: /home/jenkins/.hudson/jobs/gazelle-tm-ws-data/workspace/target/gazelle-tm-ws-data-4.12.0-SNAPSHOT-tests.jar
[INFO] 
[INFO] --- maven-install-plugin:2.1:install (default-install) @ gazelle-tm-ws-data ---
[INFO] Installing /home/jenkins/.hudson/jobs/gazelle-tm-ws-data/workspace/target/gazelle-tm-ws-data-4.12.0-SNAPSHOT.jar to /home/jenkins/.m2/repository/net/ihe/gazelle/tm/gazelle-tm-ws-data/4.12.0-SNAPSHOT/gazelle-tm-ws-data-4.12.0-SNAPSHOT.jar
[INFO] Installing /home/jenkins/.hudson/jobs/gazelle-tm-ws-data/workspace/pom.xml to /home/jenkins/.m2/repository/net/ihe/gazelle/tm/gazelle-tm-ws-data/4.12.0-SNAPSHOT/gazelle-tm-ws-data-4.12.0-SNAPSHOT.pom
[INFO] Installing /home/jenkins/.hudson/jobs/gazelle-tm-ws-data/workspace/target/gazelle-tm-ws-data-4.12.0-SNAPSHOT-tests.jar to /home/jenkins/.m2/repository/net/ihe/gazelle/tm/gazelle-tm-ws-data/4.12.0-SNAPSHOT/gazelle-tm-ws-data-4.12.0-SNAPSHOT-tests.jar
[INFO] 
[INFO] --- maven-buildmetadata-plugin:1.1.0.IHE.3:provide-buildmetadata (default) @ gazelle-tm-ws-data ---
[INFO] 
[INFO] --- maven-resources-plugin:2.5:resources (default-resources) @ gazelle-tm-ws-data ---
[debug] execute contextualize
[INFO] Using 'UTF-8' encoding to copy filtered resources.
[INFO] skip non existing resourceDirectory /home/jenkins/.hudson/jobs/gazelle-tm-ws-data/workspace/src/main/resources
[INFO] 
[INFO] --- maven-compiler-plugin:2.3.2:compile (default-compile) @ gazelle-tm-ws-data ---
[INFO] Nothing to compile - all classes are up to date
[INFO] 
[INFO] --- maven-resources-plugin:2.5:testResources (default-testResources) @ gazelle-tm-ws-data ---
[debug] execute contextualize
[INFO] Using 'UTF-8' encoding to copy filtered resources.
[INFO] skip non existing resourceDirectory /home/jenkins/.hudson/jobs/gazelle-tm-ws-data/workspace/src/test/resources
[INFO] 
[INFO] --- maven-compiler-plugin:2.3.2:testCompile (default-testCompile) @ gazelle-tm-ws-data ---
[INFO] Nothing to compile - all classes are up to date
[INFO] 
[INFO] --- maven-surefire-plugin:2.13:test (default-test) @ gazelle-tm-ws-data ---
[INFO] Tests are skipped.
[INFO] 
[INFO] --- maven-jar-plugin:2.3:jar (default-jar) @ gazelle-tm-ws-data ---
[INFO] 
[INFO] --- maven-jar-plugin:2.3:test-jar (default) @ gazelle-tm-ws-data ---
[INFO] 
[INFO] --- maven-install-plugin:2.1:install (default-install) @ gazelle-tm-ws-data ---
[INFO] Installing /home/jenkins/.hudson/jobs/gazelle-tm-ws-data/workspace/target/gazelle-tm-ws-data-4.12.0-SNAPSHOT.jar to /home/jenkins/.m2/repository/net/ihe/gazelle/tm/gazelle-tm-ws-data/4.12.0-SNAPSHOT/gazelle-tm-ws-data-4.12.0-SNAPSHOT.jar
[INFO] Installing /home/jenkins/.hudson/jobs/gazelle-tm-ws-data/workspace/pom.xml to /home/jenkins/.m2/repository/net/ihe/gazelle/tm/gazelle-tm-ws-data/4.12.0-SNAPSHOT/gazelle-tm-ws-data-4.12.0-SNAPSHOT.pom
[INFO] Installing /home/jenkins/.hudson/jobs/gazelle-tm-ws-data/workspace/target/gazelle-tm-ws-data-4.12.0-SNAPSHOT-tests.jar to /home/jenkins/.m2/repository/net/ihe/gazelle/tm/gazelle-tm-ws-data/4.12.0-SNAPSHOT/gazelle-tm-ws-data-4.12.0-SNAPSHOT-tests.jar
[INFO] Installing /home/jenkins/.hudson/jobs/gazelle-tm-ws-data/workspace/target/gazelle-tm-ws-data-4.12.0-SNAPSHOT-tests.jar to /home/jenkins/.m2/repository/net/ihe/gazelle/tm/gazelle-tm-ws-data/4.12.0-SNAPSHOT/gazelle-tm-ws-data-4.12.0-SNAPSHOT-tests.jar
[INFO] 
[INFO] --- maven-deploy-plugin:2.7:deploy (default-deploy) @ gazelle-tm-ws-data ---
[INFO] Downloading: https://gazelle.ihe.net/nexus/content/repositories/snapshots/net/ihe/gazelle/tm/gazelle-tm-ws-data/4.12.0-SNAPSHOT/maven-metadata.xml
[INFO] Downloaded: https://gazelle.ihe.net/nexus/content/repositories/snapshots/net/ihe/gazelle/tm/gazelle-tm-ws-data/4.12.0-SNAPSHOT/maven-metadata.xml (1014 B at 2.4 KB/sec)
[INFO] Uploading: https://gazelle.ihe.net/nexus/content/repositories/snapshots/net/ihe/gazelle/tm/gazelle-tm-ws-data/4.12.0-SNAPSHOT/gazelle-tm-ws-data-4.12.0-20170907.023908-1300.jar
[INFO] Uploaded: https://gazelle.ihe.net/nexus/content/repositories/snapshots/net/ihe/gazelle/tm/gazelle-tm-ws-data/4.12.0-SNAPSHOT/gazelle-tm-ws-data-4.12.0-20170907.023908-1300.jar (37 KB at 37.7 KB/sec)
[INFO] Uploading: https://gazelle.ihe.net/nexus/content/repositories/snapshots/net/ihe/gazelle/tm/gazelle-tm-ws-data/4.12.0-SNAPSHOT/gazelle-tm-ws-data-4.12.0-20170907.023908-1300.pom
[INFO] Uploaded: https://gazelle.ihe.net/nexus/content/repositories/snapshots/net/ihe/gazelle/tm/gazelle-tm-ws-data/4.12.0-SNAPSHOT/gazelle-tm-ws-data-4.12.0-20170907.023908-1300.pom (718 B at 0.9 KB/sec)
[INFO] Downloading: https://gazelle.ihe.net/nexus/content/repositories/snapshots/net/ihe/gazelle/tm/gazelle-tm-ws-data/maven-metadata.xml
[INFO] Downloaded: https://gazelle.ihe.net/nexus/content/repositories/snapshots/net/ihe/gazelle/tm/gazelle-tm-ws-data/maven-metadata.xml (2 KB at 3.4 KB/sec)
[INFO] Uploading: https://gazelle.ihe.net/nexus/content/repositories/snapshots/net/ihe/gazelle/tm/gazelle-tm-ws-data/4.12.0-SNAPSHOT/maven-metadata.xml
[INFO] Uploaded: https://gazelle.ihe.net/nexus/content/repositories/snapshots/net/ihe/gazelle/tm/gazelle-tm-ws-data/4.12.0-SNAPSHOT/maven-metadata.xml (1014 B at 1.3 KB/sec)
[INFO] Uploading: https://gazelle.ihe.net/nexus/content/repositories/snapshots/net/ihe/gazelle/tm/gazelle-tm-ws-data/maven-metadata.xml
[INFO] Uploaded: https://gazelle.ihe.net/nexus/content/repositories/snapshots/net/ihe/gazelle/tm/gazelle-tm-ws-data/maven-metadata.xml (2 KB at 1.4 KB/sec)
[INFO] Uploading: https://gazelle.ihe.net/nexus/content/repositories/snapshots/net/ihe/gazelle/tm/gazelle-tm-ws-data/4.12.0-SNAPSHOT/gazelle-tm-ws-data-4.12.0-20170907.023908-1300-tests.jar
[INFO] Uploaded: https://gazelle.ihe.net/nexus/content/repositories/snapshots/net/ihe/gazelle/tm/gazelle-tm-ws-data/4.12.0-SNAPSHOT/gazelle-tm-ws-data-4.12.0-20170907.023908-1300-tests.jar (5 KB at 5.4 KB/sec)
[INFO] Uploading: https://gazelle.ihe.net/nexus/content/repositories/snapshots/net/ihe/gazelle/tm/gazelle-tm-ws-data/4.12.0-SNAPSHOT/maven-metadata.xml
[INFO] Uploaded: https://gazelle.ihe.net/nexus/content/repositories/snapshots/net/ihe/gazelle/tm/gazelle-tm-ws-data/4.12.0-SNAPSHOT/maven-metadata.xml (1014 B at 1.1 KB/sec)
[INFO] Uploading: https://gazelle.ihe.net/nexus/content/repositories/snapshots/net/ihe/gazelle/tm/gazelle-tm-ws-data/4.12.0-SNAPSHOT/gazelle-tm-ws-data-4.12.0-20170907.023908-1300-tests.jar
[INFO] Uploaded: https://gazelle.ihe.net/nexus/content/repositories/snapshots/net/ihe/gazelle/tm/gazelle-tm-ws-data/4.12.0-SNAPSHOT/gazelle-tm-ws-data-4.12.0-20170907.023908-1300-tests.jar (5 KB at 4.7 KB/sec)
[INFO] Uploading: https://gazelle.ihe.net/nexus/content/repositories/snapshots/net/ihe/gazelle/tm/gazelle-tm-ws-data/4.12.0-SNAPSHOT/maven-metadata.xml
[INFO] Uploaded: https://gazelle.ihe.net/nexus/content/repositories/snapshots/net/ihe/gazelle/tm/gazelle-tm-ws-data/4.12.0-SNAPSHOT/maven-metadata.xml (1014 B at 1.1 KB/sec)
Started calculate disk usage of build
Finished Calculation of disk usage of build in 0 seconds
Started calculate disk usage of workspace
Finished Calculation of disk usage of workspace in 0 seconds
[INFO]                                                                         
[INFO] ------------------------------------------------------------------------
[INFO] Building gazelle-tm-ws-data 4.12.0-SNAPSHOT
[INFO] ------------------------------------------------------------------------
[INFO] 
[INFO] --- sonar-maven-plugin:3.3.0.603:sonar (default-cli) @ gazelle-tm-ws-data ---
[INFO] User cache: /home/jenkins/.sonar/cache
[INFO] Load global settings
[INFO] Load global settings (done) | time=187ms
[INFO] Server id: 1e5f71089284882
[INFO] User cache: /home/jenkins/.sonar/cache
[INFO] Load plugins index
[INFO] Load plugins index (done) | time=22ms
[INFO] Plugin [l10nes] defines 'l10nen' as base plugin. This metadata can be removed from manifest of l10n plugins since version 5.2.
[INFO] Plugin [l10nja] defines 'l10nen' as base plugin. This metadata can be removed from manifest of l10n plugins since version 5.2.
[INFO] Plugin [l10nde] defines 'l10nen' as base plugin. This metadata can be removed from manifest of l10n plugins since version 5.2.
[INFO] Plugin [l10nko] defines 'l10nen' as base plugin. This metadata can be removed from manifest of l10n plugins since version 5.2.
[INFO] Plugin [l10nfr] defines 'l10nen' as base plugin. This metadata can be removed from manifest of l10n plugins since version 5.2.
[INFO] Plugin [l10nit] defines 'l10nen' as base plugin. This metadata can be removed from manifest of l10n plugins since version 5.2.
[INFO] Plugin [l10nel] defines 'l10nen' as base plugin. This metadata can be removed from manifest of l10n plugins since version 5.2.
[INFO] SonarQube version: 6.5.0
[INFO] Default locale: "en_GB", source code encoding: "UTF-8"
[INFO] Process project properties
[INFO] Load project repositories
[INFO] Load project repositories (done) | time=125ms
[INFO] Load quality profiles
[BFA] Scanning build for known causes...
[BFA] No failure causes found
[BFA] Done. 0s
Started calculate disk usage of build
Finished Calculation of disk usage of build in 0 seconds
Started calculate disk usage of workspace
Finished Calculation of disk usage of workspace in 0 seconds
[INFO] ------------------------------------------------------------------------
[INFO] BUILD FAILURE
[INFO] ------------------------------------------------------------------------
[INFO] Total time: 15.182 s
[INFO] Finished at: 2017-09-07T04:39:19+02:00
[INFO] Final Memory: 73M/439M
[INFO] ------------------------------------------------------------------------
[ERROR] Failed to execute goal org.sonarsource.scanner.maven:sonar-maven-plugin:3.3.0.603:sonar (default-cli) on project gazelle-tm-ws-data: Unable to load component class org.sonar.scanner.report.MetadataPublisher: Unable to load component class org.sonar.scanner.rule.ModuleQProfiles: Error 404 on https://gazelle.ihe.net/sonar/api/qualityprofiles/search.protobuf?projectKey=net.ihe.gazelle.tm%3Agazelle-tm-ws-data : {"errors":[{"msg":"Component key 'net.ihe.gazelle.tm:gazelle-tm-ws-data' not found"}]} -> [Help 1]
[ERROR] 
[ERROR] To see the full stack trace of the errors, re-run Maven with the -e switch.
[ERROR] Re-run Maven using the -X switch to enable full debug logging.
[ERROR] 
[ERROR] For more information about the errors and possible solutions, please read the following articles:
[ERROR] [Help 1] http://cwiki.apache.org/confluence/display/MAVEN/MojoExecutionException