SuccessConsole Output

Collecting metadata...
Metadata collection done.
Started calculate disk usage of build
Finished Calculation of disk usage of build in 0 seconds
Started calculate disk usage of workspace
Finished Calculation of disk usage of workspace in 0 seconds
[INFO] 
[INFO] ------------------------------------------------------------------------
[INFO] Building gazelle-seam-tools-jar 3.1.2-SNAPSHOT
[INFO] ------------------------------------------------------------------------
[INFO] Downloading from nexus: https://gazelle.ihe.net/nexus/content/groups/public/com/google/code/findbugs/jsr305/maven-metadata.xml
[INFO] Downloaded from nexus: https://gazelle.ihe.net/nexus/content/groups/public/com/google/code/findbugs/jsr305/maven-metadata.xml (643 B at 592 B/s)
[INFO] 
[INFO] --- maven-clean-plugin:3.0.0:clean (default-clean) @ gazelle-seam-tools-jar ---
[INFO] 
[INFO] --- maven-enforcer-plugin:1.2:enforce (enforce-java-version) @ gazelle-seam-tools-jar ---
[INFO] 
[INFO] --- maven-enforcer-plugin:1.2:enforce (enforce-maven-version) @ gazelle-seam-tools-jar ---
[INFO] 
[INFO] --- buildnumber-maven-plugin:1.2:create-timestamp (get-build-timestamp) @ gazelle-seam-tools-jar ---
[INFO] 
[INFO] --- buildnumber-maven-plugin:1.2:create (get-scm-revision) @ gazelle-seam-tools-jar ---
[INFO] 
[INFO] --- maven-buildmetadata-plugin:1.1.0.IHE.3:provide-buildmetadata (default) @ gazelle-seam-tools-jar ---
[INFO] Executing: /bin/sh -c cd /home/jenkins/.hudson/jobs/gazelle-tools/workspace/gazelle-seam-tools-jar && svn --non-interactive log -v -r '{2019-04-15 08:34:51 +0000}:{2019-05-16 08:34:51 +0000}' svn+ssh://scm.gforge.inria.fr/svn/gazelle/Maven/gazelle-tools/trunk/gazelle-seam-tools-jar
[INFO] Working directory: /home/jenkins/.hudson/jobs/gazelle-tools/workspace/gazelle-seam-tools-jar
[INFO] Executing: /bin/sh -c cd /home/jenkins/.hudson/jobs/gazelle-tools/workspace/gazelle-seam-tools-jar && svn --non-interactive status
[INFO] Working directory: /home/jenkins/.hudson/jobs/gazelle-tools/workspace/gazelle-seam-tools-jar
[INFO] Writing properties '/home/jenkins/.hudson/jobs/gazelle-tools/workspace/gazelle-seam-tools-jar/target/classes/META-INF/build.properties'...
[INFO] Writing XML report '/home/jenkins/.hudson/jobs/gazelle-tools/workspace/gazelle-seam-tools-jar/target/buildmetadata.xml'...
[INFO] 
[INFO] --- jacoco-maven-plugin:0.7.9:prepare-agent (default) @ gazelle-seam-tools-jar ---
[INFO] argLine set to -javaagent:/home/jenkins/.m2/repository/org/jacoco/org.jacoco.agent/0.7.9/org.jacoco.agent-0.7.9-runtime.jar=destfile=/home/jenkins/.hudson/jobs/gazelle-tools/workspace/gazelle-seam-tools-jar/target/jacoco.exec,append=true
[INFO] 
[INFO] --- maven-resources-plugin:3.0.2:resources (default-resources) @ gazelle-seam-tools-jar ---
[INFO] Using 'UTF-8' encoding to copy filtered resources.
[INFO] Copying 14 resources
[INFO] 
[INFO] --- maven-compiler-plugin:3.5.1:compile (default-compile) @ gazelle-seam-tools-jar ---
[INFO] Changes detected - recompiling the module!
[INFO] Compiling 108 source files to /home/jenkins/.hudson/jobs/gazelle-tools/workspace/gazelle-seam-tools-jar/target/classes
[INFO] 
[INFO] --- maven-resources-plugin:3.0.2:testResources (default-testResources) @ gazelle-seam-tools-jar ---
[INFO] Using 'UTF-8' encoding to copy filtered resources.
[INFO] Copying 3 resources
[INFO] 
[INFO] --- maven-compiler-plugin:3.5.1:testCompile (default-testCompile) @ gazelle-seam-tools-jar ---
[INFO] Changes detected - recompiling the module!
[INFO] Compiling 5 source files to /home/jenkins/.hudson/jobs/gazelle-tools/workspace/gazelle-seam-tools-jar/target/test-classes
[INFO] 
[INFO] --- maven-surefire-plugin:2.20:test (default-test) @ gazelle-seam-tools-jar ---
[INFO] 
[INFO] -------------------------------------------------------
[INFO]  T E S T S
[INFO] -------------------------------------------------------
[INFO] Running net.ihe.gazelle.common.util.ZipCreationTest
[main] ERROR net.ihe.gazelle.common.util.ZipCreation - Error while unzipping
java.io.FileNotFoundException: src/test/resources/test-does-not-exist.zip (No such file or directory)
	at java.util.zip.ZipFile.open(Native Method)
	at java.util.zip.ZipFile.<init>(ZipFile.java:225)
	at java.util.zip.ZipFile.<init>(ZipFile.java:155)
	at java.util.zip.ZipFile.<init>(ZipFile.java:126)
	at net.ihe.gazelle.common.util.ZipCreation.Unzip(ZipCreation.java:43)
	at net.ihe.gazelle.common.util.ZipCreationTest.unzipErrorTest(ZipCreationTest.java:36)
	at sun.reflect.NativeMethodAccessorImpl.invoke0(Native Method)
	at sun.reflect.NativeMethodAccessorImpl.invoke(NativeMethodAccessorImpl.java:62)
	at sun.reflect.DelegatingMethodAccessorImpl.invoke(DelegatingMethodAccessorImpl.java:43)
	at java.lang.reflect.Method.invoke(Method.java:498)
	at org.junit.runners.model.FrameworkMethod$1.runReflectiveCall(FrameworkMethod.java:44)
	at org.junit.internal.runners.model.ReflectiveCallable.run(ReflectiveCallable.java:15)
	at org.junit.runners.model.FrameworkMethod.invokeExplosively(FrameworkMethod.java:41)
	at org.junit.internal.runners.statements.InvokeMethod.evaluate(InvokeMethod.java:20)
	at org.junit.internal.runners.statements.ExpectException.evaluate(ExpectException.java:21)
	at org.junit.runners.BlockJUnit4ClassRunner.runNotIgnored(BlockJUnit4ClassRunner.java:79)
	at org.junit.runners.BlockJUnit4ClassRunner.runChild(BlockJUnit4ClassRunner.java:71)
	at org.junit.runners.BlockJUnit4ClassRunner.runChild(BlockJUnit4ClassRunner.java:49)
	at org.junit.runners.ParentRunner$3.run(ParentRunner.java:193)
	at org.junit.runners.ParentRunner$1.schedule(ParentRunner.java:52)
	at org.junit.runners.ParentRunner.runChildren(ParentRunner.java:191)
	at org.junit.runners.ParentRunner.access$000(ParentRunner.java:42)
	at org.junit.runners.ParentRunner$2.evaluate(ParentRunner.java:184)
	at org.junit.runners.ParentRunner.run(ParentRunner.java:236)
	at org.junit.runners.Suite.runChild(Suite.java:128)
	at org.junit.runners.Suite.runChild(Suite.java:24)
	at org.junit.runners.ParentRunner$3.run(ParentRunner.java:193)
	at org.junit.runners.ParentRunner$1.schedule(ParentRunner.java:52)
	at org.junit.runners.ParentRunner.runChildren(ParentRunner.java:191)
	at org.junit.runners.ParentRunner.access$000(ParentRunner.java:42)
	at org.junit.runners.ParentRunner$2.evaluate(ParentRunner.java:184)
	at org.junit.runners.ParentRunner.run(ParentRunner.java:236)
	at org.apache.maven.surefire.junitcore.JUnitCore.run(JUnitCore.java:55)
	at org.apache.maven.surefire.junitcore.JUnitCoreWrapper.createRequestAndRun(JUnitCoreWrapper.java:137)
	at org.apache.maven.surefire.junitcore.JUnitCoreWrapper.executeEager(JUnitCoreWrapper.java:107)
	at org.apache.maven.surefire.junitcore.JUnitCoreWrapper.execute(JUnitCoreWrapper.java:83)
	at org.apache.maven.surefire.junitcore.JUnitCoreWrapper.execute(JUnitCoreWrapper.java:75)
	at org.apache.maven.surefire.junitcore.JUnitCoreProvider.invoke(JUnitCoreProvider.java:157)
	at org.apache.maven.surefire.booter.ForkedBooter.invokeProviderInSameClassLoader(ForkedBooter.java:386)
	at org.apache.maven.surefire.booter.ForkedBooter.runSuitesInProcess(ForkedBooter.java:323)
	at org.apache.maven.surefire.booter.ForkedBooter.main(ForkedBooter.java:143)
[main] ERROR net.ihe.gazelle.common.util.ZipCreation - Error while zipping
java.io.FileNotFoundException: src/test/resources/does-not-exist.txt (No such file or directory)
	at java.io.FileInputStream.open0(Native Method)
	at java.io.FileInputStream.open(FileInputStream.java:195)
	at java.io.FileInputStream.<init>(FileInputStream.java:138)
	at java.io.FileInputStream.<init>(FileInputStream.java:93)
	at net.ihe.gazelle.common.util.ZipCreation.files2zip(ZipCreation.java:115)
	at net.ihe.gazelle.common.util.ZipCreationTest.files2ZipBytesErrorTest(ZipCreationTest.java:54)
	at sun.reflect.NativeMethodAccessorImpl.invoke0(Native Method)
	at sun.reflect.NativeMethodAccessorImpl.invoke(NativeMethodAccessorImpl.java:62)
	at sun.reflect.DelegatingMethodAccessorImpl.invoke(DelegatingMethodAccessorImpl.java:43)
	at java.lang.reflect.Method.invoke(Method.java:498)
	at org.junit.runners.model.FrameworkMethod$1.runReflectiveCall(FrameworkMethod.java:44)
	at org.junit.internal.runners.model.ReflectiveCallable.run(ReflectiveCallable.java:15)
	at org.junit.runners.model.FrameworkMethod.invokeExplosively(FrameworkMethod.java:41)
	at org.junit.internal.runners.statements.InvokeMethod.evaluate(InvokeMethod.java:20)
	at org.junit.runners.BlockJUnit4ClassRunner.runNotIgnored(BlockJUnit4ClassRunner.java:79)
	at org.junit.runners.BlockJUnit4ClassRunner.runChild(BlockJUnit4ClassRunner.java:71)
	at org.junit.runners.BlockJUnit4ClassRunner.runChild(BlockJUnit4ClassRunner.java:49)
	at org.junit.runners.ParentRunner$3.run(ParentRunner.java:193)
	at org.junit.runners.ParentRunner$1.schedule(ParentRunner.java:52)
	at org.junit.runners.ParentRunner.runChildren(ParentRunner.java:191)
	at org.junit.runners.ParentRunner.access$000(ParentRunner.java:42)
	at org.junit.runners.ParentRunner$2.evaluate(ParentRunner.java:184)
	at org.junit.runners.ParentRunner.run(ParentRunner.java:236)
	at org.junit.runners.Suite.runChild(Suite.java:128)
	at org.junit.runners.Suite.runChild(Suite.java:24)
	at org.junit.runners.ParentRunner$3.run(ParentRunner.java:193)
	at org.junit.runners.ParentRunner$1.schedule(ParentRunner.java:52)
	at org.junit.runners.ParentRunner.runChildren(ParentRunner.java:191)
	at org.junit.runners.ParentRunner.access$000(ParentRunner.java:42)
	at org.junit.runners.ParentRunner$2.evaluate(ParentRunner.java:184)
	at org.junit.runners.ParentRunner.run(ParentRunner.java:236)
	at org.apache.maven.surefire.junitcore.JUnitCore.run(JUnitCore.java:55)
	at org.apache.maven.surefire.junitcore.JUnitCoreWrapper.createRequestAndRun(JUnitCoreWrapper.java:137)
	at org.apache.maven.surefire.junitcore.JUnitCoreWrapper.executeEager(JUnitCoreWrapper.java:107)
	at org.apache.maven.surefire.junitcore.JUnitCoreWrapper.execute(JUnitCoreWrapper.java:83)
	at org.apache.maven.surefire.junitcore.JUnitCoreWrapper.execute(JUnitCoreWrapper.java:75)
	at org.apache.maven.surefire.junitcore.JUnitCoreProvider.invoke(JUnitCoreProvider.java:157)
	at org.apache.maven.surefire.booter.ForkedBooter.invokeProviderInSameClassLoader(ForkedBooter.java:386)
	at org.apache.maven.surefire.booter.ForkedBooter.runSuitesInProcess(ForkedBooter.java:323)
	at org.apache.maven.surefire.booter.ForkedBooter.main(ForkedBooter.java:143)
[main] ERROR net.ihe.gazelle.common.util.ZipCreation - Error while zipping
java.io.FileNotFoundException: src/test/resources/does-not-exist.txt (No such file or directory)
	at java.io.FileInputStream.open0(Native Method)
	at java.io.FileInputStream.open(FileInputStream.java:195)
	at java.io.FileInputStream.<init>(FileInputStream.java:138)
	at java.io.FileInputStream.<init>(FileInputStream.java:93)
	at net.ihe.gazelle.common.util.ZipCreation.files2zip(ZipCreation.java:115)
	at net.ihe.gazelle.common.util.ZipCreation.files2zip(ZipCreation.java:80)
	at net.ihe.gazelle.common.util.ZipCreationTest.files2zipErrorTest(ZipCreationTest.java:86)
	at sun.reflect.NativeMethodAccessorImpl.invoke0(Native Method)
	at sun.reflect.NativeMethodAccessorImpl.invoke(NativeMethodAccessorImpl.java:62)
	at sun.reflect.DelegatingMethodAccessorImpl.invoke(DelegatingMethodAccessorImpl.java:43)
	at java.lang.reflect.Method.invoke(Method.java:498)
	at org.junit.runners.model.FrameworkMethod$1.runReflectiveCall(FrameworkMethod.java:44)
	at org.junit.internal.runners.model.ReflectiveCallable.run(ReflectiveCallable.java:15)
	at org.junit.runners.model.FrameworkMethod.invokeExplosively(FrameworkMethod.java:41)
	at org.junit.internal.runners.statements.InvokeMethod.evaluate(InvokeMethod.java:20)
	at org.junit.runners.BlockJUnit4ClassRunner.runNotIgnored(BlockJUnit4ClassRunner.java:79)
	at org.junit.runners.BlockJUnit4ClassRunner.runChild(BlockJUnit4ClassRunner.java:71)
	at org.junit.runners.BlockJUnit4ClassRunner.runChild(BlockJUnit4ClassRunner.java:49)
	at org.junit.runners.ParentRunner$3.run(ParentRunner.java:193)
	at org.junit.runners.ParentRunner$1.schedule(ParentRunner.java:52)
	at org.junit.runners.ParentRunner.runChildren(ParentRunner.java:191)
	at org.junit.runners.ParentRunner.access$000(ParentRunner.java:42)
	at org.junit.runners.ParentRunner$2.evaluate(ParentRunner.java:184)
	at org.junit.runners.ParentRunner.run(ParentRunner.java:236)
	at org.junit.runners.Suite.runChild(Suite.java:128)
	at org.junit.runners.Suite.runChild(Suite.java:24)
	at org.junit.runners.ParentRunner$3.run(ParentRunner.java:193)
	at org.junit.runners.ParentRunner$1.schedule(ParentRunner.java:52)
	at org.junit.runners.ParentRunner.runChildren(ParentRunner.java:191)
	at org.junit.runners.ParentRunner.access$000(ParentRunner.java:42)
	at org.junit.runners.ParentRunner$2.evaluate(ParentRunner.java:184)
	at org.junit.runners.ParentRunner.run(ParentRunner.java:236)
	at org.apache.maven.surefire.junitcore.JUnitCore.run(JUnitCore.java:55)
	at org.apache.maven.surefire.junitcore.JUnitCoreWrapper.createRequestAndRun(JUnitCoreWrapper.java:137)
	at org.apache.maven.surefire.junitcore.JUnitCoreWrapper.executeEager(JUnitCoreWrapper.java:107)
	at org.apache.maven.surefire.junitcore.JUnitCoreWrapper.execute(JUnitCoreWrapper.java:83)
	at org.apache.maven.surefire.junitcore.JUnitCoreWrapper.execute(JUnitCoreWrapper.java:75)
	at org.apache.maven.surefire.junitcore.JUnitCoreProvider.invoke(JUnitCoreProvider.java:157)
	at org.apache.maven.surefire.booter.ForkedBooter.invokeProviderInSameClassLoader(ForkedBooter.java:386)
	at org.apache.maven.surefire.booter.ForkedBooter.runSuitesInProcess(ForkedBooter.java:323)
	at org.apache.maven.surefire.booter.ForkedBooter.main(ForkedBooter.java:143)
[INFO] Tests run: 7, Failures: 0, Errors: 0, Skipped: 0, Time elapsed: 0.052 s - in net.ihe.gazelle.common.util.ZipCreationTest
[INFO] Running net.ihe.gazelle.common.util.XmlFormatterTest
[INFO] Tests run: 1, Failures: 0, Errors: 0, Skipped: 0, Time elapsed: 0.1 s - in net.ihe.gazelle.common.util.XmlFormatterTest
[INFO] Running net.ihe.gazelle.common.tag.AbstractLinkComponentTest
[INFO] Tests run: 1, Failures: 0, Errors: 0, Skipped: 0, Time elapsed: 0.067 s - in net.ihe.gazelle.common.tag.AbstractLinkComponentTest
[INFO] Running net.ihe.gazelle.common.tag.SafeHtmlComponentTest
[INFO] Tests run: 11, Failures: 0, Errors: 0, Skipped: 0, Time elapsed: 0.165 s - in net.ihe.gazelle.common.tag.SafeHtmlComponentTest
[INFO] Running net.ihe.gazelle.common.servletfilter.SQLinjectionFilterTest
[main] WARN net.ihe.gazelle.common.servletfilter.SQLinjectionFilter - Escaped char: 'select
[main] WARN net.ihe.gazelle.common.servletfilter.SQLinjectionFilter - Escaped char: 'select
[main] WARN net.ihe.gazelle.common.servletfilter.SQLinjectionFilter - Escaped char: 'select
[main] WARN net.ihe.gazelle.common.servletfilter.SQLinjectionFilter - Escaped char: 'drop
[main] WARN net.ihe.gazelle.common.servletfilter.SQLinjectionFilter - Escaped char: 
[main] WARN net.ihe.gazelle.common.servletfilter.SQLinjectionFilter - Escaped char: 
[INFO] Tests run: 3, Failures: 0, Errors: 0, Skipped: 0, Time elapsed: 0.006 s - in net.ihe.gazelle.common.servletfilter.SQLinjectionFilterTest
[INFO] 
[INFO] Results:
[INFO] 
[INFO] Tests run: 23, Failures: 0, Errors: 0, Skipped: 0
[INFO] 
[JENKINS] Recording test results
[INFO] 
[INFO] --- jacoco-maven-plugin:0.7.9:report (post-unit-test) @ gazelle-seam-tools-jar ---
[INFO] Loading execution data file /home/jenkins/.hudson/jobs/gazelle-tools/workspace/gazelle-seam-tools-jar/target/jacoco.exec
[INFO] Analyzed bundle 'gazelle-seam-tools-jar' with 105 classes
[INFO] 
[INFO] --- maven-ejb-plugin:2.3:ejb (default-ejb) @ gazelle-seam-tools-jar ---
[INFO] Building EJB gazelle-seam-tools-jar with EJB version 3.0
[INFO] Building jar: /home/jenkins/.hudson/jobs/gazelle-tools/workspace/gazelle-seam-tools-jar/target/gazelle-seam-tools-jar.jar
[INFO] 
[INFO] --- maven-source-plugin:3.0.1:jar-no-fork (attach-sources) @ gazelle-seam-tools-jar ---
[INFO] Building jar: /home/jenkins/.hudson/jobs/gazelle-tools/workspace/gazelle-seam-tools-jar/target/gazelle-seam-tools-jar-sources.jar
[INFO] 
[INFO] --- maven-jar-plugin:2.6:test-jar (default) @ gazelle-seam-tools-jar ---
[INFO] Building jar: /home/jenkins/.hudson/jobs/gazelle-tools/workspace/gazelle-seam-tools-jar/target/gazelle-seam-tools-jar-tests.jar
[INFO] 
[INFO] --- maven-install-plugin:2.4:install (default-install) @ gazelle-seam-tools-jar ---
[INFO] Installing /home/jenkins/.hudson/jobs/gazelle-tools/workspace/gazelle-seam-tools-jar/target/gazelle-seam-tools-jar.jar to /home/jenkins/.m2/repository/net/ihe/gazelle/maven/gazelle-seam-tools-jar/3.1.2-SNAPSHOT/gazelle-seam-tools-jar-3.1.2-SNAPSHOT.jar
[INFO] Installing /home/jenkins/.hudson/jobs/gazelle-tools/workspace/gazelle-seam-tools-jar/pom.xml to /home/jenkins/.m2/repository/net/ihe/gazelle/maven/gazelle-seam-tools-jar/3.1.2-SNAPSHOT/gazelle-seam-tools-jar-3.1.2-SNAPSHOT.pom
[INFO] Installing /home/jenkins/.hudson/jobs/gazelle-tools/workspace/gazelle-seam-tools-jar/target/gazelle-seam-tools-jar-sources.jar to /home/jenkins/.m2/repository/net/ihe/gazelle/maven/gazelle-seam-tools-jar/3.1.2-SNAPSHOT/gazelle-seam-tools-jar-3.1.2-SNAPSHOT-sources.jar
[INFO] Installing /home/jenkins/.hudson/jobs/gazelle-tools/workspace/gazelle-seam-tools-jar/target/gazelle-seam-tools-jar-tests.jar to /home/jenkins/.m2/repository/net/ihe/gazelle/maven/gazelle-seam-tools-jar/3.1.2-SNAPSHOT/gazelle-seam-tools-jar-3.1.2-SNAPSHOT-tests.jar