SuccessConsole Output

Skipping 329 KB.. Full Log
rg.powermock.modules.junit4.internal.impl.PowerMockJUnit44RunnerDelegateImpl$PowerMockJUnit44MethodRunner.runBeforesThenTestThenAfters(PowerMockJUnit44RunnerDelegateImpl.java:282)
	DEBUG_FRAME = org.junit.internal.runners.MethodRoadie.runTest(MethodRoadie.java:84)
	DEBUG_FRAME = org.junit.internal.runners.MethodRoadie.run(MethodRoadie.java:49)
	DEBUG_FRAME = org.powermock.modules.junit4.internal.impl.PowerMockJUnit44RunnerDelegateImpl.invokeTestMethod(PowerMockJUnit44RunnerDelegateImpl.java:207)
	DEBUG_FRAME = org.powermock.modules.junit4.internal.impl.PowerMockJUnit44RunnerDelegateImpl.runMethods(PowerMockJUnit44RunnerDelegateImpl.java:146)
	DEBUG_FRAME = org.powermock.modules.junit4.internal.impl.PowerMockJUnit44RunnerDelegateImpl$1.run(PowerMockJUnit44RunnerDelegateImpl.java:120)
	DEBUG_FRAME = org.junit.internal.runners.ClassRoadie.runUnprotected(ClassRoadie.java:34)
	DEBUG_FRAME = org.junit.internal.runners.ClassRoadie.runProtected(ClassRoadie.java:44)
	DEBUG_FRAME = org.powermock.modules.junit4.internal.impl.PowerMockJUnit44RunnerDelegateImpl.run(PowerMockJUnit44RunnerDelegateImpl.java:118)
	DEBUG_FRAME = org.powermock.modules.junit4.common.internal.impl.JUnit4TestSuiteChunkerImpl.run(JUnit4TestSuiteChunkerImpl.java:101)
	DEBUG_FRAME = org.powermock.modules.junit4.common.internal.impl.AbstractCommonPowerMockRunner.run(AbstractCommonPowerMockRunner.java:53)
	DEBUG_FRAME = org.powermock.modules.junit4.PowerMockRunner.run(PowerMockRunner.java:53)
	DEBUG_FRAME = org.junit.runners.Suite.runChild(Suite.java:128)
	DEBUG_FRAME = org.junit.runners.Suite.runChild(Suite.java:24)
	DEBUG_FRAME = org.junit.runners.ParentRunner$3.run(ParentRunner.java:193)
	DEBUG_FRAME = org.junit.runners.ParentRunner$1.schedule(ParentRunner.java:52)
	DEBUG_FRAME = org.junit.runners.ParentRunner.runChildren(ParentRunner.java:191)
	DEBUG_FRAME = org.junit.runners.ParentRunner.access$000(ParentRunner.java:42)
	DEBUG_FRAME = org.junit.runners.ParentRunner$2.evaluate(ParentRunner.java:184)
	DEBUG_FRAME = org.junit.runners.ParentRunner.run(ParentRunner.java:236)
	DEBUG_FRAME = org.junit.runners.Suite.runChild(Suite.java:128)
	DEBUG_FRAME = org.junit.runners.Suite.runChild(Suite.java:24)
	DEBUG_FRAME = org.junit.runners.ParentRunner$3.run(ParentRunner.java:193)
	DEBUG_FRAME = org.junit.runners.ParentRunner$1.schedule(ParentRunner.java:52)
	DEBUG_FRAME = org.junit.runners.ParentRunner.runChildren(ParentRunner.java:191)
	DEBUG_FRAME = org.junit.runners.ParentRunner.access$000(ParentRunner.java:42)
	DEBUG_FRAME = org.junit.runners.ParentRunner$2.evaluate(ParentRunner.java:184)
	DEBUG_FRAME = org.junit.runners.ParentRunner.run(ParentRunner.java:236)
	DEBUG_FRAME = org.apache.maven.surefire.junitcore.JUnitCore.run(JUnitCore.java:55)
	DEBUG_FRAME = org.apache.maven.surefire.junitcore.JUnitCoreWrapper.createRequestAndRun(JUnitCoreWrapper.java:137)
	DEBUG_FRAME = org.apache.maven.surefire.junitcore.JUnitCoreWrapper.executeEager(JUnitCoreWrapper.java:107)
	DEBUG_FRAME = org.apache.maven.surefire.junitcore.JUnitCoreWrapper.execute(JUnitCoreWrapper.java:83)
	DEBUG_FRAME = org.apache.maven.surefire.junitcore.JUnitCoreWrapper.execute(JUnitCoreWrapper.java:75)
	DEBUG_FRAME = org.apache.maven.surefire.junitcore.JUnitCoreProvider.invoke(JUnitCoreProvider.java:157)
	DEBUG_FRAME = org.apache.maven.surefire.booter.ForkedBooter.invokeProviderInSameClassLoader(ForkedBooter.java:386)
	DEBUG_FRAME = org.apache.maven.surefire.booter.ForkedBooter.runSuitesInProcess(ForkedBooter.java:323)
	DEBUG_FRAME = org.apache.maven.surefire.booter.ForkedBooter.main(ForkedBooter.java:143)

10:31:50,277 DEBUG [main] AxisOperation:485 - Entry: AxisOperation::getInputAction
10:31:50,278 DEBUG [main] AxisOperation:506 - Exit: AxisOperation::getInputAction null
10:31:50,278 DEBUG [main] AxisOperation:467 - Entry: AxisOperation::setSoapAction, previous soapAction: null updated soapAction: urn:listAllConfigurationsForATypeAsCSV
10:31:50,278 DEBUG [main] AxisOperation:471 - Exit: AxisOperation::setSoapAction
10:31:50,278 DEBUG [main] AxisService:872 - mapActionToOperation: Mapping Action to Operation: action: listAllConfigurationsForATypeAsCSV; operation: org.apache.axis2.description.OutInAxisOperation@7b28d8fanamed: {http://ws.configurations.tm.gazelle.ihe.net/}listAllConfigurationsForATypeAsCSV
10:31:50,278 DEBUG [main] AxisService:878 - DEBUG_FRAME = org.apache.axis2.util.JavaUtils.callStackToString(JavaUtils.java:564)
	DEBUG_FRAME = org.apache.axis2.description.AxisService.mapActionToOperation(AxisService.java:878)
	DEBUG_FRAME = org.apache.axis2.description.AxisService.addOperation(AxisService.java:724)
	DEBUG_FRAME = net.ihe.gazelle.ws.client.GazelleProxyWebServiceNameStub.populateAxisService(GazelleProxyWebServiceNameStub.java:160)
	DEBUG_FRAME = net.ihe.gazelle.ws.client.GazelleProxyWebServiceNameStub.<init>(GazelleProxyWebServiceNameStub.java:40)
	DEBUG_FRAME = net.ihe.gazelle.ws.client.GazelleProxyWebServiceNameStub.<init>(GazelleProxyWebServiceNameStub.java:29)
	DEBUG_FRAME = net.ihe.gazelle.ws.client.GazelleProxyWebServiceNameStub.<init>(GazelleProxyWebServiceNameStub.java:75)
	DEBUG_FRAME = net.ihe.gazelle.wstester.util.WsClient.listConfigurationsBySystemBySessionByTypeAsCSV(WsClient.java:36)
	DEBUG_FRAME = net.ihe.gazelle.wstester.action.RunInstanceAction.getEndPointBySystem(RunInstanceAction.java:709)
	DEBUG_FRAME = net.ihe.gazelle.wstester.action.RunInstanceActionTest2.getEndPointBySystemOK(RunInstanceActionTest2.java:61)
	DEBUG_FRAME = sun.reflect.NativeMethodAccessorImpl.invoke0(Native Method)
	DEBUG_FRAME = sun.reflect.NativeMethodAccessorImpl.invoke(NativeMethodAccessorImpl.java:62)
	DEBUG_FRAME = sun.reflect.DelegatingMethodAccessorImpl.invoke(DelegatingMethodAccessorImpl.java:43)
	DEBUG_FRAME = java.lang.reflect.Method.invoke(Method.java:498)
	DEBUG_FRAME = org.junit.internal.runners.TestMethod.invoke(TestMethod.java:66)
	DEBUG_FRAME = org.powermock.modules.junit4.internal.impl.PowerMockJUnit44RunnerDelegateImpl$PowerMockJUnit44MethodRunner.runTestMethod(PowerMockJUnit44RunnerDelegateImpl.java:310)
	DEBUG_FRAME = org.junit.internal.runners.MethodRoadie$2.run(MethodRoadie.java:86)
	DEBUG_FRAME = org.junit.internal.runners.MethodRoadie.runBeforesThenTestThenAfters(MethodRoadie.java:94)
	DEBUG_FRAME = org.powermock.modules.junit4.internal.impl.PowerMockJUnit44RunnerDelegateImpl$PowerMockJUnit44MethodRunner.executeTest(PowerMockJUnit44RunnerDelegateImpl.java:294)
	DEBUG_FRAME = org.powermock.modules.junit4.internal.impl.PowerMockJUnit47RunnerDelegateImpl$PowerMockJUnit47MethodRunner.executeTestInSuper(PowerMockJUnit47RunnerDelegateImpl.java:127)
	DEBUG_FRAME = org.powermock.modules.junit4.internal.impl.PowerMockJUnit47RunnerDelegateImpl$PowerMockJUnit47MethodRunner.executeTest(PowerMockJUnit47RunnerDelegateImpl.java:82)
	DEBUG_FRAME = org.powermock.modules.junit4.internal.impl.PowerMockJUnit44RunnerDelegateImpl$PowerMockJUnit44MethodRunner.runBeforesThenTestThenAfters(PowerMockJUnit44RunnerDelegateImpl.java:282)
	DEBUG_FRAME = org.junit.internal.runners.MethodRoadie.runTest(MethodRoadie.java:84)
	DEBUG_FRAME = org.junit.internal.runners.MethodRoadie.run(MethodRoadie.java:49)
	DEBUG_FRAME = org.powermock.modules.junit4.internal.impl.PowerMockJUnit44RunnerDelegateImpl.invokeTestMethod(PowerMockJUnit44RunnerDelegateImpl.java:207)
	DEBUG_FRAME = org.powermock.modules.junit4.internal.impl.PowerMockJUnit44RunnerDelegateImpl.runMethods(PowerMockJUnit44RunnerDelegateImpl.java:146)
	DEBUG_FRAME = org.powermock.modules.junit4.internal.impl.PowerMockJUnit44RunnerDelegateImpl$1.run(PowerMockJUnit44RunnerDelegateImpl.java:120)
	DEBUG_FRAME = org.junit.internal.runners.ClassRoadie.runUnprotected(ClassRoadie.java:34)
	DEBUG_FRAME = org.junit.internal.runners.ClassRoadie.runProtected(ClassRoadie.java:44)
	DEBUG_FRAME = org.powermock.modules.junit4.internal.impl.PowerMockJUnit44RunnerDelegateImpl.run(PowerMockJUnit44RunnerDelegateImpl.java:118)
	DEBUG_FRAME = org.powermock.modules.junit4.common.internal.impl.JUnit4TestSuiteChunkerImpl.run(JUnit4TestSuiteChunkerImpl.java:101)
	DEBUG_FRAME = org.powermock.modules.junit4.common.internal.impl.AbstractCommonPowerMockRunner.run(AbstractCommonPowerMockRunner.java:53)
	DEBUG_FRAME = org.powermock.modules.junit4.PowerMockRunner.run(PowerMockRunner.java:53)
	DEBUG_FRAME = org.junit.runners.Suite.runChild(Suite.java:128)
	DEBUG_FRAME = org.junit.runners.Suite.runChild(Suite.java:24)
	DEBUG_FRAME = org.junit.runners.ParentRunner$3.run(ParentRunner.java:193)
	DEBUG_FRAME = org.junit.runners.ParentRunner$1.schedule(ParentRunner.java:52)
	DEBUG_FRAME = org.junit.runners.ParentRunner.runChildren(ParentRunner.java:191)
	DEBUG_FRAME = org.junit.runners.ParentRunner.access$000(ParentRunner.java:42)
	DEBUG_FRAME = org.junit.runners.ParentRunner$2.evaluate(ParentRunner.java:184)
	DEBUG_FRAME = org.junit.runners.ParentRunner.run(ParentRunner.java:236)
	DEBUG_FRAME = org.junit.runners.Suite.runChild(Suite.java:128)
	DEBUG_FRAME = org.junit.runners.Suite.runChild(Suite.java:24)
	DEBUG_FRAME = org.junit.runners.ParentRunner$3.run(ParentRunner.java:193)
	DEBUG_FRAME = org.junit.runners.ParentRunner$1.schedule(ParentRunner.java:52)
	DEBUG_FRAME = org.junit.runners.ParentRunner.runChildren(ParentRunner.java:191)
	DEBUG_FRAME = org.junit.runners.ParentRunner.access$000(ParentRunner.java:42)
	DEBUG_FRAME = org.junit.runners.ParentRunner$2.evaluate(ParentRunner.java:184)
	DEBUG_FRAME = org.junit.runners.ParentRunner.run(ParentRunner.java:236)
	DEBUG_FRAME = org.apache.maven.surefire.junitcore.JUnitCore.run(JUnitCore.java:55)
	DEBUG_FRAME = org.apache.maven.surefire.junitcore.JUnitCoreWrapper.createRequestAndRun(JUnitCoreWrapper.java:137)
	DEBUG_FRAME = org.apache.maven.surefire.junitcore.JUnitCoreWrapper.executeEager(JUnitCoreWrapper.java:107)
	DEBUG_FRAME = org.apache.maven.surefire.junitcore.JUnitCoreWrapper.execute(JUnitCoreWrapper.java:83)
	DEBUG_FRAME = org.apache.maven.surefire.junitcore.JUnitCoreWrapper.execute(JUnitCoreWrapper.java:75)
	DEBUG_FRAME = org.apache.maven.surefire.junitcore.JUnitCoreProvider.invoke(JUnitCoreProvider.java:157)
	DEBUG_FRAME = org.apache.maven.surefire.booter.ForkedBooter.invokeProviderInSameClassLoader(ForkedBooter.java:386)
	DEBUG_FRAME = org.apache.maven.surefire.booter.ForkedBooter.runSuitesInProcess(ForkedBooter.java:323)
	DEBUG_FRAME = org.apache.maven.surefire.booter.ForkedBooter.main(ForkedBooter.java:143)

10:31:50,278 DEBUG [main] AxisOperation:485 - Entry: AxisOperation::getInputAction
10:31:50,278 DEBUG [main] AxisOperation:490 - Debug: AxisOperation::getInputAction - using soapAction
10:31:50,279 DEBUG [main] AxisOperation:506 - Exit: AxisOperation::getInputAction urn:listAllConfigurationsForATypeAsCSV
10:31:50,279 DEBUG [main] AxisService:872 - mapActionToOperation: Mapping Action to Operation: action: urn:listAllConfigurationsForATypeAsCSV; operation: org.apache.axis2.description.OutInAxisOperation@7b28d8fanamed: {http://ws.configurations.tm.gazelle.ihe.net/}listAllConfigurationsForATypeAsCSV
10:31:50,279 DEBUG [main] AxisService:878 - DEBUG_FRAME = org.apache.axis2.util.JavaUtils.callStackToString(JavaUtils.java:564)
	DEBUG_FRAME = org.apache.axis2.description.AxisService.mapActionToOperation(AxisService.java:878)
	DEBUG_FRAME = org.apache.axis2.description.AxisService.addOperation(AxisService.java:728)
	DEBUG_FRAME = net.ihe.gazelle.ws.client.GazelleProxyWebServiceNameStub.populateAxisService(GazelleProxyWebServiceNameStub.java:160)
	DEBUG_FRAME = net.ihe.gazelle.ws.client.GazelleProxyWebServiceNameStub.<init>(GazelleProxyWebServiceNameStub.java:40)
	DEBUG_FRAME = net.ihe.gazelle.ws.client.GazelleProxyWebServiceNameStub.<init>(GazelleProxyWebServiceNameStub.java:29)
	DEBUG_FRAME = net.ihe.gazelle.ws.client.GazelleProxyWebServiceNameStub.<init>(GazelleProxyWebServiceNameStub.java:75)
	DEBUG_FRAME = net.ihe.gazelle.wstester.util.WsClient.listConfigurationsBySystemBySessionByTypeAsCSV(WsClient.java:36)
	DEBUG_FRAME = net.ihe.gazelle.wstester.action.RunInstanceAction.getEndPointBySystem(RunInstanceAction.java:709)
	DEBUG_FRAME = net.ihe.gazelle.wstester.action.RunInstanceActionTest2.getEndPointBySystemOK(RunInstanceActionTest2.java:61)
	DEBUG_FRAME = sun.reflect.NativeMethodAccessorImpl.invoke0(Native Method)
	DEBUG_FRAME = sun.reflect.NativeMethodAccessorImpl.invoke(NativeMethodAccessorImpl.java:62)
	DEBUG_FRAME = sun.reflect.DelegatingMethodAccessorImpl.invoke(DelegatingMethodAccessorImpl.java:43)
	DEBUG_FRAME = java.lang.reflect.Method.invoke(Method.java:498)
	DEBUG_FRAME = org.junit.internal.runners.TestMethod.invoke(TestMethod.java:66)
	DEBUG_FRAME = org.powermock.modules.junit4.internal.impl.PowerMockJUnit44RunnerDelegateImpl$PowerMockJUnit44MethodRunner.runTestMethod(PowerMockJUnit44RunnerDelegateImpl.java:310)
	DEBUG_FRAME = org.junit.internal.runners.MethodRoadie$2.run(MethodRoadie.java:86)
	DEBUG_FRAME = org.junit.internal.runners.MethodRoadie.runBeforesThenTestThenAfters(MethodRoadie.java:94)
	DEBUG_FRAME = org.powermock.modules.junit4.internal.impl.PowerMockJUnit44RunnerDelegateImpl$PowerMockJUnit44MethodRunner.executeTest(PowerMockJUnit44RunnerDelegateImpl.java:294)
	DEBUG_FRAME = org.powermock.modules.junit4.internal.impl.PowerMockJUnit47RunnerDelegateImpl$PowerMockJUnit47MethodRunner.executeTestInSuper(PowerMockJUnit47RunnerDelegateImpl.java:127)
	DEBUG_FRAME = org.powermock.modules.junit4.internal.impl.PowerMockJUnit47RunnerDelegateImpl$PowerMockJUnit47MethodRunner.executeTest(PowerMockJUnit47RunnerDelegateImpl.java:82)
	DEBUG_FRAME = org.powermock.modules.junit4.internal.impl.PowerMockJUnit44RunnerDelegateImpl$PowerMockJUnit44MethodRunner.runBeforesThenTestThenAfters(PowerMockJUnit44RunnerDelegateImpl.java:282)
	DEBUG_FRAME = org.junit.internal.runners.MethodRoadie.runTest(MethodRoadie.java:84)
	DEBUG_FRAME = org.junit.internal.runners.MethodRoadie.run(MethodRoadie.java:49)
	DEBUG_FRAME = org.powermock.modules.junit4.internal.impl.PowerMockJUnit44RunnerDelegateImpl.invokeTestMethod(PowerMockJUnit44RunnerDelegateImpl.java:207)
	DEBUG_FRAME = org.powermock.modules.junit4.internal.impl.PowerMockJUnit44RunnerDelegateImpl.runMethods(PowerMockJUnit44RunnerDelegateImpl.java:146)
	DEBUG_FRAME = org.powermock.modules.junit4.internal.impl.PowerMockJUnit44RunnerDelegateImpl$1.run(PowerMockJUnit44RunnerDelegateImpl.java:120)
	DEBUG_FRAME = org.junit.internal.runners.ClassRoadie.runUnprotected(ClassRoadie.java:34)
	DEBUG_FRAME = org.junit.internal.runners.ClassRoadie.runProtected(ClassRoadie.java:44)
	DEBUG_FRAME = org.powermock.modules.junit4.internal.impl.PowerMockJUnit44RunnerDelegateImpl.run(PowerMockJUnit44RunnerDelegateImpl.java:118)
	DEBUG_FRAME = org.powermock.modules.junit4.common.internal.impl.JUnit4TestSuiteChunkerImpl.run(JUnit4TestSuiteChunkerImpl.java:101)
	DEBUG_FRAME = org.powermock.modules.junit4.common.internal.impl.AbstractCommonPowerMockRunner.run(AbstractCommonPowerMockRunner.java:53)
	DEBUG_FRAME = org.powermock.modules.junit4.PowerMockRunner.run(PowerMockRunner.java:53)
	DEBUG_FRAME = org.junit.runners.Suite.runChild(Suite.java:128)
	DEBUG_FRAME = org.junit.runners.Suite.runChild(Suite.java:24)
	DEBUG_FRAME = org.junit.runners.ParentRunner$3.run(ParentRunner.java:193)
	DEBUG_FRAME = org.junit.runners.ParentRunner$1.schedule(ParentRunner.java:52)
	DEBUG_FRAME = org.junit.runners.ParentRunner.runChildren(ParentRunner.java:191)
	DEBUG_FRAME = org.junit.runners.ParentRunner.access$000(ParentRunner.java:42)
	DEBUG_FRAME = org.junit.runners.ParentRunner$2.evaluate(ParentRunner.java:184)
	DEBUG_FRAME = org.junit.runners.ParentRunner.run(ParentRunner.java:236)
	DEBUG_FRAME = org.junit.runners.Suite.runChild(Suite.java:128)
	DEBUG_FRAME = org.junit.runners.Suite.runChild(Suite.java:24)
	DEBUG_FRAME = org.junit.runners.ParentRunner$3.run(ParentRunner.java:193)
	DEBUG_FRAME = org.junit.runners.ParentRunner$1.schedule(ParentRunner.java:52)
	DEBUG_FRAME = org.junit.runners.ParentRunner.runChildren(ParentRunner.java:191)
	DEBUG_FRAME = org.junit.runners.ParentRunner.access$000(ParentRunner.java:42)
	DEBUG_FRAME = org.junit.runners.ParentRunner$2.evaluate(ParentRunner.java:184)
	DEBUG_FRAME = org.junit.runners.ParentRunner.run(ParentRunner.java:236)
	DEBUG_FRAME = org.apache.maven.surefire.junitcore.JUnitCore.run(JUnitCore.java:55)
	DEBUG_FRAME = org.apache.maven.surefire.junitcore.JUnitCoreWrapper.createRequestAndRun(JUnitCoreWrapper.java:137)
	DEBUG_FRAME = org.apache.maven.surefire.junitcore.JUnitCoreWrapper.executeEager(JUnitCoreWrapper.java:107)
	DEBUG_FRAME = org.apache.maven.surefire.junitcore.JUnitCoreWrapper.execute(JUnitCoreWrapper.java:83)
	DEBUG_FRAME = org.apache.maven.surefire.junitcore.JUnitCoreWrapper.execute(JUnitCoreWrapper.java:75)
	DEBUG_FRAME = org.apache.maven.surefire.junitcore.JUnitCoreProvider.invoke(JUnitCoreProvider.java:157)
	DEBUG_FRAME = org.apache.maven.surefire.booter.ForkedBooter.invokeProviderInSameClassLoader(ForkedBooter.java:386)
	DEBUG_FRAME = org.apache.maven.surefire.booter.ForkedBooter.runSuitesInProcess(ForkedBooter.java:323)
	DEBUG_FRAME = org.apache.maven.surefire.booter.ForkedBooter.main(ForkedBooter.java:143)

10:31:50,279 DEBUG [main] Loader:132 - Trying to find [org/apache/axis2/deployment/axis2_default.xml] using org.powermock.core.classloader.MockClassLoader@62f4ff3b class loader.
10:31:50,280 DEBUG [main] StAXUtils:210 - XMLStreamReader is org.apache.axiom.util.stax.dialect.Woodstox4StreamReaderWrapper
10:31:50,290 DEBUG [main] AxiomContainerSupport:172 - Builder is already complete.
10:31:50,291 DEBUG [main] Phase:98 - Handler RequestURIBasedDispatcher added to Phase Transport
10:31:50,292 DEBUG [main] Phase:98 - Handler SOAPActionBasedDispatcher added to Phase Transport
10:31:50,292 DEBUG [main] Phase:98 - Handler AddressingBasedDispatcher added to Phase Addressing
10:31:50,292 DEBUG [main] Phase:98 - Handler RequestURIBasedDispatcher added to Phase Dispatch
10:31:50,292 DEBUG [main] Phase:98 - Handler SOAPActionBasedDispatcher added to Phase Dispatch
10:31:50,292 DEBUG [main] Phase:98 - Handler RequestURIOperationDispatcher added to Phase Dispatch
10:31:50,293 DEBUG [main] Phase:98 - Handler SOAPMessageBodyBasedDispatcher added to Phase Dispatch
10:31:50,293 DEBUG [main] Phase:98 - Handler HTTPLocationBasedDispatcher added to Phase Dispatch
10:31:50,293 DEBUG [main] Phase:98 - Handler RequestURIBasedDispatcher added to Phase Transport
10:31:50,294 DEBUG [main] Phase:98 - Handler SOAPActionBasedDispatcher added to Phase Transport
10:31:50,294 DEBUG [main] Phase:98 - Handler AddressingBasedDispatcher added to Phase Addressing
10:31:50,294 DEBUG [main] Phase:98 - Handler RequestURIBasedDispatcher added to Phase Dispatch
10:31:50,294 DEBUG [main] Phase:98 - Handler SOAPActionBasedDispatcher added to Phase Dispatch
10:31:50,294 DEBUG [main] Phase:98 - Handler RequestURIOperationDispatcher added to Phase Dispatch
10:31:50,294 DEBUG [main] Phase:98 - Handler SOAPMessageBodyBasedDispatcher added to Phase Dispatch
10:31:50,295 DEBUG [main] Phase:98 - Handler HTTPLocationBasedDispatcher added to Phase Dispatch
10:31:50,296 DEBUG [main] Loader:256 - java.lang.ClassNotFoundException: org.apache.axis2.jaxws.framework.JAXWSServiceBuilderExtension
10:31:50,296  WARN [main] AxisConfigBuilder:442 - Unable to instantiate deployer org.apache.axis2.deployment.ServiceDeployer; see debug logs for more details
10:31:50,296 DEBUG [main] AxisConfigBuilder:444 - org.apache.axis2.jaxws.framework.JAXWSServiceBuilderExtension
java.lang.ClassNotFoundException: org.apache.axis2.jaxws.framework.JAXWSServiceBuilderExtension
	at java.net.URLClassLoader.findClass(URLClassLoader.java:382)
	at java.lang.ClassLoader.loadClass(ClassLoader.java:424)
	at sun.misc.Launcher$AppClassLoader.loadClass(Launcher.java:349)
	at java.lang.ClassLoader.loadClass(ClassLoader.java:357)
	at org.powermock.core.classloader.MockClassLoader.loadModifiedClass(MockClassLoader.java:145)
	at org.powermock.core.classloader.DeferSupportingClassLoader.loadClass(DeferSupportingClassLoader.java:67)
	at java.lang.ClassLoader.loadClass(ClassLoader.java:357)
	at java.lang.Class.forName0(Native Method)
	at java.lang.Class.forName(Class.java:264)
	at org.apache.axis2.util.Loader.loadClass(Loader.java:261)
	at org.apache.axis2.deployment.AxisConfigBuilder.processDeployers(AxisConfigBuilder.java:434)
	at org.apache.axis2.deployment.AxisConfigBuilder.populateConfig(AxisConfigBuilder.java:275)
	at org.apache.axis2.deployment.DeploymentEngine.populateAxisConfiguration(DeploymentEngine.java:629)
	at org.apache.axis2.deployment.FileSystemConfigurator.getAxisConfiguration(FileSystemConfigurator.java:116)
	at org.apache.axis2.context.ConfigurationContextFactory.createConfigurationContext(ConfigurationContextFactory.java:64)
	at org.apache.axis2.context.ConfigurationContextFactory.createConfigurationContextFromFileSystem(ConfigurationContextFactory.java:210)
	at org.apache.axis2.client.ServiceClient.configureServiceClient(ServiceClient.java:150)
	at org.apache.axis2.client.ServiceClient.<init>(ServiceClient.java:143)
	at net.ihe.gazelle.ws.client.GazelleProxyWebServiceNameStub.<init>(GazelleProxyWebServiceNameStub.java:43)
	at net.ihe.gazelle.ws.client.GazelleProxyWebServiceNameStub.<init>(GazelleProxyWebServiceNameStub.java:29)
	at net.ihe.gazelle.ws.client.GazelleProxyWebServiceNameStub.<init>(GazelleProxyWebServiceNameStub.java:75)
	at net.ihe.gazelle.wstester.util.WsClient.listConfigurationsBySystemBySessionByTypeAsCSV(WsClient.java:36)
	at net.ihe.gazelle.wstester.action.RunInstanceAction.getEndPointBySystem(RunInstanceAction.java:709)
	at net.ihe.gazelle.wstester.action.RunInstanceActionTest2.getEndPointBySystemOK(RunInstanceActionTest2.java:61)
	at sun.reflect.NativeMethodAccessorImpl.invoke0(Native Method)
	at sun.reflect.NativeMethodAccessorImpl.invoke(NativeMethodAccessorImpl.java:62)
	at sun.reflect.DelegatingMethodAccessorImpl.invoke(DelegatingMethodAccessorImpl.java:43)
	at java.lang.reflect.Method.invoke(Method.java:498)
	at org.junit.internal.runners.TestMethod.invoke(TestMethod.java:66)
	at org.powermock.modules.junit4.internal.impl.PowerMockJUnit44RunnerDelegateImpl$PowerMockJUnit44MethodRunner.runTestMethod(PowerMockJUnit44RunnerDelegateImpl.java:310)
	at org.junit.internal.runners.MethodRoadie$2.run(MethodRoadie.java:86)
	at org.junit.internal.runners.MethodRoadie.runBeforesThenTestThenAfters(MethodRoadie.java:94)
	at org.powermock.modules.junit4.internal.impl.PowerMockJUnit44RunnerDelegateImpl$PowerMockJUnit44MethodRunner.executeTest(PowerMockJUnit44RunnerDelegateImpl.java:294)
	at org.powermock.modules.junit4.internal.impl.PowerMockJUnit47RunnerDelegateImpl$PowerMockJUnit47MethodRunner.executeTestInSuper(PowerMockJUnit47RunnerDelegateImpl.java:127)
	at org.powermock.modules.junit4.internal.impl.PowerMockJUnit47RunnerDelegateImpl$PowerMockJUnit47MethodRunner.executeTest(PowerMockJUnit47RunnerDelegateImpl.java:82)
	at org.powermock.modules.junit4.internal.impl.PowerMockJUnit44RunnerDelegateImpl$PowerMockJUnit44MethodRunner.runBeforesThenTestThenAfters(PowerMockJUnit44RunnerDelegateImpl.java:282)
	at org.junit.internal.runners.MethodRoadie.runTest(MethodRoadie.java:84)
	at org.junit.internal.runners.MethodRoadie.run(MethodRoadie.java:49)
	at org.powermock.modules.junit4.internal.impl.PowerMockJUnit44RunnerDelegateImpl.invokeTestMethod(PowerMockJUnit44RunnerDelegateImpl.java:207)
	at org.powermock.modules.junit4.internal.impl.PowerMockJUnit44RunnerDelegateImpl.runMethods(PowerMockJUnit44RunnerDelegateImpl.java:146)
	at org.powermock.modules.junit4.internal.impl.PowerMockJUnit44RunnerDelegateImpl$1.run(PowerMockJUnit44RunnerDelegateImpl.java:120)
	at org.junit.internal.runners.ClassRoadie.runUnprotected(ClassRoadie.java:34)
	at org.junit.internal.runners.ClassRoadie.runProtected(ClassRoadie.java:44)
	at org.powermock.modules.junit4.internal.impl.PowerMockJUnit44RunnerDelegateImpl.run(PowerMockJUnit44RunnerDelegateImpl.java:118)
	at org.powermock.modules.junit4.common.internal.impl.JUnit4TestSuiteChunkerImpl.run(JUnit4TestSuiteChunkerImpl.java:101)
	at org.powermock.modules.junit4.common.internal.impl.AbstractCommonPowerMockRunner.run(AbstractCommonPowerMockRunner.java:53)
	at org.powermock.modules.junit4.PowerMockRunner.run(PowerMockRunner.java:53)
	at org.junit.runners.Suite.runChild(Suite.java:128)
	at org.junit.runners.Suite.runChild(Suite.java:24)
	at org.junit.runners.ParentRunner$3.run(ParentRunner.java:193)
	at org.junit.runners.ParentRunner$1.schedule(ParentRunner.java:52)
	at org.junit.runners.ParentRunner.runChildren(ParentRunner.java:191)
	at org.junit.runners.ParentRunner.access$000(ParentRunner.java:42)
	at org.junit.runners.ParentRunner$2.evaluate(ParentRunner.java:184)
	at org.junit.runners.ParentRunner.run(ParentRunner.java:236)
	at org.junit.runners.Suite.runChild(Suite.java:128)
	at org.junit.runners.Suite.runChild(Suite.java:24)
	at org.junit.runners.ParentRunner$3.run(ParentRunner.java:193)
	at org.junit.runners.ParentRunner$1.schedule(ParentRunner.java:52)
	at org.junit.runners.ParentRunner.runChildren(ParentRunner.java:191)
	at org.junit.runners.ParentRunner.access$000(ParentRunner.java:42)
	at org.junit.runners.ParentRunner$2.evaluate(ParentRunner.java:184)
	at org.junit.runners.ParentRunner.run(ParentRunner.java:236)
	at org.apache.maven.surefire.junitcore.JUnitCore.run(JUnitCore.java:55)
	at org.apache.maven.surefire.junitcore.JUnitCoreWrapper.createRequestAndRun(JUnitCoreWrapper.java:137)
	at org.apache.maven.surefire.junitcore.JUnitCoreWrapper.executeEager(JUnitCoreWrapper.java:107)
	at org.apache.maven.surefire.junitcore.JUnitCoreWrapper.execute(JUnitCoreWrapper.java:83)
	at org.apache.maven.surefire.junitcore.JUnitCoreWrapper.execute(JUnitCoreWrapper.java:75)
	at org.apache.maven.surefire.junitcore.JUnitCoreProvider.invoke(JUnitCoreProvider.java:157)
	at org.apache.maven.surefire.booter.ForkedBooter.invokeProviderInSameClassLoader(ForkedBooter.java:386)
	at org.apache.maven.surefire.booter.ForkedBooter.runSuitesInProcess(ForkedBooter.java:323)
	at org.apache.maven.surefire.booter.ForkedBooter.main(ForkedBooter.java:143)
10:31:50,299 DEBUG [main] AxisConfiguration:486 - Adding service to allServices map: [GazelleProxyWebServiceName1570609910261_2] 
10:31:50,299 DEBUG [main] AxisOperation:567 - AxisOperation::getSoapAction urn:anonRobustOp
10:31:50,299 DEBUG [main] AxisOperation:567 - AxisOperation::getSoapAction urn:anonOutonlyOp
10:31:50,299 DEBUG [main] AxisOperation:567 - AxisOperation::getSoapAction urn:getListOIDBySystemByRequirementAsCSV
10:31:50,299 DEBUG [main] AxisOperation:567 - AxisOperation::getSoapAction urn:anonOutInOp
10:31:50,299 DEBUG [main] AxisOperation:567 - AxisOperation::getSoapAction urn:listAllConfigurationsForAnActorAnInstitutionAndATypeAsCSV
10:31:50,300 DEBUG [main] AxisOperation:567 - AxisOperation::getSoapAction urn:listConfigurationsBySystemBySessionByTypeAsCSV
10:31:50,300 DEBUG [main] AxisOperation:567 - AxisOperation::getSoapAction urn:listAllConfigurationsForAnActorAndTypeAsCSV
10:31:50,300 DEBUG [main] AxisOperation:567 - AxisOperation::getSoapAction urn:listAllConfigurationsForAnInstitutionAndATypeAsCSV
10:31:50,300 DEBUG [main] AxisOperation:567 - AxisOperation::getSoapAction urn:getOIDBySystemByRequirement
10:31:50,300 DEBUG [main] AxisOperation:567 - AxisOperation::getSoapAction urn:listAllConfigurationsForATypeAsCSV
10:31:50,300 DEBUG [main] AxisOperation:567 - AxisOperation::getSoapAction urn:anonRobustOp
10:31:50,300 DEBUG [main] AxisOperation:567 - AxisOperation::getSoapAction urn:anonOutonlyOp
10:31:50,300 DEBUG [main] AxisOperation:567 - AxisOperation::getSoapAction urn:getListOIDBySystemByRequirementAsCSV
10:31:50,300 DEBUG [main] AxisOperation:567 - AxisOperation::getSoapAction urn:anonOutInOp
10:31:50,301 DEBUG [main] AxisOperation:567 - AxisOperation::getSoapAction urn:listAllConfigurationsForAnActorAnInstitutionAndATypeAsCSV
10:31:50,301 DEBUG [main] AxisOperation:567 - AxisOperation::getSoapAction urn:listConfigurationsBySystemBySessionByTypeAsCSV
10:31:50,301 DEBUG [main] AxisOperation:567 - AxisOperation::getSoapAction urn:listAllConfigurationsForAnActorAndTypeAsCSV
10:31:50,301 DEBUG [main] AxisOperation:567 - AxisOperation::getSoapAction urn:listAllConfigurationsForAnInstitutionAndATypeAsCSV
10:31:50,301 DEBUG [main] AxisOperation:567 - AxisOperation::getSoapAction urn:getOIDBySystemByRequirement
10:31:50,301 DEBUG [main] AxisOperation:567 - AxisOperation::getSoapAction urn:listAllConfigurationsForATypeAsCSV
10:31:50,301 DEBUG [main] AxisConfiguration:396 - Adding service to allEndpoints map: (GazelleProxyWebServiceName1570609910261_2,GazelleProxyWebServiceName1570609910261_2HttpSoap11Endpoint) 
10:31:50,301 DEBUG [main] AxisConfiguration:396 - Adding service to allEndpoints map: (GazelleProxyWebServiceName1570609910261_2,GazelleProxyWebServiceName1570609910261_2HttpSoap12Endpoint) 
10:31:50,302 DEBUG [main] AxisConfiguration:396 - Adding service to allEndpoints map: (GazelleProxyWebServiceName1570609910261_2,GazelleProxyWebServiceName1570609910261_2HttpEndpoint) 
10:31:50,302 DEBUG [main] AxisConfiguration:403 - After adding to allEndpoints map, size is 3
10:31:50,302 DEBUG [main] AxisService:1971 - Get operation for {http://ws.configurations.tm.gazelle.ihe.net/}listConfigurationsBySystemBySessionByTypeAsCSV
10:31:50,302 DEBUG [main] AxisService:2014 - Found axis operation:  org.apache.axis2.description.OutInAxisOperation@2ec326
10:31:50,302 DEBUG [main] Options:589 - setAction Old action is (null)
10:31:50,302 DEBUG [main] Options:590 - setAction New action is (http://ws.configurations.tm.gazelle.ihe.net/GazelleProxyWebService/listConfigurationsBySystemBySessionByTypeAsCSV)
10:31:50,302 DEBUG [main] ConfigurationContext:85 - registerOperationContext (false): org.apache.axis2.context.OperationContext@4ea8b6f9 with key: urn:uuid:fd8b317d-bd36-4895-ac54-46091ea2034d
10:31:50,302 DEBUG [main] OutInAxisOperationClient:164 - Entry: OutInAxisOperationClient::execute, true
10:31:50,303 DEBUG [main] Options:246 - getAction (null) from org.apache.axis2.client.Options@113368af
10:31:50,303 DEBUG [main] MessageContext:1119 - SoapAction is (null)
10:31:50,303 DEBUG [main] Options:246 - getAction (http://ws.configurations.tm.gazelle.ihe.net/GazelleProxyWebService/listConfigurationsBySystemBySessionByTypeAsCSV) from org.apache.axis2.client.Options@64d057ab
10:31:50,303 DEBUG [main] Options:246 - getAction (null) from org.apache.axis2.client.Options@113368af
10:31:50,303 DEBUG [main] MessageContext:1524 - Old SoapAction is (null)
10:31:50,303 DEBUG [main] MessageContext:1525 - New SoapAction is (http://ws.configurations.tm.gazelle.ihe.net/GazelleProxyWebService/listConfigurationsBySystemBySessionByTypeAsCSV)
10:31:50,303 DEBUG [main] Options:589 - setAction Old action is (null)
10:31:50,303 DEBUG [main] Options:590 - setAction New action is (http://ws.configurations.tm.gazelle.ihe.net/GazelleProxyWebService/listConfigurationsBySystemBySessionByTypeAsCSV)
10:31:50,303 DEBUG [main] OutInAxisOperationClient:194 - OutInAxisOperationClient: useAsyncOption null
10:31:50,304 DEBUG [main] ConfigurationContext:85 - registerOperationContext (false): org.apache.axis2.context.OperationContext@4ea8b6f9 with key: urn:uuid:fd8b317d-bd36-4895-ac54-46091ea2034d
10:31:50,304 DEBUG [main] Options:246 - getAction (http://ws.configurations.tm.gazelle.ihe.net/GazelleProxyWebService/listConfigurationsBySystemBySessionByTypeAsCSV) from org.apache.axis2.client.Options@113368af
10:31:50,304 DEBUG [main] MessageContext:1154 - WASAction is (http://ws.configurations.tm.gazelle.ihe.net/GazelleProxyWebService/listConfigurationsBySystemBySessionByTypeAsCSV)
10:31:50,304 DEBUG [main] ConfigurationContext:85 - msgContext: [MessageContext: logID=6ad825994c2bd407e3cbf41d8064164d581e31d241d5bc0e] action: http://ws.configurations.tm.gazelle.ihe.net/GazelleProxyWebService/listConfigurationsBySystemBySessionByTypeAsCSV
10:31:50,304 DEBUG [main] Phase:289 - [MessageContext: logID=6ad825994c2bd407e3cbf41d8064164d581e31d241d5bc0e] Checking pre-condition for Phase "RMPhase"
10:31:50,304 DEBUG [main] Phase:300 - [MessageContext: logID=6ad825994c2bd407e3cbf41d8064164d581e31d241d5bc0e] Invoking phase "RMPhase"
10:31:50,304 DEBUG [main] Phase:319 - [MessageContext: logID=6ad825994c2bd407e3cbf41d8064164d581e31d241d5bc0e] Checking post-conditions for phase "RMPhase"
10:31:50,304 DEBUG [main] Phase:289 - [MessageContext: logID=6ad825994c2bd407e3cbf41d8064164d581e31d241d5bc0e] Checking pre-condition for Phase "OpPhase"
10:31:50,304 DEBUG [main] Phase:300 - [MessageContext: logID=6ad825994c2bd407e3cbf41d8064164d581e31d241d5bc0e] Invoking phase "OpPhase"
10:31:50,304 DEBUG [main] Phase:319 - [MessageContext: logID=6ad825994c2bd407e3cbf41d8064164d581e31d241d5bc0e] Checking post-conditions for phase "OpPhase"
10:31:50,305 DEBUG [main] Phase:289 - [MessageContext: logID=6ad825994c2bd407e3cbf41d8064164d581e31d241d5bc0e] Checking pre-condition for Phase "OperationOutPhase"
10:31:50,305 DEBUG [main] Phase:300 - [MessageContext: logID=6ad825994c2bd407e3cbf41d8064164d581e31d241d5bc0e] Invoking phase "OperationOutPhase"
10:31:50,305 DEBUG [main] Phase:319 - [MessageContext: logID=6ad825994c2bd407e3cbf41d8064164d581e31d241d5bc0e] Checking post-conditions for phase "OperationOutPhase"
10:31:50,305 DEBUG [main] Phase:289 - [MessageContext: logID=6ad825994c2bd407e3cbf41d8064164d581e31d241d5bc0e] Checking pre-condition for Phase "PolicyDetermination"
10:31:50,305 DEBUG [main] Phase:300 - [MessageContext: logID=6ad825994c2bd407e3cbf41d8064164d581e31d241d5bc0e] Invoking phase "PolicyDetermination"
10:31:50,305 DEBUG [main] Phase:319 - [MessageContext: logID=6ad825994c2bd407e3cbf41d8064164d581e31d241d5bc0e] Checking post-conditions for phase "PolicyDetermination"
10:31:50,305 DEBUG [main] Phase:289 - [MessageContext: logID=6ad825994c2bd407e3cbf41d8064164d581e31d241d5bc0e] Checking pre-condition for Phase "MessageOut"
10:31:50,305 DEBUG [main] Phase:300 - [MessageContext: logID=6ad825994c2bd407e3cbf41d8064164d581e31d241d5bc0e] Invoking phase "MessageOut"
10:31:50,305 DEBUG [main] Phase:319 - [MessageContext: logID=6ad825994c2bd407e3cbf41d8064164d581e31d241d5bc0e] Checking post-conditions for phase "MessageOut"
10:31:50,305 DEBUG [main] Phase:289 - [MessageContext: logID=6ad825994c2bd407e3cbf41d8064164d581e31d241d5bc0e] Checking pre-condition for Phase "Security"
10:31:50,305 DEBUG [main] Phase:300 - [MessageContext: logID=6ad825994c2bd407e3cbf41d8064164d581e31d241d5bc0e] Invoking phase "Security"
10:31:50,306 DEBUG [main] Phase:319 - [MessageContext: logID=6ad825994c2bd407e3cbf41d8064164d581e31d241d5bc0e] Checking post-conditions for phase "Security"
10:31:50,306 DEBUG [main] DefaultHttpParams:151 - Set parameter http.connection-manager.timeout = 30000
10:31:50,306 DEBUG [main] DefaultHttpParams:151 - Set parameter http.connection.timeout = 60000
10:31:50,306 DEBUG [main] DefaultHttpParams:151 - Set parameter http.socket.timeout = 60000
10:31:50,306 DEBUG [main] DefaultHttpParams:151 - Set parameter http.socket.timeout = 60000
10:31:50,306 DEBUG [main] OMOutputFormat:196 - Start getContentType: OMOutputFormat [ mimeBoundary =null rootContentId=null doOptimize=false doingSWA=false isSOAP11=true charSetEncoding=UTF-8 xmlVersion=null contentType=null ignoreXmlDeclaration=false autoCloseWriter=false actionProperty=null optimizedThreshold=0]
10:31:50,306 DEBUG [main] OMOutputFormat:215 - getContentType= {text/xml}   OMOutputFormat [ mimeBoundary =null rootContentId=null doOptimize=false doingSWA=false isSOAP11=true charSetEncoding=UTF-8 xmlVersion=null contentType=text/xml ignoreXmlDeclaration=false autoCloseWriter=false actionProperty=null optimizedThreshold=0]
10:31:50,306 DEBUG [main] SOAPMessageFormatter:123 - contentType from the OMOutputFormat =text/xml
10:31:50,306 DEBUG [main] SOAPMessageFormatter:148 - contentType returned =text/xml; charset=UTF-8
10:31:50,307 DEBUG [main] DefaultHttpParams:151 - Set parameter http.connection.timeout = 60000
10:31:50,307 DEBUG [main] DefaultHttpParams:151 - Set parameter http.socket.timeout = 60000
10:31:50,307 DEBUG [main] MultiThreadedHttpConnectionManager:412 - HttpConnectionManager.getConnection:  config = HostConfiguration[host=https://ehealthsuisse.ihe-europe.net], timeout = 30000
10:31:50,307 DEBUG [main] MultiThreadedHttpConnectionManager:760 - Allocating new connection, hostConfig=HostConfiguration[host=https://ehealthsuisse.ihe-europe.net]
10:31:50,307 DEBUG [main] HttpConnection:692 - Open connection to ehealthsuisse.ihe-europe.net:443
10:31:50,310 DEBUG [main] header:70 - >> "POST /gazelle-tm-ejb/GazelleProxyWebServiceName/GazelleProxyWebService HTTP/1.1[\r][\n]"
10:31:50,310 DEBUG [main] HttpMethodBase:1352 - Adding Host request header
10:31:50,310 DEBUG [main] header:70 - >> "Content-Type: text/xml; charset=UTF-8[\r][\n]"
10:31:50,310 DEBUG [main] header:70 - >> "SOAPAction: ""[\r][\n]"
10:31:50,310 DEBUG [main] header:70 - >> "User-Agent: Axis2[\r][\n]"
10:31:50,310 DEBUG [main] header:70 - >> "Host: ehealthsuisse.ihe-europe.net[\r][\n]"
10:31:50,310 DEBUG [main] header:70 - >> "Transfer-Encoding: chunked[\r][\n]"
10:31:50,311 DEBUG [main] header:70 - >> "[\r][\n]"
10:31:50,311 DEBUG [main] SOAPMessageFormatter:51 - start writeTo()
10:31:50,311 DEBUG [main] SOAPMessageFormatter:52 -   preserve=false
10:31:50,311 DEBUG [main] SOAPMessageFormatter:53 -   isOptimized=false
10:31:50,311 DEBUG [main] SOAPMessageFormatter:54 -   isDoingSWA=false
10:31:50,311 DEBUG [main] MTOMXMLStreamWriter:130 - Creating MTOMXMLStreamWriter
10:31:50,311 DEBUG [main] MTOMXMLStreamWriter:131 - OutputStream =class org.apache.commons.httpclient.ChunkedOutputStream
10:31:50,311 DEBUG [main] MTOMXMLStreamWriter:132 - OMFormat = OMOutputFormat [ mimeBoundary =null rootContentId=null doOptimize=false doingSWA=false isSOAP11=true charSetEncoding=UTF-8 xmlVersion=null contentType=text/xml ignoreXmlDeclaration=false autoCloseWriter=false actionProperty=null optimizedThreshold=0]
10:31:50,311 DEBUG [main] MTOMXMLStreamWriter:133 - preserveAttachments = false
10:31:50,312 DEBUG [main] StAXUtils:344 - XMLStreamWriter is org.apache.axiom.util.stax.dialect.Woodstox4StreamWriterWrapper
10:31:50,312 DEBUG [main] MTOMXMLStreamWriter:230 - Calling MTOMXMLStreamWriter.flush
10:31:50,325 DEBUG [main] SOAPEnvelopeImpl:180 - Could not close builder or parser due to:
10:31:50,325 DEBUG [main] SOAPEnvelopeImpl:182 - builder is null
10:31:50,325 DEBUG [main] MTOMXMLStreamWriter:219 - close
10:31:50,326 DEBUG [main] MTOMXMLStreamWriter:230 - Calling MTOMXMLStreamWriter.flush
10:31:50,326 DEBUG [main] SOAPMessageFormatter:81 - end writeTo()
10:31:50,326 DEBUG [main] content:70 - >> "1ee[\r][\n]"
10:31:50,326 DEBUG [main] content:84 - >> "<?xml version='1.0' encoding='UTF-8'?><soapenv:Envelope xmlns:soapenv="http://schemas.xmlsoap.org/soap/envelope/"><soapenv:Header/><soapenv:Body><ns1:listConfigurationsBySystemBySessionByTypeAsCSV xmlns:ns1="http://ws.configurations.tm.gazelle.ihe.net/"><systemKeyword>Core Community Component_Post_0</systemKeyword><testingSessionId>1</testingSessionId><configurationType>HL7V3Responder</configurationType></ns1:listConfigurationsBySystemBySessionByTypeAsCSV></soapenv:Body></soapenv:Envelope>"
10:31:50,326 DEBUG [main] content:70 - >> "[\r][\n]"
10:31:50,326 DEBUG [main] content:84 - >> "0"
10:31:50,326 DEBUG [main] content:70 - >> "[\r][\n]"
10:31:50,326 DEBUG [main] content:70 - >> "[\r][\n]"
10:31:50,327 DEBUG [main] EntityEnclosingMethod:508 - Request body sent
10:31:50,366 DEBUG [main] header:70 - << "HTTP/1.1 200 OK[\r][\n]"
10:31:50,366 DEBUG [main] header:70 - << "HTTP/1.1 200 OK[\r][\n]"
10:31:50,366 DEBUG [main] header:70 - << "Date: Wed, 09 Oct 2019 08:31:50 GMT[\r][\n]"
10:31:50,367 DEBUG [main] header:70 - << "Server: Apache[\r][\n]"
10:31:50,367 DEBUG [main] header:70 - << "Strict-Transport-Security: max-age=63072000; includeSubdomains;[\r][\n]"
10:31:50,367 DEBUG [main] header:70 - << "Content-Type: text/xml;charset=UTF-8[\r][\n]"
10:31:50,367 DEBUG [main] header:70 - << "Content-Length: 645[\r][\n]"
10:31:50,368 DEBUG [main] header:70 - << "Vary: Accept-Encoding[\r][\n]"
10:31:50,368 DEBUG [main] header:70 - << "[\r][\n]"
10:31:50,368 DEBUG [main] Phase:340 - [MessageContext: logID=6ad825994c2bd407e3cbf41d8064164d581e31d241d5bc0e] Invoking flowComplete() in Phase "Security"
10:31:50,368 DEBUG [main] Phase:340 - [MessageContext: logID=6ad825994c2bd407e3cbf41d8064164d581e31d241d5bc0e] Invoking flowComplete() in Phase "MessageOut"
10:31:50,369 DEBUG [main] Phase:340 - [MessageContext: logID=6ad825994c2bd407e3cbf41d8064164d581e31d241d5bc0e] Invoking flowComplete() in Phase "PolicyDetermination"
10:31:50,369 DEBUG [main] Phase:340 - [MessageContext: logID=6ad825994c2bd407e3cbf41d8064164d581e31d241d5bc0e] Invoking flowComplete() in Phase "OperationOutPhase"
10:31:50,369 DEBUG [main] Phase:340 - [MessageContext: logID=6ad825994c2bd407e3cbf41d8064164d581e31d241d5bc0e] Invoking flowComplete() in Phase "OpPhase"
10:31:50,369 DEBUG [main] Phase:340 - [MessageContext: logID=6ad825994c2bd407e3cbf41d8064164d581e31d241d5bc0e] Invoking flowComplete() in Phase "RMPhase"
10:31:50,369 DEBUG [main] Options:246 - getAction (http://ws.configurations.tm.gazelle.ihe.net/GazelleProxyWebService/listConfigurationsBySystemBySessionByTypeAsCSV) from org.apache.axis2.client.Options@64d057ab
10:31:50,370 DEBUG [main] MessageContext:1524 - Old SoapAction is (http://ws.configurations.tm.gazelle.ihe.net/GazelleProxyWebService/listConfigurationsBySystemBySessionByTypeAsCSV)
10:31:50,370 DEBUG [main] MessageContext:1525 - New SoapAction is (null)
10:31:50,370 DEBUG [main] Options:589 - setAction Old action is (null)
10:31:50,370 DEBUG [main] Options:590 - setAction New action is (null)
10:31:50,370 DEBUG [main] Options:246 - getAction (http://ws.configurations.tm.gazelle.ihe.net/GazelleProxyWebService/listConfigurationsBySystemBySessionByTypeAsCSV) from org.apache.axis2.client.Options@64d057ab
10:31:50,370 DEBUG [main] MessageContext:1119 - SoapAction is (http://ws.configurations.tm.gazelle.ihe.net/GazelleProxyWebService/listConfigurationsBySystemBySessionByTypeAsCSV)
10:31:50,371 DEBUG [main] TransportUtils:200 - createSOAPEnvelope using Builder (class org.apache.axis2.builder.SOAPBuilder) selected from type (text/xml)
10:31:50,371 DEBUG [main] content:70 - << "<soap:Envelope xmlns:soap="http://schemas.xmlsoap.org/soap/envelope/"><soap:Body><ns2:listConfigurationsBySystemBySessionByTypeAsCSVResponse xmlns:ns2="http://ws.configurations.tm.gazelle.ihe.net/"><return>Configuration Type,Company,System,Host,Actor,is secured,is approved,comment,assigningAuthority,url,assigningAuthority,ws-type,port,port proxy,port secured&#xD;[\n]"
10:31:50,371 DEBUG [main] content:70 - << "HL7 V3 responder,Post,Core Community Component_Post_0,post1,DOC_REGISTRY,false,true,,POC1,http://post1:8081/SGW/HV3PIX/FEED,POC1,ITI-44:Patient Identity Feed HL7v3,8081,11207,&#xD;[\n]"
10:31:50,371 DEBUG [main] content:84 - << "</return></ns2:listConfigurationsBySystemBySessionByTypeAsCSVResponse></soap:Body></soap:Envelope>"
10:31:50,372 DEBUG [main] StAXUtils:194 - XMLStreamReader is org.apache.axiom.util.stax.dialect.Woodstox4StreamReaderWrapper
10:31:50,372 DEBUG [main] StAXSOAPModelBuilder:210 - Starting to process SOAP 1.1 message
10:31:50,373 DEBUG [main] StAXOMBuilder:696 - Performing look-ahead; START_ELEMENT found
10:31:50,373 DEBUG [main] Phase:289 - [MessageContext: logID=7ad825994c2bd407e3cbf41d8064164d581e31d241d5bc0e] Checking pre-condition for Phase "Transport"
10:31:50,373 DEBUG [main] Phase:300 - [MessageContext: logID=7ad825994c2bd407e3cbf41d8064164d581e31d241d5bc0e] Invoking phase "Transport"
10:31:50,373 DEBUG [main] Phase:331 - [MessageContext: logID=7ad825994c2bd407e3cbf41d8064164d581e31d241d5bc0e] Invoking Handler 'RequestURIBasedDispatcher' in Phase 'Transport'
10:31:50,374 DEBUG [main] Phase:331 - [MessageContext: logID=7ad825994c2bd407e3cbf41d8064164d581e31d241d5bc0e] Invoking Handler 'SOAPActionBasedDispatcher' in Phase 'Transport'
10:31:50,374 DEBUG [main] Phase:319 - [MessageContext: logID=7ad825994c2bd407e3cbf41d8064164d581e31d241d5bc0e] Checking post-conditions for phase "Transport"
10:31:50,374 DEBUG [main] Phase:289 - [MessageContext: logID=7ad825994c2bd407e3cbf41d8064164d581e31d241d5bc0e] Checking pre-condition for Phase "Addressing"
10:31:50,374 DEBUG [main] Phase:300 - [MessageContext: logID=7ad825994c2bd407e3cbf41d8064164d581e31d241d5bc0e] Invoking phase "Addressing"
10:31:50,374 DEBUG [main] Phase:331 - [MessageContext: logID=7ad825994c2bd407e3cbf41d8064164d581e31d241d5bc0e] Invoking Handler 'AddressingBasedDispatcher' in Phase 'Addressing'
10:31:50,375 DEBUG [main] Phase:319 - [MessageContext: logID=7ad825994c2bd407e3cbf41d8064164d581e31d241d5bc0e] Checking post-conditions for phase "Addressing"
10:31:50,375 DEBUG [main] Phase:289 - [MessageContext: logID=7ad825994c2bd407e3cbf41d8064164d581e31d241d5bc0e] Checking pre-condition for Phase "Security"
10:31:50,375 DEBUG [main] Phase:300 - [MessageContext: logID=7ad825994c2bd407e3cbf41d8064164d581e31d241d5bc0e] Invoking phase "Security"
10:31:50,375 DEBUG [main] Phase:319 - [MessageContext: logID=7ad825994c2bd407e3cbf41d8064164d581e31d241d5bc0e] Checking post-conditions for phase "Security"
10:31:50,376 DEBUG [main] Phase:289 - [MessageContext: logID=7ad825994c2bd407e3cbf41d8064164d581e31d241d5bc0e] Checking pre-condition for Phase "PreDispatch"
10:31:50,376 DEBUG [main] Phase:300 - [MessageContext: logID=7ad825994c2bd407e3cbf41d8064164d581e31d241d5bc0e] Invoking phase "PreDispatch"
10:31:50,376 DEBUG [main] Phase:319 - [MessageContext: logID=7ad825994c2bd407e3cbf41d8064164d581e31d241d5bc0e] Checking post-conditions for phase "PreDispatch"
10:31:50,376 DEBUG [main] Phase:289 - [MessageContext: logID=7ad825994c2bd407e3cbf41d8064164d581e31d241d5bc0e] Checking pre-condition for Phase "Dispatch"
10:31:50,376 DEBUG [main] Phase:300 - [MessageContext: logID=7ad825994c2bd407e3cbf41d8064164d581e31d241d5bc0e] Invoking phase "Dispatch"
10:31:50,377 DEBUG [main] Phase:331 - [MessageContext: logID=7ad825994c2bd407e3cbf41d8064164d581e31d241d5bc0e] Invoking Handler 'RequestURIBasedDispatcher' in Phase 'Dispatch'
10:31:50,377 DEBUG [main] Phase:331 - [MessageContext: logID=7ad825994c2bd407e3cbf41d8064164d581e31d241d5bc0e] Invoking Handler 'SOAPActionBasedDispatcher' in Phase 'Dispatch'
10:31:50,377 DEBUG [main] Phase:331 - [MessageContext: logID=7ad825994c2bd407e3cbf41d8064164d581e31d241d5bc0e] Invoking Handler 'RequestURIOperationDispatcher' in Phase 'Dispatch'
10:31:50,377 DEBUG [main] Phase:331 - [MessageContext: logID=7ad825994c2bd407e3cbf41d8064164d581e31d241d5bc0e] Invoking Handler 'SOAPMessageBodyBasedDispatcher' in Phase 'Dispatch'
10:31:50,377 DEBUG [main] Phase:331 - [MessageContext: logID=7ad825994c2bd407e3cbf41d8064164d581e31d241d5bc0e] Invoking Handler 'HTTPLocationBasedDispatcher' in Phase 'Dispatch'
10:31:50,378 DEBUG [main] Phase:319 - [MessageContext: logID=7ad825994c2bd407e3cbf41d8064164d581e31d241d5bc0e] Checking post-conditions for phase "Dispatch"
10:31:50,378 DEBUG [main] AddressingHelper:102 - [MessageContext: logID=7ad825994c2bd407e3cbf41d8064164d581e31d241d5bc0e] isReplyRedirected: ReplyTo is null. Returning false
10:31:50,378 DEBUG [main] Phase:289 - [MessageContext: logID=7ad825994c2bd407e3cbf41d8064164d581e31d241d5bc0e] Checking pre-condition for Phase "RMPhase"
10:31:50,378 DEBUG [main] Phase:300 - [MessageContext: logID=7ad825994c2bd407e3cbf41d8064164d581e31d241d5bc0e] Invoking phase "RMPhase"
10:31:50,378 DEBUG [main] Phase:319 - [MessageContext: logID=7ad825994c2bd407e3cbf41d8064164d581e31d241d5bc0e] Checking post-conditions for phase "RMPhase"
10:31:50,379 DEBUG [main] Phase:289 - [MessageContext: logID=7ad825994c2bd407e3cbf41d8064164d581e31d241d5bc0e] Checking pre-condition for Phase "OpPhase"
10:31:50,379 DEBUG [main] Phase:300 - [MessageContext: logID=7ad825994c2bd407e3cbf41d8064164d581e31d241d5bc0e] Invoking phase "OpPhase"
10:31:50,379 DEBUG [main] Phase:319 - [MessageContext: logID=7ad825994c2bd407e3cbf41d8064164d581e31d241d5bc0e] Checking post-conditions for phase "OpPhase"
10:31:50,379 DEBUG [main] Phase:289 - [MessageContext: logID=7ad825994c2bd407e3cbf41d8064164d581e31d241d5bc0e] Checking pre-condition for Phase "OperationInPhase"
10:31:50,379 DEBUG [main] Phase:300 - [MessageContext: logID=7ad825994c2bd407e3cbf41d8064164d581e31d241d5bc0e] Invoking phase "OperationInPhase"
10:31:50,380 DEBUG [main] Phase:319 - [MessageContext: logID=7ad825994c2bd407e3cbf41d8064164d581e31d241d5bc0e] Checking post-conditions for phase "OperationInPhase"
10:31:50,380 DEBUG [main] Phase:340 - [MessageContext: logID=7ad825994c2bd407e3cbf41d8064164d581e31d241d5bc0e] Invoking flowComplete() in Phase "OperationInPhase"
10:31:50,380 DEBUG [main] Phase:340 - [MessageContext: logID=7ad825994c2bd407e3cbf41d8064164d581e31d241d5bc0e] Invoking flowComplete() in Phase "OpPhase"
10:31:50,380 DEBUG [main] Phase:340 - [MessageContext: logID=7ad825994c2bd407e3cbf41d8064164d581e31d241d5bc0e] Invoking flowComplete() in Phase "RMPhase"
10:31:50,380 DEBUG [main] Phase:340 - [MessageContext: logID=7ad825994c2bd407e3cbf41d8064164d581e31d241d5bc0e] Invoking flowComplete() in Phase "Dispatch"
10:31:50,381 DEBUG [main] Phase:359 - [MessageContext: logID=7ad825994c2bd407e3cbf41d8064164d581e31d241d5bc0e] Invoking flowComplete() for Handler 'HTTPLocationBasedDispatcher' in Phase 'Dispatch'
10:31:50,381 DEBUG [main] Phase:359 - [MessageContext: logID=7ad825994c2bd407e3cbf41d8064164d581e31d241d5bc0e] Invoking flowComplete() for Handler 'SOAPMessageBodyBasedDispatcher' in Phase 'Dispatch'
10:31:50,381 DEBUG [main] Phase:359 - [MessageContext: logID=7ad825994c2bd407e3cbf41d8064164d581e31d241d5bc0e] Invoking flowComplete() for Handler 'RequestURIOperationDispatcher' in Phase 'Dispatch'
10:31:50,381 DEBUG [main] Phase:359 - [MessageContext: logID=7ad825994c2bd407e3cbf41d8064164d581e31d241d5bc0e] Invoking flowComplete() for Handler 'SOAPActionBasedDispatcher' in Phase 'Dispatch'
10:31:50,382 DEBUG [main] Phase:359 - [MessageContext: logID=7ad825994c2bd407e3cbf41d8064164d581e31d241d5bc0e] Invoking flowComplete() for Handler 'RequestURIBasedDispatcher' in Phase 'Dispatch'
10:31:50,382 DEBUG [main] Phase:340 - [MessageContext: logID=7ad825994c2bd407e3cbf41d8064164d581e31d241d5bc0e] Invoking flowComplete() in Phase "PreDispatch"
10:31:50,382 DEBUG [main] Phase:340 - [MessageContext: logID=7ad825994c2bd407e3cbf41d8064164d581e31d241d5bc0e] Invoking flowComplete() in Phase "Security"
10:31:50,382 DEBUG [main] Phase:340 - [MessageContext: logID=7ad825994c2bd407e3cbf41d8064164d581e31d241d5bc0e] Invoking flowComplete() in Phase "Addressing"
10:31:50,382 DEBUG [main] Phase:359 - [MessageContext: logID=7ad825994c2bd407e3cbf41d8064164d581e31d241d5bc0e] Invoking flowComplete() for Handler 'AddressingBasedDispatcher' in Phase 'Addressing'
10:31:50,383 DEBUG [main] Phase:340 - [MessageContext: logID=7ad825994c2bd407e3cbf41d8064164d581e31d241d5bc0e] Invoking flowComplete() in Phase "Transport"
10:31:50,383 DEBUG [main] Phase:359 - [MessageContext: logID=7ad825994c2bd407e3cbf41d8064164d581e31d241d5bc0e] Invoking flowComplete() for Handler 'SOAPActionBasedDispatcher' in Phase 'Transport'
10:31:50,383 DEBUG [main] Phase:359 - [MessageContext: logID=7ad825994c2bd407e3cbf41d8064164d581e31d241d5bc0e] Invoking flowComplete() for Handler 'RequestURIBasedDispatcher' in Phase 'Transport'
10:31:50,383 DEBUG [main] StAXOMBuilder:648 - Consuming look-ahead token START_ELEMENT
10:31:50,384 DEBUG [main] PullSerializer:66 - Pull serializer created; initial state is org.apache.axiom.om.impl.common.serializer.pull.Navigator@5c12cd66[cache=false,document=false]
10:31:50,384 DEBUG [main] StAXBuilder:575 - Caching disabled; current element level is 3
10:31:50,384 DEBUG [main] Navigator:661 - Switching to pull-through mode; first event is START_ELEMENT; depth is 1
10:31:50,385 DEBUG [main] PullSerializer:109 - Switching to state org.apache.axiom.om.impl.common.serializer.pull.PullThroughWrapper@7d2b832[reader=org.apache.axiom.util.stax.dialect.Woodstox4StreamReaderWrapper@20795bd2]
10:31:50,385 DEBUG [main] HttpMethodBase:1024 - Resorting to protocol version default close connection policy
10:31:50,385 DEBUG [main] HttpMethodBase:1028 - Should NOT close connection, using HTTP/1.1
10:31:50,385 DEBUG [main] HttpConnection:1178 - Releasing connection back to connection manager.
10:31:50,386 DEBUG [main] MultiThreadedHttpConnectionManager:979 - Freeing connection, hostConfig=HostConfiguration[host=https://ehealthsuisse.ihe-europe.net]
10:31:50,386 DEBUG [main] IdleConnectionHandler:76 - Adding connection at: 1570609910386
10:31:50,386 DEBUG [main] MultiThreadedHttpConnectionManager:961 - Notifying no-one, there are no waiting threads
[INFO] Tests run: 1, Failures: 0, Errors: 0, Skipped: 0, Time elapsed: 1.926 s - in net.ihe.gazelle.wstester.action.RunInstanceActionTest2
[INFO] Running net.ihe.gazelle.wstester.action.RunInstanceActionTest
10:31:50,529 INFO  [WsdlProject] Loaded project from [file:/home/jenkins/.hudson/jobs/gazelle-webservice-tester-SNAPSHOT/workspace/gazelle-webservice-tester-ejb/src/test/resources/soapui_project.xml]
[INFO] Tests run: 3, Failures: 0, Errors: 0, Skipped: 0, Time elapsed: 0.11 s - in net.ihe.gazelle.wstester.action.RunInstanceActionTest
[INFO] Running net.ihe.gazelle.wstester.model.GwtTestStepResultTest
[INFO] Tests run: 3, Failures: 0, Errors: 0, Skipped: 0, Time elapsed: 0 s - in net.ihe.gazelle.wstester.model.GwtTestStepResultTest
[INFO] Running net.ihe.gazelle.wstester.util.DateUtilTest
[INFO] Tests run: 3, Failures: 0, Errors: 0, Skipped: 0, Time elapsed: 0.006 s - in net.ihe.gazelle.wstester.util.DateUtilTest
[INFO] Running net.ihe.gazelle.wstester.xdstools.Ws
10:31:50,742 DEBUG [Finalizer] ConfigurationContext:85 - Invoke modules shutdown.
10:31:50,743 DEBUG [Finalizer] ConfigurationContext:85 - Modules to be shutdown from axisConfiguration: {}
10:31:50,743 DEBUG [Finalizer] ConfigurationContext:85 - Invoke services shutdown.
10:31:50,750 DEBUG [Finalizer] ConfigurationContext:85 - ConfigurationContext is stopped, modules and services not being shut down
10:31:50,755 DEBUG [Finalizer] ConfigurationContext:85 - Invoke modules shutdown.
10:31:50,755 DEBUG [Finalizer] ConfigurationContext:85 - Modules to be shutdown from axisConfiguration: {}
10:31:50,755 DEBUG [Finalizer] ConfigurationContext:85 - Invoke services shutdown.
10:31:50,755 DEBUG [Finalizer] ConfigurationContext:85 - ConfigurationContext is stopped, modules and services not being shut down
10:31:51,105 DEBUG [main] DefaultOMMetaFactoryLocator:77 - Starting class path based discovery
10:31:51,109 DEBUG [main] ImplementationFactory:79 - Loading jar:file:/home/jenkins/.m2/repository/org/apache/ws/commons/axiom/axiom-impl/1.2.19/axiom-impl-1.2.19.jar!/META-INF/axiom.xml
10:31:51,202 DEBUG [main] ImplementationFactory:125 - Discovered implementations: [llom(metaFactory=org.apache.axiom.om.impl.llom.factory.OMLinkedListMetaFactory,features=[default(priority=100)])]
10:31:51,202 DEBUG [main] ImplementationFactory:79 - Loading jar:file:/home/jenkins/.m2/repository/org/apache/ws/commons/axiom/axiom-dom/1.2.19/axiom-dom-1.2.19.jar!/META-INF/axiom.xml
10:31:51,253 DEBUG [main] ImplementationFactory:125 - Discovered implementations: [doom(metaFactory=org.apache.axiom.om.impl.dom.factory.OMDOMMetaFactory,features=[dom(priority=100)])]
10:31:51,254 DEBUG [main] ImplementationFactory:79 - Loading jar:file:/home/jenkins/.m2/repository/org/apache/ws/commons/axiom/axiom-impl/1.2.19/axiom-impl-1.2.19.jar!/META-INF/axiom.xml
10:31:51,256 DEBUG [main] ImplementationFactory:125 - Discovered implementations: [llom(metaFactory=org.apache.axiom.om.impl.llom.factory.OMLinkedListMetaFactory,features=[default(priority=100)])]
10:31:51,256 DEBUG [main] ImplementationFactory:79 - Loading jar:file:/home/jenkins/.m2/repository/org/apache/ws/commons/axiom/axiom-dom/1.2.19/axiom-dom-1.2.19.jar!/META-INF/axiom.xml
10:31:51,258 DEBUG [main] ImplementationFactory:125 - Discovered implementations: [doom(metaFactory=org.apache.axiom.om.impl.dom.factory.OMDOMMetaFactory,features=[dom(priority=100)])]
10:31:51,258 DEBUG [main] PriorityBasedOMMetaFactoryLocator:59 - Meta factories:
  default: org.apache.axiom.om.impl.llom.factory.OMLinkedListMetaFactory
  dom: org.apache.axiom.om.impl.dom.factory.OMDOMMetaFactory
10:31:51,268 DEBUG [main] AxisOperation:485 - Entry: AxisOperation::getInputAction
10:31:51,268 DEBUG [main] AxisOperation:506 - Exit: AxisOperation::getInputAction null
10:31:51,268 DEBUG [main] AxisOperation:467 - Entry: AxisOperation::setSoapAction, previous soapAction: null updated soapAction: urn:anonRobustOp
10:31:51,268 DEBUG [main] AxisOperation:471 - Exit: AxisOperation::setSoapAction
10:31:51,268 DEBUG [main] AxisService:872 - mapActionToOperation: Mapping Action to Operation: action: anonRobustOp; operation: org.apache.axis2.description.RobustOutOnlyAxisOperation@13eb3b5cnamed: {http://ws.apache.org/namespaces/axis2}anonRobustOp
10:31:51,270 DEBUG [main] AxisService:878 - DEBUG_FRAME = org.apache.axis2.util.JavaUtils.callStackToString(JavaUtils.java:564)
	DEBUG_FRAME = org.apache.axis2.description.AxisService.mapActionToOperation(AxisService.java:878)
	DEBUG_FRAME = org.apache.axis2.description.AxisService.addOperation(AxisService.java:724)
	DEBUG_FRAME = org.apache.axis2.client.Stub.addAnonymousOperations(Stub.java:234)
	DEBUG_FRAME = net.ihe.gazelle.ws.client.GazelleTRMServiceStub.populateAxisService(GazelleTRMServiceStub.java:94)
	DEBUG_FRAME = net.ihe.gazelle.ws.client.GazelleTRMServiceStub.<init>(GazelleTRMServiceStub.java:40)
	DEBUG_FRAME = net.ihe.gazelle.ws.client.GazelleTRMServiceStub.<init>(GazelleTRMServiceStub.java:29)
	DEBUG_FRAME = net.ihe.gazelle.ws.client.GazelleTRMServiceStub.<init>(GazelleTRMServiceStub.java:75)
	DEBUG_FRAME = net.ihe.gazelle.ws.client.GazelleTRMServiceClient.<init>(GazelleTRMServiceClient.java:11)
	DEBUG_FRAME = net.ihe.gazelle.wstester.xdstools.ws.Xdstools.getNonce(Xdstools.java:61)
	DEBUG_FRAME = net.ihe.gazelle.wstester.xdstools.Ws.noNonceReturned(Ws.java:79)
	DEBUG_FRAME = sun.reflect.NativeMethodAccessorImpl.invoke0(Native Method)
	DEBUG_FRAME = sun.reflect.NativeMethodAccessorImpl.invoke(NativeMethodAccessorImpl.java:62)
	DEBUG_FRAME = sun.reflect.DelegatingMethodAccessorImpl.invoke(DelegatingMethodAccessorImpl.java:43)
	DEBUG_FRAME = java.lang.reflect.Method.invoke(Method.java:498)
	DEBUG_FRAME = org.junit.internal.runners.TestMethod.invoke(TestMethod.java:66)
	DEBUG_FRAME = org.powermock.modules.junit4.internal.impl.PowerMockJUnit44RunnerDelegateImpl$PowerMockJUnit44MethodRunner.runTestMethod(PowerMockJUnit44RunnerDelegateImpl.java:310)
	DEBUG_FRAME = org.junit.internal.runners.MethodRoadie$2.run(MethodRoadie.java:86)
	DEBUG_FRAME = org.junit.internal.runners.MethodRoadie.runBeforesThenTestThenAfters(MethodRoadie.java:94)
	DEBUG_FRAME = org.powermock.modules.junit4.internal.impl.PowerMockJUnit44RunnerDelegateImpl$PowerMockJUnit44MethodRunner.executeTest(PowerMockJUnit44RunnerDelegateImpl.java:294)
	DEBUG_FRAME = org.powermock.modules.junit4.internal.impl.PowerMockJUnit47RunnerDelegateImpl$PowerMockJUnit47MethodRunner.executeTestInSuper(PowerMockJUnit47RunnerDelegateImpl.java:127)
	DEBUG_FRAME = org.powermock.modules.junit4.internal.impl.PowerMockJUnit47RunnerDelegateImpl$PowerMockJUnit47MethodRunner.executeTest(PowerMockJUnit47RunnerDelegateImpl.java:82)
	DEBUG_FRAME = org.powermock.modules.junit4.internal.impl.PowerMockJUnit44RunnerDelegateImpl$PowerMockJUnit44MethodRunner.runBeforesThenTestThenAfters(PowerMockJUnit44RunnerDelegateImpl.java:282)
	DEBUG_FRAME = org.junit.internal.runners.MethodRoadie.runTest(MethodRoadie.java:84)
	DEBUG_FRAME = org.junit.internal.runners.MethodRoadie.run(MethodRoadie.java:49)
	DEBUG_FRAME = org.powermock.modules.junit4.internal.impl.PowerMockJUnit44RunnerDelegateImpl.invokeTestMethod(PowerMockJUnit44RunnerDelegateImpl.java:207)
	DEBUG_FRAME = org.powermock.modules.junit4.internal.impl.PowerMockJUnit44RunnerDelegateImpl.runMethods(PowerMockJUnit44RunnerDelegateImpl.java:146)
	DEBUG_FRAME = org.powermock.modules.junit4.internal.impl.PowerMockJUnit44RunnerDelegateImpl$1.run(PowerMockJUnit44RunnerDelegateImpl.java:120)
	DEBUG_FRAME = org.junit.internal.runners.ClassRoadie.runUnprotected(ClassRoadie.java:34)
	DEBUG_FRAME = org.junit.internal.runners.ClassRoadie.runProtected(ClassRoadie.java:44)
	DEBUG_FRAME = org.powermock.modules.junit4.internal.impl.PowerMockJUnit44RunnerDelegateImpl.run(PowerMockJUnit44RunnerDelegateImpl.java:118)
	DEBUG_FRAME = org.powermock.modules.junit4.common.internal.impl.JUnit4TestSuiteChunkerImpl.run(JUnit4TestSuiteChunkerImpl.java:101)
	DEBUG_FRAME = org.powermock.modules.junit4.common.internal.impl.AbstractCommonPowerMockRunner.run(AbstractCommonPowerMockRunner.java:53)
	DEBUG_FRAME = org.powermock.modules.junit4.PowerMockRunner.run(PowerMockRunner.java:53)
	DEBUG_FRAME = org.junit.runners.Suite.runChild(Suite.java:128)
	DEBUG_FRAME = org.junit.runners.Suite.runChild(Suite.java:24)
	DEBUG_FRAME = org.junit.runners.ParentRunner$3.run(ParentRunner.java:193)
	DEBUG_FRAME = org.junit.runners.ParentRunner$1.schedule(ParentRunner.java:52)
	DEBUG_FRAME = org.junit.runners.ParentRunner.runChildren(ParentRunner.java:191)
	DEBUG_FRAME = org.junit.runners.ParentRunner.access$000(ParentRunner.java:42)
	DEBUG_FRAME = org.junit.runners.ParentRunner$2.evaluate(ParentRunner.java:184)
	DEBUG_FRAME = org.junit.runners.ParentRunner.run(ParentRunner.java:236)
	DEBUG_FRAME = org.junit.runners.Suite.runChild(Suite.java:128)
	DEBUG_FRAME = org.junit.runners.Suite.runChild(Suite.java:24)
	DEBUG_FRAME = org.junit.runners.ParentRunner$3.run(ParentRunner.java:193)
	DEBUG_FRAME = org.junit.runners.ParentRunner$1.schedule(ParentRunner.java:52)
	DEBUG_FRAME = org.junit.runners.ParentRunner.runChildren(ParentRunner.java:191)
	DEBUG_FRAME = org.junit.runners.ParentRunner.access$000(ParentRunner.java:42)
	DEBUG_FRAME = org.junit.runners.ParentRunner$2.evaluate(ParentRunner.java:184)
	DEBUG_FRAME = org.junit.runners.ParentRunner.run(ParentRunner.java:236)
	DEBUG_FRAME = org.apache.maven.surefire.junitcore.JUnitCore.run(JUnitCore.java:55)
	DEBUG_FRAME = org.apache.maven.surefire.junitcore.JUnitCoreWrapper.createRequestAndRun(JUnitCoreWrapper.java:137)
	DEBUG_FRAME = org.apache.maven.surefire.junitcore.JUnitCoreWrapper.executeEager(JUnitCoreWrapper.java:107)
	DEBUG_FRAME = org.apache.maven.surefire.junitcore.JUnitCoreWrapper.execute(JUnitCoreWrapper.java:83)
	DEBUG_FRAME = org.apache.maven.surefire.junitcore.JUnitCoreWrapper.execute(JUnitCoreWrapper.java:75)
	DEBUG_FRAME = org.apache.maven.surefire.junitcore.JUnitCoreProvider.invoke(JUnitCoreProvider.java:157)
	DEBUG_FRAME = org.apache.maven.surefire.booter.ForkedBooter.invokeProviderInSameClassLoader(ForkedBooter.java:386)
	DEBUG_FRAME = org.apache.maven.surefire.booter.ForkedBooter.runSuitesInProcess(ForkedBooter.java:323)
	DEBUG_FRAME = org.apache.maven.surefire.booter.ForkedBooter.main(ForkedBooter.java:143)

10:31:51,270 DEBUG [main] AxisOperation:485 - Entry: AxisOperation::getInputAction
10:31:51,270 DEBUG [main] AxisOperation:490 - Debug: AxisOperation::getInputAction - using soapAction
10:31:51,270 DEBUG [main] AxisOperation:506 - Exit: AxisOperation::getInputAction urn:anonRobustOp
10:31:51,270 DEBUG [main] AxisService:872 - mapActionToOperation: Mapping Action to Operation: action: urn:anonRobustOp; operation: org.apache.axis2.description.RobustOutOnlyAxisOperation@13eb3b5cnamed: {http://ws.apache.org/namespaces/axis2}anonRobustOp
10:31:51,270 DEBUG [main] AxisService:878 - DEBUG_FRAME = org.apache.axis2.util.JavaUtils.callStackToString(JavaUtils.java:564)
	DEBUG_FRAME = org.apache.axis2.description.AxisService.mapActionToOperation(AxisService.java:878)
	DEBUG_FRAME = org.apache.axis2.description.AxisService.addOperation(AxisService.java:728)
	DEBUG_FRAME = org.apache.axis2.client.Stub.addAnonymousOperations(Stub.java:234)
	DEBUG_FRAME = net.ihe.gazelle.ws.client.GazelleTRMServiceStub.populateAxisService(GazelleTRMServiceStub.java:94)
	DEBUG_FRAME = net.ihe.gazelle.ws.client.GazelleTRMServiceStub.<init>(GazelleTRMServiceStub.java:40)
	DEBUG_FRAME = net.ihe.gazelle.ws.client.GazelleTRMServiceStub.<init>(GazelleTRMServiceStub.java:29)
	DEBUG_FRAME = net.ihe.gazelle.ws.client.GazelleTRMServiceStub.<init>(GazelleTRMServiceStub.java:75)
	DEBUG_FRAME = net.ihe.gazelle.ws.client.GazelleTRMServiceClient.<init>(GazelleTRMServiceClient.java:11)
	DEBUG_FRAME = net.ihe.gazelle.wstester.xdstools.ws.Xdstools.getNonce(Xdstools.java:61)
	DEBUG_FRAME = net.ihe.gazelle.wstester.xdstools.Ws.noNonceReturned(Ws.java:79)
	DEBUG_FRAME = sun.reflect.NativeMethodAccessorImpl.invoke0(Native Method)
	DEBUG_FRAME = sun.reflect.NativeMethodAccessorImpl.invoke(NativeMethodAccessorImpl.java:62)
	DEBUG_FRAME = sun.reflect.DelegatingMethodAccessorImpl.invoke(DelegatingMethodAccessorImpl.java:43)
	DEBUG_FRAME = java.lang.reflect.Method.invoke(Method.java:498)
	DEBUG_FRAME = org.junit.internal.runners.TestMethod.invoke(TestMethod.java:66)
	DEBUG_FRAME = org.powermock.modules.junit4.internal.impl.PowerMockJUnit44RunnerDelegateImpl$PowerMockJUnit44MethodRunner.runTestMethod(PowerMockJUnit44RunnerDelegateImpl.java:310)
	DEBUG_FRAME = org.junit.internal.runners.MethodRoadie$2.run(MethodRoadie.java:86)
	DEBUG_FRAME = org.junit.internal.runners.MethodRoadie.runBeforesThenTestThenAfters(MethodRoadie.java:94)
	DEBUG_FRAME = org.powermock.modules.junit4.internal.impl.PowerMockJUnit44RunnerDelegateImpl$PowerMockJUnit44MethodRunner.executeTest(PowerMockJUnit44RunnerDelegateImpl.java:294)
	DEBUG_FRAME = org.powermock.modules.junit4.internal.impl.PowerMockJUnit47RunnerDelegateImpl$PowerMockJUnit47MethodRunner.executeTestInSuper(PowerMockJUnit47RunnerDelegateImpl.java:127)
	DEBUG_FRAME = org.powermock.modules.junit4.internal.impl.PowerMockJUnit47RunnerDelegateImpl$PowerMockJUnit47MethodRunner.executeTest(PowerMockJUnit47RunnerDelegateImpl.java:82)
	DEBUG_FRAME = org.powermock.modules.junit4.internal.impl.PowerMockJUnit44RunnerDelegateImpl$PowerMockJUnit44MethodRunner.runBeforesThenTestThenAfters(PowerMockJUnit44RunnerDelegateImpl.java:282)
	DEBUG_FRAME = org.junit.internal.runners.MethodRoadie.runTest(MethodRoadie.java:84)
	DEBUG_FRAME = org.junit.internal.runners.MethodRoadie.run(MethodRoadie.java:49)
	DEBUG_FRAME = org.powermock.modules.junit4.internal.impl.PowerMockJUnit44RunnerDelegateImpl.invokeTestMethod(PowerMockJUnit44RunnerDelegateImpl.java:207)
	DEBUG_FRAME = org.powermock.modules.junit4.internal.impl.PowerMockJUnit44RunnerDelegateImpl.runMethods(PowerMockJUnit44RunnerDelegateImpl.java:146)
	DEBUG_FRAME = org.powermock.modules.junit4.internal.impl.PowerMockJUnit44RunnerDelegateImpl$1.run(PowerMockJUnit44RunnerDelegateImpl.java:120)
	DEBUG_FRAME = org.junit.internal.runners.ClassRoadie.runUnprotected(ClassRoadie.java:34)
	DEBUG_FRAME = org.junit.internal.runners.ClassRoadie.runProtected(ClassRoadie.java:44)
	DEBUG_FRAME = org.powermock.modules.junit4.internal.impl.PowerMockJUnit44RunnerDelegateImpl.run(PowerMockJUnit44RunnerDelegateImpl.java:118)
	DEBUG_FRAME = org.powermock.modules.junit4.common.internal.impl.JUnit4TestSuiteChunkerImpl.run(JUnit4TestSuiteChunkerImpl.java:101)
	DEBUG_FRAME = org.powermock.modules.junit4.common.internal.impl.AbstractCommonPowerMockRunner.run(AbstractCommonPowerMockRunner.java:53)
	DEBUG_FRAME = org.powermock.modules.junit4.PowerMockRunner.run(PowerMockRunner.java:53)
	DEBUG_FRAME = org.junit.runners.Suite.runChild(Suite.java:128)
	DEBUG_FRAME = org.junit.runners.Suite.runChild(Suite.java:24)
	DEBUG_FRAME = org.junit.runners.ParentRunner$3.run(ParentRunner.java:193)
	DEBUG_FRAME = org.junit.runners.ParentRunner$1.schedule(ParentRunner.java:52)
	DEBUG_FRAME = org.junit.runners.ParentRunner.runChildren(ParentRunner.java:191)
	DEBUG_FRAME = org.junit.runners.ParentRunner.access$000(ParentRunner.java:42)
	DEBUG_FRAME = org.junit.runners.ParentRunner$2.evaluate(ParentRunner.java:184)
	DEBUG_FRAME = org.junit.runners.ParentRunner.run(ParentRunner.java:236)
	DEBUG_FRAME = org.junit.runners.Suite.runChild(Suite.java:128)
	DEBUG_FRAME = org.junit.runners.Suite.runChild(Suite.java:24)
	DEBUG_FRAME = org.junit.runners.ParentRunner$3.run(ParentRunner.java:193)
	DEBUG_FRAME = org.junit.runners.ParentRunner$1.schedule(ParentRunner.java:52)
	DEBUG_FRAME = org.junit.runners.ParentRunner.runChildren(ParentRunner.java:191)
	DEBUG_FRAME = org.junit.runners.ParentRunner.access$000(ParentRunner.java:42)
	DEBUG_FRAME = org.junit.runners.ParentRunner$2.evaluate(ParentRunner.java:184)
	DEBUG_FRAME = org.junit.runners.ParentRunner.run(ParentRunner.java:236)
	DEBUG_FRAME = org.apache.maven.surefire.junitcore.JUnitCore.run(JUnitCore.java:55)
	DEBUG_FRAME = org.apache.maven.surefire.junitcore.JUnitCoreWrapper.createRequestAndRun(JUnitCoreWrapper.java:137)
	DEBUG_FRAME = org.apache.maven.surefire.junitcore.JUnitCoreWrapper.executeEager(JUnitCoreWrapper.java:107)
	DEBUG_FRAME = org.apache.maven.surefire.junitcore.JUnitCoreWrapper.execute(JUnitCoreWrapper.java:83)
	DEBUG_FRAME = org.apache.maven.surefire.junitcore.JUnitCoreWrapper.execute(JUnitCoreWrapper.java:75)
	DEBUG_FRAME = org.apache.maven.surefire.junitcore.JUnitCoreProvider.invoke(JUnitCoreProvider.java:157)
	DEBUG_FRAME = org.apache.maven.surefire.booter.ForkedBooter.invokeProviderInSameClassLoader(ForkedBooter.java:386)
	DEBUG_FRAME = org.apache.maven.surefire.booter.ForkedBooter.runSuitesInProcess(ForkedBooter.java:323)
	DEBUG_FRAME = org.apache.maven.surefire.booter.ForkedBooter.main(ForkedBooter.java:143)

10:31:51,271 DEBUG [main] AxisService:673 - Client-defined operation name matches default operation name. this may cause interoperability issues.  Name is: {http://ws.apache.org/namespaces/axis2}anonOutonlyOp
10:31:51,271 DEBUG [main] AxisOperation:485 - Entry: AxisOperation::getInputAction
10:31:51,271 DEBUG [main] AxisOperation:506 - Exit: AxisOperation::getInputAction null
10:31:51,271 DEBUG [main] AxisOperation:467 - Entry: AxisOperation::setSoapAction, previous soapAction: null updated soapAction: urn:anonOutonlyOp
10:31:51,271 DEBUG [main] AxisOperation:471 - Exit: AxisOperation::setSoapAction
10:31:51,272 DEBUG [main] AxisService:872 - mapActionToOperation: Mapping Action to Operation: action: anonOutonlyOp; operation: org.apache.axis2.description.OutOnlyAxisOperation@5175d463named: {http://ws.apache.org/namespaces/axis2}anonOutonlyOp
10:31:51,272 DEBUG [main] AxisService:878 - DEBUG_FRAME = org.apache.axis2.util.JavaUtils.callStackToString(JavaUtils.java:564)
	DEBUG_FRAME = org.apache.axis2.description.AxisService.mapActionToOperation(AxisService.java:878)
	DEBUG_FRAME = org.apache.axis2.description.AxisService.addOperation(AxisService.java:724)
	DEBUG_FRAME = org.apache.axis2.client.Stub.addAnonymousOperations(Stub.java:237)
	DEBUG_FRAME = net.ihe.gazelle.ws.client.GazelleTRMServiceStub.populateAxisService(GazelleTRMServiceStub.java:94)
	DEBUG_FRAME = net.ihe.gazelle.ws.client.GazelleTRMServiceStub.<init>(GazelleTRMServiceStub.java:40)
	DEBUG_FRAME = net.ihe.gazelle.ws.client.GazelleTRMServiceStub.<init>(GazelleTRMServiceStub.java:29)
	DEBUG_FRAME = net.ihe.gazelle.ws.client.GazelleTRMServiceStub.<init>(GazelleTRMServiceStub.java:75)
	DEBUG_FRAME = net.ihe.gazelle.ws.client.GazelleTRMServiceClient.<init>(GazelleTRMServiceClient.java:11)
	DEBUG_FRAME = net.ihe.gazelle.wstester.xdstools.ws.Xdstools.getNonce(Xdstools.java:61)
	DEBUG_FRAME = net.ihe.gazelle.wstester.xdstools.Ws.noNonceReturned(Ws.java:79)
	DEBUG_FRAME = sun.reflect.NativeMethodAccessorImpl.invoke0(Native Method)
	DEBUG_FRAME = sun.reflect.NativeMethodAccessorImpl.invoke(NativeMethodAccessorImpl.java:62)
	DEBUG_FRAME = sun.reflect.DelegatingMethodAccessorImpl.invoke(DelegatingMethodAccessorImpl.java:43)
	DEBUG_FRAME = java.lang.reflect.Method.invoke(Method.java:498)
	DEBUG_FRAME = org.junit.internal.runners.TestMethod.invoke(TestMethod.java:66)
	DEBUG_FRAME = org.powermock.modules.junit4.internal.impl.PowerMockJUnit44RunnerDelegateImpl$PowerMockJUnit44MethodRunner.runTestMethod(PowerMockJUnit44RunnerDelegateImpl.java:310)
	DEBUG_FRAME = org.junit.internal.runners.MethodRoadie$2.run(MethodRoadie.java:86)
	DEBUG_FRAME = org.junit.internal.runners.MethodRoadie.runBeforesThenTestThenAfters(MethodRoadie.java:94)
	DEBUG_FRAME = org.powermock.modules.junit4.internal.impl.PowerMockJUnit44RunnerDelegateImpl$PowerMockJUnit44MethodRunner.executeTest(PowerMockJUnit44RunnerDelegateImpl.java:294)
	DEBUG_FRAME = org.powermock.modules.junit4.internal.impl.PowerMockJUnit47RunnerDelegateImpl$PowerMockJUnit47MethodRunner.executeTestInSuper(PowerMockJUnit47RunnerDelegateImpl.java:127)
	DEBUG_FRAME = org.powermock.modules.junit4.internal.impl.PowerMockJUnit47RunnerDelegateImpl$PowerMockJUnit47MethodRunner.executeTest(PowerMockJUnit47RunnerDelegateImpl.java:82)
	DEBUG_FRAME = org.powermock.modules.junit4.internal.impl.PowerMockJUnit44RunnerDelegateImpl$PowerMockJUnit44MethodRunner.runBeforesThenTestThenAfters(PowerMockJUnit44RunnerDelegateImpl.java:282)
	DEBUG_FRAME = org.junit.internal.runners.MethodRoadie.runTest(MethodRoadie.java:84)
	DEBUG_FRAME = org.junit.internal.runners.MethodRoadie.run(MethodRoadie.java:49)
	DEBUG_FRAME = org.powermock.modules.junit4.internal.impl.PowerMockJUnit44RunnerDelegateImpl.invokeTestMethod(PowerMockJUnit44RunnerDelegateImpl.java:207)
	DEBUG_FRAME = org.powermock.modules.junit4.internal.impl.PowerMockJUnit44RunnerDelegateImpl.runMethods(PowerMockJUnit44RunnerDelegateImpl.java:146)
	DEBUG_FRAME = org.powermock.modules.junit4.internal.impl.PowerMockJUnit44RunnerDelegateImpl$1.run(PowerMockJUnit44RunnerDelegateImpl.java:120)
	DEBUG_FRAME = org.junit.internal.runners.ClassRoadie.runUnprotected(ClassRoadie.java:34)
	DEBUG_FRAME = org.junit.internal.runners.ClassRoadie.runProtected(ClassRoadie.java:44)
	DEBUG_FRAME = org.powermock.modules.junit4.internal.impl.PowerMockJUnit44RunnerDelegateImpl.run(PowerMockJUnit44RunnerDelegateImpl.java:118)
	DEBUG_FRAME = org.powermock.modules.junit4.common.internal.impl.JUnit4TestSuiteChunkerImpl.run(JUnit4TestSuiteChunkerImpl.java:101)
	DEBUG_FRAME = org.powermock.modules.junit4.common.internal.impl.AbstractCommonPowerMockRunner.run(AbstractCommonPowerMockRunner.java:53)
	DEBUG_FRAME = org.powermock.modules.junit4.PowerMockRunner.run(PowerMockRunner.java:53)
	DEBUG_FRAME = org.junit.runners.Suite.runChild(Suite.java:128)
	DEBUG_FRAME = org.junit.runners.Suite.runChild(Suite.java:24)
	DEBUG_FRAME = org.junit.runners.ParentRunner$3.run(ParentRunner.java:193)
	DEBUG_FRAME = org.junit.runners.ParentRunner$1.schedule(ParentRunner.java:52)
	DEBUG_FRAME = org.junit.runners.ParentRunner.runChildren(ParentRunner.java:191)
	DEBUG_FRAME = org.junit.runners.ParentRunner.access$000(ParentRunner.java:42)
	DEBUG_FRAME = org.junit.runners.ParentRunner$2.evaluate(ParentRunner.java:184)
	DEBUG_FRAME = org.junit.runners.ParentRunner.run(ParentRunner.java:236)
	DEBUG_FRAME = org.junit.runners.Suite.runChild(Suite.java:128)
	DEBUG_FRAME = org.junit.runners.Suite.runChild(Suite.java:24)
	DEBUG_FRAME = org.junit.runners.ParentRunner$3.run(ParentRunner.java:193)
	DEBUG_FRAME = org.junit.runners.ParentRunner$1.schedule(ParentRunner.java:52)
	DEBUG_FRAME = org.junit.runners.ParentRunner.runChildren(ParentRunner.java:191)
	DEBUG_FRAME = org.junit.runners.ParentRunner.access$000(ParentRunner.java:42)
	DEBUG_FRAME = org.junit.runners.ParentRunner$2.evaluate(ParentRunner.java:184)
	DEBUG_FRAME = org.junit.runners.ParentRunner.run(ParentRunner.java:236)
	DEBUG_FRAME = org.apache.maven.surefire.junitcore.JUnitCore.run(JUnitCore.java:55)
	DEBUG_FRAME = org.apache.maven.surefire.junitcore.JUnitCoreWrapper.createRequestAndRun(JUnitCoreWrapper.java:137)
	DEBUG_FRAME = org.apache.maven.surefire.junitcore.JUnitCoreWrapper.executeEager(JUnitCoreWrapper.java:107)
	DEBUG_FRAME = org.apache.maven.surefire.junitcore.JUnitCoreWrapper.execute(JUnitCoreWrapper.java:83)
	DEBUG_FRAME = org.apache.maven.surefire.junitcore.JUnitCoreWrapper.execute(JUnitCoreWrapper.java:75)
	DEBUG_FRAME = org.apache.maven.surefire.junitcore.JUnitCoreProvider.invoke(JUnitCoreProvider.java:157)
	DEBUG_FRAME = org.apache.maven.surefire.booter.ForkedBooter.invokeProviderInSameClassLoader(ForkedBooter.java:386)
	DEBUG_FRAME = org.apache.maven.surefire.booter.ForkedBooter.runSuitesInProcess(ForkedBooter.java:323)
	DEBUG_FRAME = org.apache.maven.surefire.booter.ForkedBooter.main(ForkedBooter.java:143)

10:31:51,272 DEBUG [main] AxisOperation:485 - Entry: AxisOperation::getInputAction
10:31:51,272 DEBUG [main] AxisOperation:490 - Debug: AxisOperation::getInputAction - using soapAction
10:31:51,272 DEBUG [main] AxisOperation:506 - Exit: AxisOperation::getInputAction urn:anonOutonlyOp
10:31:51,272 DEBUG [main] AxisService:872 - mapActionToOperation: Mapping Action to Operation: action: urn:anonOutonlyOp; operation: org.apache.axis2.description.OutOnlyAxisOperation@5175d463named: {http://ws.apache.org/namespaces/axis2}anonOutonlyOp
10:31:51,272 DEBUG [main] AxisService:878 - DEBUG_FRAME = org.apache.axis2.util.JavaUtils.callStackToString(JavaUtils.java:564)
	DEBUG_FRAME = org.apache.axis2.description.AxisService.mapActionToOperation(AxisService.java:878)
	DEBUG_FRAME = org.apache.axis2.description.AxisService.addOperation(AxisService.java:728)
	DEBUG_FRAME = org.apache.axis2.client.Stub.addAnonymousOperations(Stub.java:237)
	DEBUG_FRAME = net.ihe.gazelle.ws.client.GazelleTRMServiceStub.populateAxisService(GazelleTRMServiceStub.java:94)
	DEBUG_FRAME = net.ihe.gazelle.ws.client.GazelleTRMServiceStub.<init>(GazelleTRMServiceStub.java:40)
	DEBUG_FRAME = net.ihe.gazelle.ws.client.GazelleTRMServiceStub.<init>(GazelleTRMServiceStub.java:29)
	DEBUG_FRAME = net.ihe.gazelle.ws.client.GazelleTRMServiceStub.<init>(GazelleTRMServiceStub.java:75)
	DEBUG_FRAME = net.ihe.gazelle.ws.client.GazelleTRMServiceClient.<init>(GazelleTRMServiceClient.java:11)
	DEBUG_FRAME = net.ihe.gazelle.wstester.xdstools.ws.Xdstools.getNonce(Xdstools.java:61)
	DEBUG_FRAME = net.ihe.gazelle.wstester.xdstools.Ws.noNonceReturned(Ws.java:79)
	DEBUG_FRAME = sun.reflect.NativeMethodAccessorImpl.invoke0(Native Method)
	DEBUG_FRAME = sun.reflect.NativeMethodAccessorImpl.invoke(NativeMethodAccessorImpl.java:62)
	DEBUG_FRAME = sun.reflect.DelegatingMethodAccessorImpl.invoke(DelegatingMethodAccessorImpl.java:43)
	DEBUG_FRAME = java.lang.reflect.Method.invoke(Method.java:498)
	DEBUG_FRAME = org.junit.internal.runners.TestMethod.invoke(TestMethod.java:66)
	DEBUG_FRAME = org.powermock.modules.junit4.internal.impl.PowerMockJUnit44RunnerDelegateImpl$PowerMockJUnit44MethodRunner.runTestMethod(PowerMockJUnit44RunnerDelegateImpl.java:310)
	DEBUG_FRAME = org.junit.internal.runners.MethodRoadie$2.run(MethodRoadie.java:86)
	DEBUG_FRAME = org.junit.internal.runners.MethodRoadie.runBeforesThenTestThenAfters(MethodRoadie.java:94)
	DEBUG_FRAME = org.powermock.modules.junit4.internal.impl.PowerMockJUnit44RunnerDelegateImpl$PowerMockJUnit44MethodRunner.executeTest(PowerMockJUnit44RunnerDelegateImpl.java:294)
	DEBUG_FRAME = org.powermock.modules.junit4.internal.impl.PowerMockJUnit47RunnerDelegateImpl$PowerMockJUnit47MethodRunner.executeTestInSuper(PowerMockJUnit47RunnerDelegateImpl.java:127)
	DEBUG_FRAME = org.powermock.modules.junit4.internal.impl.PowerMockJUnit47RunnerDelegateImpl$PowerMockJUnit47MethodRunner.executeTest(PowerMockJUnit47RunnerDelegateImpl.java:82)
	DEBUG_FRAME = org.powermock.modules.junit4.internal.impl.PowerMockJUnit44RunnerDelegateImpl$PowerMockJUnit44MethodRunner.runBeforesThenTestThenAfters(PowerMockJUnit44RunnerDelegateImpl.java:282)
	DEBUG_FRAME = org.junit.internal.runners.MethodRoadie.runTest(MethodRoadie.java:84)
	DEBUG_FRAME = org.junit.internal.runners.MethodRoadie.run(MethodRoadie.java:49)
	DEBUG_FRAME = org.powermock.modules.junit4.internal.impl.PowerMockJUnit44RunnerDelegateImpl.invokeTestMethod(PowerMockJUnit44RunnerDelegateImpl.java:207)
	DEBUG_FRAME = org.powermock.modules.junit4.internal.impl.PowerMockJUnit44RunnerDelegateImpl.runMethods(PowerMockJUnit44RunnerDelegateImpl.java:146)
	DEBUG_FRAME = org.powermock.modules.junit4.internal.impl.PowerMockJUnit44RunnerDelegateImpl$1.run(PowerMockJUnit44RunnerDelegateImpl.java:120)
	DEBUG_FRAME = org.junit.internal.runners.ClassRoadie.runUnprotected(ClassRoadie.java:34)
	DEBUG_FRAME = org.junit.internal.runners.ClassRoadie.runProtected(ClassRoadie.java:44)
	DEBUG_FRAME = org.powermock.modules.junit4.internal.impl.PowerMockJUnit44RunnerDelegateImpl.run(PowerMockJUnit44RunnerDelegateImpl.java:118)
	DEBUG_FRAME = org.powermock.modules.junit4.common.internal.impl.JUnit4TestSuiteChunkerImpl.run(JUnit4TestSuiteChunkerImpl.java:101)
	DEBUG_FRAME = org.powermock.modules.junit4.common.internal.impl.AbstractCommonPowerMockRunner.run(AbstractCommonPowerMockRunner.java:53)
	DEBUG_FRAME = org.powermock.modules.junit4.PowerMockRunner.run(PowerMockRunner.java:53)
	DEBUG_FRAME = org.junit.runners.Suite.runChild(Suite.java:128)
	DEBUG_FRAME = org.junit.runners.Suite.runChild(Suite.java:24)
	DEBUG_FRAME = org.junit.runners.ParentRunner$3.run(ParentRunner.java:193)
	DEBUG_FRAME = org.junit.runners.ParentRunner$1.schedule(ParentRunner.java:52)
	DEBUG_FRAME = org.junit.runners.ParentRunner.runChildren(ParentRunner.java:191)
	DEBUG_FRAME = org.junit.runners.ParentRunner.access$000(ParentRunner.java:42)
	DEBUG_FRAME = org.junit.runners.ParentRunner$2.evaluate(ParentRunner.java:184)
	DEBUG_FRAME = org.junit.runners.ParentRunner.run(ParentRunner.java:236)
	DEBUG_FRAME = org.junit.runners.Suite.runChild(Suite.java:128)
	DEBUG_FRAME = org.junit.runners.Suite.runChild(Suite.java:24)
	DEBUG_FRAME = org.junit.runners.ParentRunner$3.run(ParentRunner.java:193)
	DEBUG_FRAME = org.junit.runners.ParentRunner$1.schedule(ParentRunner.java:52)
	DEBUG_FRAME = org.junit.runners.ParentRunner.runChildren(ParentRunner.java:191)
	DEBUG_FRAME = org.junit.runners.ParentRunner.access$000(ParentRunner.java:42)
	DEBUG_FRAME = org.junit.runners.ParentRunner$2.evaluate(ParentRunner.java:184)
	DEBUG_FRAME = org.junit.runners.ParentRunner.run(ParentRunner.java:236)
	DEBUG_FRAME = org.apache.maven.surefire.junitcore.JUnitCore.run(JUnitCore.java:55)
	DEBUG_FRAME = org.apache.maven.surefire.junitcore.JUnitCoreWrapper.createRequestAndRun(JUnitCoreWrapper.java:137)
	DEBUG_FRAME = org.apache.maven.surefire.junitcore.JUnitCoreWrapper.executeEager(JUnitCoreWrapper.java:107)
	DEBUG_FRAME = org.apache.maven.surefire.junitcore.JUnitCoreWrapper.execute(JUnitCoreWrapper.java:83)
	DEBUG_FRAME = org.apache.maven.surefire.junitcore.JUnitCoreWrapper.execute(JUnitCoreWrapper.java:75)
	DEBUG_FRAME = org.apache.maven.surefire.junitcore.JUnitCoreProvider.invoke(JUnitCoreProvider.java:157)
	DEBUG_FRAME = org.apache.maven.surefire.booter.ForkedBooter.invokeProviderInSameClassLoader(ForkedBooter.java:386)
	DEBUG_FRAME = org.apache.maven.surefire.booter.ForkedBooter.runSuitesInProcess(ForkedBooter.java:323)
	DEBUG_FRAME = org.apache.maven.surefire.booter.ForkedBooter.main(ForkedBooter.java:143)

10:31:51,273 DEBUG [main] AxisOperation:485 - Entry: AxisOperation::getInputAction
10:31:51,273 DEBUG [main] AxisOperation:506 - Exit: AxisOperation::getInputAction null
10:31:51,273 DEBUG [main] AxisOperation:467 - Entry: AxisOperation::setSoapAction, previous soapAction: null updated soapAction: urn:anonOutInOp
10:31:51,273 DEBUG [main] AxisOperation:471 - Exit: AxisOperation::setSoapAction
10:31:51,273 DEBUG [main] AxisService:872 - mapActionToOperation: Mapping Action to Operation: action: anonOutInOp; operation: org.apache.axis2.description.OutInAxisOperation@328530d4named: {http://ws.apache.org/namespaces/axis2}anonOutInOp
10:31:51,273 DEBUG [main] AxisService:878 - DEBUG_FRAME = org.apache.axis2.util.JavaUtils.callStackToString(JavaUtils.java:564)
	DEBUG_FRAME = org.apache.axis2.description.AxisService.mapActionToOperation(AxisService.java:878)
	DEBUG_FRAME = org.apache.axis2.description.AxisService.addOperation(AxisService.java:724)
	DEBUG_FRAME = org.apache.axis2.client.Stub.addAnonymousOperations(Stub.java:240)
	DEBUG_FRAME = net.ihe.gazelle.ws.client.GazelleTRMServiceStub.populateAxisService(GazelleTRMServiceStub.java:94)
	DEBUG_FRAME = net.ihe.gazelle.ws.client.GazelleTRMServiceStub.<init>(GazelleTRMServiceStub.java:40)
	DEBUG_FRAME = net.ihe.gazelle.ws.client.GazelleTRMServiceStub.<init>(GazelleTRMServiceStub.java:29)
	DEBUG_FRAME = net.ihe.gazelle.ws.client.GazelleTRMServiceStub.<init>(GazelleTRMServiceStub.java:75)
	DEBUG_FRAME = net.ihe.gazelle.ws.client.GazelleTRMServiceClient.<init>(GazelleTRMServiceClient.java:11)
	DEBUG_FRAME = net.ihe.gazelle.wstester.xdstools.ws.Xdstools.getNonce(Xdstools.java:61)
	DEBUG_FRAME = net.ihe.gazelle.wstester.xdstools.Ws.noNonceReturned(Ws.java:79)
	DEBUG_FRAME = sun.reflect.NativeMethodAccessorImpl.invoke0(Native Method)
	DEBUG_FRAME = sun.reflect.NativeMethodAccessorImpl.invoke(NativeMethodAccessorImpl.java:62)
	DEBUG_FRAME = sun.reflect.DelegatingMethodAccessorImpl.invoke(DelegatingMethodAccessorImpl.java:43)
	DEBUG_FRAME = java.lang.reflect.Method.invoke(Method.java:498)
	DEBUG_FRAME = org.junit.internal.runners.TestMethod.invoke(TestMethod.java:66)
	DEBUG_FRAME = org.powermock.modules.junit4.internal.impl.PowerMockJUnit44RunnerDelegateImpl$PowerMockJUnit44MethodRunner.runTestMethod(PowerMockJUnit44RunnerDelegateImpl.java:310)
	DEBUG_FRAME = org.junit.internal.runners.MethodRoadie$2.run(MethodRoadie.java:86)
	DEBUG_FRAME = org.junit.internal.runners.MethodRoadie.runBeforesThenTestThenAfters(MethodRoadie.java:94)
	DEBUG_FRAME = org.powermock.modules.junit4.internal.impl.PowerMockJUnit44RunnerDelegateImpl$PowerMockJUnit44MethodRunner.executeTest(PowerMockJUnit44RunnerDelegateImpl.java:294)
	DEBUG_FRAME = org.powermock.modules.junit4.internal.impl.PowerMockJUnit47RunnerDelegateImpl$PowerMockJUnit47MethodRunner.executeTestInSuper(PowerMockJUnit47RunnerDelegateImpl.java:127)
	DEBUG_FRAME = org.powermock.modules.junit4.internal.impl.PowerMockJUnit47RunnerDelegateImpl$PowerMockJUnit47MethodRunner.executeTest(PowerMockJUnit47RunnerDelegateImpl.java:82)
	DEBUG_FRAME = org.powermock.modules.junit4.internal.impl.PowerMockJUnit44RunnerDelegateImpl$PowerMockJUnit44MethodRunner.runBeforesThenTestThenAfters(PowerMockJUnit44RunnerDelegateImpl.java:282)
	DEBUG_FRAME = org.junit.internal.runners.MethodRoadie.runTest(MethodRoadie.java:84)
	DEBUG_FRAME = org.junit.internal.runners.MethodRoadie.run(MethodRoadie.java:49)
	DEBUG_FRAME = org.powermock.modules.junit4.internal.impl.PowerMockJUnit44RunnerDelegateImpl.invokeTestMethod(PowerMockJUnit44RunnerDelegateImpl.java:207)
	DEBUG_FRAME = org.powermock.modules.junit4.internal.impl.PowerMockJUnit44RunnerDelegateImpl.runMethods(PowerMockJUnit44RunnerDelegateImpl.java:146)
	DEBUG_FRAME = org.powermock.modules.junit4.internal.impl.PowerMockJUnit44RunnerDelegateImpl$1.run(PowerMockJUnit44RunnerDelegateImpl.java:120)
	DEBUG_FRAME = org.junit.internal.runners.ClassRoadie.runUnprotected(ClassRoadie.java:34)
	DEBUG_FRAME = org.junit.internal.runners.ClassRoadie.runProtected(ClassRoadie.java:44)
	DEBUG_FRAME = org.powermock.modules.junit4.internal.impl.PowerMockJUnit44RunnerDelegateImpl.run(PowerMockJUnit44RunnerDelegateImpl.java:118)
	DEBUG_FRAME = org.powermock.modules.junit4.common.internal.impl.JUnit4TestSuiteChunkerImpl.run(JUnit4TestSuiteChunkerImpl.java:101)
	DEBUG_FRAME = org.powermock.modules.junit4.common.internal.impl.AbstractCommonPowerMockRunner.run(AbstractCommonPowerMockRunner.java:53)
	DEBUG_FRAME = org.powermock.modules.junit4.PowerMockRunner.run(PowerMockRunner.java:53)
	DEBUG_FRAME = org.junit.runners.Suite.runChild(Suite.java:128)
	DEBUG_FRAME = org.junit.runners.Suite.runChild(Suite.java:24)
	DEBUG_FRAME = org.junit.runners.ParentRunner$3.run(ParentRunner.java:193)
	DEBUG_FRAME = org.junit.runners.ParentRunner$1.schedule(ParentRunner.java:52)
	DEBUG_FRAME = org.junit.runners.ParentRunner.runChildren(ParentRunner.java:191)
	DEBUG_FRAME = org.junit.runners.ParentRunner.access$000(ParentRunner.java:42)
	DEBUG_FRAME = org.junit.runners.ParentRunner$2.evaluate(ParentRunner.java:184)
	DEBUG_FRAME = org.junit.runners.ParentRunner.run(ParentRunner.java:236)
	DEBUG_FRAME = org.junit.runners.Suite.runChild(Suite.java:128)
	DEBUG_FRAME = org.junit.runners.Suite.runChild(Suite.java:24)
	DEBUG_FRAME = org.junit.runners.ParentRunner$3.run(ParentRunner.java:193)
	DEBUG_FRAME = org.junit.runners.ParentRunner$1.schedule(ParentRunner.java:52)
	DEBUG_FRAME = org.junit.runners.ParentRunner.runChildren(ParentRunner.java:191)
	DEBUG_FRAME = org.junit.runners.ParentRunner.access$000(ParentRunner.java:42)
	DEBUG_FRAME = org.junit.runners.ParentRunner$2.evaluate(ParentRunner.java:184)
	DEBUG_FRAME = org.junit.runners.ParentRunner.run(ParentRunner.java:236)
	DEBUG_FRAME = org.apache.maven.surefire.junitcore.JUnitCore.run(JUnitCore.java:55)
	DEBUG_FRAME = org.apache.maven.surefire.junitcore.JUnitCoreWrapper.createRequestAndRun(JUnitCoreWrapper.java:137)
	DEBUG_FRAME = org.apache.maven.surefire.junitcore.JUnitCoreWrapper.executeEager(JUnitCoreWrapper.java:107)
	DEBUG_FRAME = org.apache.maven.surefire.junitcore.JUnitCoreWrapper.execute(JUnitCoreWrapper.java:83)
	DEBUG_FRAME = org.apache.maven.surefire.junitcore.JUnitCoreWrapper.execute(JUnitCoreWrapper.java:75)
	DEBUG_FRAME = org.apache.maven.surefire.junitcore.JUnitCoreProvider.invoke(JUnitCoreProvider.java:157)
	DEBUG_FRAME = org.apache.maven.surefire.booter.ForkedBooter.invokeProviderInSameClassLoader(ForkedBooter.java:386)
	DEBUG_FRAME = org.apache.maven.surefire.booter.ForkedBooter.runSuitesInProcess(ForkedBooter.java:323)
	DEBUG_FRAME = org.apache.maven.surefire.booter.ForkedBooter.main(ForkedBooter.java:143)

10:31:51,273 DEBUG [main] AxisOperation:485 - Entry: AxisOperation::getInputAction
10:31:51,273 DEBUG [main] AxisOperation:490 - Debug: AxisOperation::getInputAction - using soapAction
10:31:51,274 DEBUG [main] AxisOperation:506 - Exit: AxisOperation::getInputAction urn:anonOutInOp
10:31:51,274 DEBUG [main] AxisService:872 - mapActionToOperation: Mapping Action to Operation: action: urn:anonOutInOp; operation: org.apache.axis2.description.OutInAxisOperation@328530d4named: {http://ws.apache.org/namespaces/axis2}anonOutInOp
10:31:51,274 DEBUG [main] AxisService:878 - DEBUG_FRAME = org.apache.axis2.util.JavaUtils.callStackToString(JavaUtils.java:564)
	DEBUG_FRAME = org.apache.axis2.description.AxisService.mapActionToOperation(AxisService.java:878)
	DEBUG_FRAME = org.apache.axis2.description.AxisService.addOperation(AxisService.java:728)
	DEBUG_FRAME = org.apache.axis2.client.Stub.addAnonymousOperations(Stub.java:240)
	DEBUG_FRAME = net.ihe.gazelle.ws.client.GazelleTRMServiceStub.populateAxisService(GazelleTRMServiceStub.java:94)
	DEBUG_FRAME = net.ihe.gazelle.ws.client.GazelleTRMServiceStub.<init>(GazelleTRMServiceStub.java:40)
	DEBUG_FRAME = net.ihe.gazelle.ws.client.GazelleTRMServiceStub.<init>(GazelleTRMServiceStub.java:29)
	DEBUG_FRAME = net.ihe.gazelle.ws.client.GazelleTRMServiceStub.<init>(GazelleTRMServiceStub.java:75)
	DEBUG_FRAME = net.ihe.gazelle.ws.client.GazelleTRMServiceClient.<init>(GazelleTRMServiceClient.java:11)
	DEBUG_FRAME = net.ihe.gazelle.wstester.xdstools.ws.Xdstools.getNonce(Xdstools.java:61)
	DEBUG_FRAME = net.ihe.gazelle.wstester.xdstools.Ws.noNonceReturned(Ws.java:79)
	DEBUG_FRAME = sun.reflect.NativeMethodAccessorImpl.invoke0(Native Method)
	DEBUG_FRAME = sun.reflect.NativeMethodAccessorImpl.invoke(NativeMethodAccessorImpl.java:62)
	DEBUG_FRAME = sun.reflect.DelegatingMethodAccessorImpl.invoke(DelegatingMethodAccessorImpl.java:43)
	DEBUG_FRAME = java.lang.reflect.Method.invoke(Method.java:498)
	DEBUG_FRAME = org.junit.internal.runners.TestMethod.invoke(TestMethod.java:66)
	DEBUG_FRAME = org.powermock.modules.junit4.internal.impl.PowerMockJUnit44RunnerDelegateImpl$PowerMockJUnit44MethodRunner.runTestMethod(PowerMockJUnit44RunnerDelegateImpl.java:310)
	DEBUG_FRAME = org.junit.internal.runners.MethodRoadie$2.run(MethodRoadie.java:86)
	DEBUG_FRAME = org.junit.internal.runners.MethodRoadie.runBeforesThenTestThenAfters(MethodRoadie.java:94)
	DEBUG_FRAME = org.powermock.modules.junit4.internal.impl.PowerMockJUnit44RunnerDelegateImpl$PowerMockJUnit44MethodRunner.executeTest(PowerMockJUnit44RunnerDelegateImpl.java:294)
	DEBUG_FRAME = org.powermock.modules.junit4.internal.impl.PowerMockJUnit47RunnerDelegateImpl$PowerMockJUnit47MethodRunner.executeTestInSuper(PowerMockJUnit47RunnerDelegateImpl.java:127)
	DEBUG_FRAME = org.powermock.modules.junit4.internal.impl.PowerMockJUnit47RunnerDelegateImpl$PowerMockJUnit47MethodRunner.executeTest(PowerMockJUnit47RunnerDelegateImpl.java:82)
	DEBUG_FRAME = org.powermock.modules.junit4.internal.impl.PowerMockJUnit44RunnerDelegateImpl$PowerMockJUnit44MethodRunner.runBeforesThenTestThenAfters(PowerMockJUnit44RunnerDelegateImpl.java:282)
	DEBUG_FRAME = org.junit.internal.runners.MethodRoadie.runTest(MethodRoadie.java:84)
	DEBUG_FRAME = org.junit.internal.runners.MethodRoadie.run(MethodRoadie.java:49)
	DEBUG_FRAME = org.powermock.modules.junit4.internal.impl.PowerMockJUnit44RunnerDelegateImpl.invokeTestMethod(PowerMockJUnit44RunnerDelegateImpl.java:207)
	DEBUG_FRAME = org.powermock.modules.junit4.internal.impl.PowerMockJUnit44RunnerDelegateImpl.runMethods(PowerMockJUnit44RunnerDelegateImpl.java:146)
	DEBUG_FRAME = org.powermock.modules.junit4.internal.impl.PowerMockJUnit44RunnerDelegateImpl$1.run(PowerMockJUnit44RunnerDelegateImpl.java:120)
	DEBUG_FRAME = org.junit.internal.runners.ClassRoadie.runUnprotected(ClassRoadie.java:34)
	DEBUG_FRAME = org.junit.internal.runners.ClassRoadie.runProtected(ClassRoadie.java:44)
	DEBUG_FRAME = org.powermock.modules.junit4.internal.impl.PowerMockJUnit44RunnerDelegateImpl.run(PowerMockJUnit44RunnerDelegateImpl.java:118)
	DEBUG_FRAME = org.powermock.modules.junit4.common.internal.impl.JUnit4TestSuiteChunkerImpl.run(JUnit4TestSuiteChunkerImpl.java:101)
	DEBUG_FRAME = org.powermock.modules.junit4.common.internal.impl.AbstractCommonPowerMockRunner.run(AbstractCommonPowerMockRunner.java:53)
	DEBUG_FRAME = org.powermock.modules.junit4.PowerMockRunner.run(PowerMockRunner.java:53)
	DEBUG_FRAME = org.junit.runners.Suite.runChild(Suite.java:128)
	DEBUG_FRAME = org.junit.runners.Suite.runChild(Suite.java:24)
	DEBUG_FRAME = org.junit.runners.ParentRunner$3.run(ParentRunner.java:193)
	DEBUG_FRAME = org.junit.runners.ParentRunner$1.schedule(ParentRunner.java:52)
	DEBUG_FRAME = org.junit.runners.ParentRunner.runChildren(ParentRunner.java:191)
	DEBUG_FRAME = org.junit.runners.ParentRunner.access$000(ParentRunner.java:42)
	DEBUG_FRAME = org.junit.runners.ParentRunner$2.evaluate(ParentRunner.java:184)
	DEBUG_FRAME = org.junit.runners.ParentRunner.run(ParentRunner.java:236)
	DEBUG_FRAME = org.junit.runners.Suite.runChild(Suite.java:128)
	DEBUG_FRAME = org.junit.runners.Suite.runChild(Suite.java:24)
	DEBUG_FRAME = org.junit.runners.ParentRunner$3.run(ParentRunner.java:193)
	DEBUG_FRAME = org.junit.runners.ParentRunner$1.schedule(ParentRunner.java:52)
	DEBUG_FRAME = org.junit.runners.ParentRunner.runChildren(ParentRunner.java:191)
	DEBUG_FRAME = org.junit.runners.ParentRunner.access$000(ParentRunner.java:42)
	DEBUG_FRAME = org.junit.runners.ParentRunner$2.evaluate(ParentRunner.java:184)
	DEBUG_FRAME = org.junit.runners.ParentRunner.run(ParentRunner.java:236)
	DEBUG_FRAME = org.apache.maven.surefire.junitcore.JUnitCore.run(JUnitCore.java:55)
	DEBUG_FRAME = org.apache.maven.surefire.junitcore.JUnitCoreWrapper.createRequestAndRun(JUnitCoreWrapper.java:137)
	DEBUG_FRAME = org.apache.maven.surefire.junitcore.JUnitCoreWrapper.executeEager(JUnitCoreWrapper.java:107)
	DEBUG_FRAME = org.apache.maven.surefire.junitcore.JUnitCoreWrapper.execute(JUnitCoreWrapper.java:83)
	DEBUG_FRAME = org.apache.maven.surefire.junitcore.JUnitCoreWrapper.execute(JUnitCoreWrapper.java:75)
	DEBUG_FRAME = org.apache.maven.surefire.junitcore.JUnitCoreProvider.invoke(JUnitCoreProvider.java:157)
	DEBUG_FRAME = org.apache.maven.surefire.booter.ForkedBooter.invokeProviderInSameClassLoader(ForkedBooter.java:386)
	DEBUG_FRAME = org.apache.maven.surefire.booter.ForkedBooter.runSuitesInProcess(ForkedBooter.java:323)
	DEBUG_FRAME = org.apache.maven.surefire.booter.ForkedBooter.main(ForkedBooter.java:143)

10:31:51,274 DEBUG [main] AxisOperation:485 - Entry: AxisOperation::getInputAction
10:31:51,274 DEBUG [main] AxisOperation:506 - Exit: AxisOperation::getInputAction null
10:31:51,274 DEBUG [main] AxisOperation:467 - Entry: AxisOperation::setSoapAction, previous soapAction: null updated soapAction: urn:getSystemIsATool
10:31:51,275 DEBUG [main] AxisOperation:471 - Exit: AxisOperation::setSoapAction
10:31:51,275 DEBUG [main] AxisService:872 - mapActionToOperation: Mapping Action to Operation: action: getSystemIsATool; operation: org.apache.axis2.description.OutInAxisOperation@4e6da366named: {http://trm.ws.gazelletest.tm.gazelle.ihe.net/}getSystemIsATool
10:31:51,275 DEBUG [main] AxisService:878 - DEBUG_FRAME = org.apache.axis2.util.JavaUtils.callStackToString(JavaUtils.java:564)
	DEBUG_FRAME = org.apache.axis2.description.AxisService.mapActionToOperation(AxisService.java:878)
	DEBUG_FRAME = org.apache.axis2.description.AxisService.addOperation(AxisService.java:724)
	DEBUG_FRAME = net.ihe.gazelle.ws.client.GazelleTRMServiceStub.populateAxisService(GazelleTRMServiceStub.java:106)
	DEBUG_FRAME = net.ihe.gazelle.ws.client.GazelleTRMServiceStub.<init>(GazelleTRMServiceStub.java:40)
	DEBUG_FRAME = net.ihe.gazelle.ws.client.GazelleTRMServiceStub.<init>(GazelleTRMServiceStub.java:29)
	DEBUG_FRAME = net.ihe.gazelle.ws.client.GazelleTRMServiceStub.<init>(GazelleTRMServiceStub.java:75)
	DEBUG_FRAME = net.ihe.gazelle.ws.client.GazelleTRMServiceClient.<init>(GazelleTRMServiceClient.java:11)
	DEBUG_FRAME = net.ihe.gazelle.wstester.xdstools.ws.Xdstools.getNonce(Xdstools.java:61)
	DEBUG_FRAME = net.ihe.gazelle.wstester.xdstools.Ws.noNonceReturned(Ws.java:79)
	DEBUG_FRAME = sun.reflect.NativeMethodAccessorImpl.invoke0(Native Method)
	DEBUG_FRAME = sun.reflect.NativeMethodAccessorImpl.invoke(NativeMethodAccessorImpl.java:62)
	DEBUG_FRAME = sun.reflect.DelegatingMethodAccessorImpl.invoke(DelegatingMethodAccessorImpl.java:43)
	DEBUG_FRAME = java.lang.reflect.Method.invoke(Method.java:498)
	DEBUG_FRAME = org.junit.internal.runners.TestMethod.invoke(TestMethod.java:66)
	DEBUG_FRAME = org.powermock.modules.junit4.internal.impl.PowerMockJUnit44RunnerDelegateImpl$PowerMockJUnit44MethodRunner.runTestMethod(PowerMockJUnit44RunnerDelegateImpl.java:310)
	DEBUG_FRAME = org.junit.internal.runners.MethodRoadie$2.run(MethodRoadie.java:86)
	DEBUG_FRAME = org.junit.internal.runners.MethodRoadie.runBeforesThenTestThenAfters(MethodRoadie.java:94)
	DEBUG_FRAME = org.powermock.modules.junit4.internal.impl.PowerMockJUnit44RunnerDelegateImpl$PowerMockJUnit44MethodRunner.executeTest(PowerMockJUnit44RunnerDelegateImpl.java:294)
	DEBUG_FRAME = org.powermock.modules.junit4.internal.impl.PowerMockJUnit47RunnerDelegateImpl$PowerMockJUnit47MethodRunner.executeTestInSuper(PowerMockJUnit47RunnerDelegateImpl.java:127)
	DEBUG_FRAME = org.powermock.modules.junit4.internal.impl.PowerMockJUnit47RunnerDelegateImpl$PowerMockJUnit47MethodRunner.executeTest(PowerMockJUnit47RunnerDelegateImpl.java:82)
	DEBUG_FRAME = org.powermock.modules.junit4.internal.impl.PowerMockJUnit44RunnerDelegateImpl$PowerMockJUnit44MethodRunner.runBeforesThenTestThenAfters(PowerMockJUnit44RunnerDelegateImpl.java:282)
	DEBUG_FRAME = org.junit.internal.runners.MethodRoadie.runTest(MethodRoadie.java:84)
	DEBUG_FRAME = org.junit.internal.runners.MethodRoadie.run(MethodRoadie.java:49)
	DEBUG_FRAME = org.powermock.modules.junit4.internal.impl.PowerMockJUnit44RunnerDelegateImpl.invokeTestMethod(PowerMockJUnit44RunnerDelegateImpl.java:207)
	DEBUG_FRAME = org.powermock.modules.junit4.internal.impl.PowerMockJUnit44RunnerDelegateImpl.runMethods(PowerMockJUnit44RunnerDelegateImpl.java:146)
	DEBUG_FRAME = org.powermock.modules.junit4.internal.impl.PowerMockJUnit44RunnerDelegateImpl$1.run(PowerMockJUnit44RunnerDelegateImpl.java:120)
	DEBUG_FRAME = org.junit.internal.runners.ClassRoadie.runUnprotected(ClassRoadie.java:34)
	DEBUG_FRAME = org.junit.internal.runners.ClassRoadie.runProtected(ClassRoadie.java:44)
	DEBUG_FRAME = org.powermock.modules.junit4.internal.impl.PowerMockJUnit44RunnerDelegateImpl.run(PowerMockJUnit44RunnerDelegateImpl.java:118)
	DEBUG_FRAME = org.powermock.modules.junit4.common.internal.impl.JUnit4TestSuiteChunkerImpl.run(JUnit4TestSuiteChunkerImpl.java:101)
	DEBUG_FRAME = org.powermock.modules.junit4.common.internal.impl.AbstractCommonPowerMockRunner.run(AbstractCommonPowerMockRunner.java:53)
	DEBUG_FRAME = org.powermock.modules.junit4.PowerMockRunner.run(PowerMockRunner.java:53)
	DEBUG_FRAME = org.junit.runners.Suite.runChild(Suite.java:128)
	DEBUG_FRAME = org.junit.runners.Suite.runChild(Suite.java:24)
	DEBUG_FRAME = org.junit.runners.ParentRunner$3.run(ParentRunner.java:193)
	DEBUG_FRAME = org.junit.runners.ParentRunner$1.schedule(ParentRunner.java:52)
	DEBUG_FRAME = org.junit.runners.ParentRunner.runChildren(ParentRunner.java:191)
	DEBUG_FRAME = org.junit.runners.ParentRunner.access$000(ParentRunner.java:42)
	DEBUG_FRAME = org.junit.runners.ParentRunner$2.evaluate(ParentRunner.java:184)
	DEBUG_FRAME = org.junit.runners.ParentRunner.run(ParentRunner.java:236)
	DEBUG_FRAME = org.junit.runners.Suite.runChild(Suite.java:128)
	DEBUG_FRAME = org.junit.runners.Suite.runChild(Suite.java:24)
	DEBUG_FRAME = org.junit.runners.ParentRunner$3.run(ParentRunner.java:193)
	DEBUG_FRAME = org.junit.runners.ParentRunner$1.schedule(ParentRunner.java:52)
	DEBUG_FRAME = org.junit.runners.ParentRunner.runChildren(ParentRunner.java:191)
	DEBUG_FRAME = org.junit.runners.ParentRunner.access$000(ParentRunner.java:42)
	DEBUG_FRAME = org.junit.runners.ParentRunner$2.evaluate(ParentRunner.java:184)
	DEBUG_FRAME = org.junit.runners.ParentRunner.run(ParentRunner.java:236)
	DEBUG_FRAME = org.apache.maven.surefire.junitcore.JUnitCore.run(JUnitCore.java:55)
	DEBUG_FRAME = org.apache.maven.surefire.junitcore.JUnitCoreWrapper.createRequestAndRun(JUnitCoreWrapper.java:137)
	DEBUG_FRAME = org.apache.maven.surefire.junitcore.JUnitCoreWrapper.executeEager(JUnitCoreWrapper.java:107)
	DEBUG_FRAME = org.apache.maven.surefire.junitcore.JUnitCoreWrapper.execute(JUnitCoreWrapper.java:83)
	DEBUG_FRAME = org.apache.maven.surefire.junitcore.JUnitCoreWrapper.execute(JUnitCoreWrapper.java:75)
	DEBUG_FRAME = org.apache.maven.surefire.junitcore.JUnitCoreProvider.invoke(JUnitCoreProvider.java:157)
	DEBUG_FRAME = org.apache.maven.surefire.booter.ForkedBooter.invokeProviderInSameClassLoader(ForkedBooter.java:386)
	DEBUG_FRAME = org.apache.maven.surefire.booter.ForkedBooter.runSuitesInProcess(ForkedBooter.java:323)
	DEBUG_FRAME = org.apache.maven.surefire.booter.ForkedBooter.main(ForkedBooter.java:143)

10:31:51,275 DEBUG [main] AxisOperation:485 - Entry: AxisOperation::getInputAction
10:31:51,275 DEBUG [main] AxisOperation:490 - Debug: AxisOperation::getInputAction - using soapAction
10:31:51,275 DEBUG [main] AxisOperation:506 - Exit: AxisOperation::getInputAction urn:getSystemIsATool
10:31:51,275 DEBUG [main] AxisService:872 - mapActionToOperation: Mapping Action to Operation: action: urn:getSystemIsATool; operation: org.apache.axis2.description.OutInAxisOperation@4e6da366named: {http://trm.ws.gazelletest.tm.gazelle.ihe.net/}getSystemIsATool
10:31:51,276 DEBUG [main] AxisService:878 - DEBUG_FRAME = org.apache.axis2.util.JavaUtils.callStackToString(JavaUtils.java:564)
	DEBUG_FRAME = org.apache.axis2.description.AxisService.mapActionToOperation(AxisService.java:878)
	DEBUG_FRAME = org.apache.axis2.description.AxisService.addOperation(AxisService.java:728)
	DEBUG_FRAME = net.ihe.gazelle.ws.client.GazelleTRMServiceStub.populateAxisService(GazelleTRMServiceStub.java:106)
	DEBUG_FRAME = net.ihe.gazelle.ws.client.GazelleTRMServiceStub.<init>(GazelleTRMServiceStub.java:40)
	DEBUG_FRAME = net.ihe.gazelle.ws.client.GazelleTRMServiceStub.<init>(GazelleTRMServiceStub.java:29)
	DEBUG_FRAME = net.ihe.gazelle.ws.client.GazelleTRMServiceStub.<init>(GazelleTRMServiceStub.java:75)
	DEBUG_FRAME = net.ihe.gazelle.ws.client.GazelleTRMServiceClient.<init>(GazelleTRMServiceClient.java:11)
	DEBUG_FRAME = net.ihe.gazelle.wstester.xdstools.ws.Xdstools.getNonce(Xdstools.java:61)
	DEBUG_FRAME = net.ihe.gazelle.wstester.xdstools.Ws.noNonceReturned(Ws.java:79)
	DEBUG_FRAME = sun.reflect.NativeMethodAccessorImpl.invoke0(Native Method)
	DEBUG_FRAME = sun.reflect.NativeMethodAccessorImpl.invoke(NativeMethodAccessorImpl.java:62)
	DEBUG_FRAME = sun.reflect.DelegatingMethodAccessorImpl.invoke(DelegatingMethodAccessorImpl.java:43)
	DEBUG_FRAME = java.lang.reflect.Method.invoke(Method.java:498)
	DEBUG_FRAME = org.junit.internal.runners.TestMethod.invoke(TestMethod.java:66)
	DEBUG_FRAME = org.powermock.modules.junit4.internal.impl.PowerMockJUnit44RunnerDelegateImpl$PowerMockJUnit44MethodRunner.runTestMethod(PowerMockJUnit44RunnerDelegateImpl.java:310)
	DEBUG_FRAME = org.junit.internal.runners.MethodRoadie$2.run(MethodRoadie.java:86)
	DEBUG_FRAME = org.junit.internal.runners.MethodRoadie.runBeforesThenTestThenAfters(MethodRoadie.java:94)
	DEBUG_FRAME = org.powermock.modules.junit4.internal.impl.PowerMockJUnit44RunnerDelegateImpl$PowerMockJUnit44MethodRunner.executeTest(PowerMockJUnit44RunnerDelegateImpl.java:294)
	DEBUG_FRAME = org.powermock.modules.junit4.internal.impl.PowerMockJUnit47RunnerDelegateImpl$PowerMockJUnit47MethodRunner.executeTestInSuper(PowerMockJUnit47RunnerDelegateImpl.java:127)
	DEBUG_FRAME = org.powermock.modules.junit4.internal.impl.PowerMockJUnit47RunnerDelegateImpl$PowerMockJUnit47MethodRunner.executeTest(PowerMockJUnit47RunnerDelegateImpl.java:82)
	DEBUG_FRAME = org.powermock.modules.junit4.internal.impl.PowerMockJUnit44RunnerDelegateImpl$PowerMockJUnit44MethodRunner.runBeforesThenTestThenAfters(PowerMockJUnit44RunnerDelegateImpl.java:282)
	DEBUG_FRAME = org.junit.internal.runners.MethodRoadie.runTest(MethodRoadie.java:84)
	DEBUG_FRAME = org.junit.internal.runners.MethodRoadie.run(MethodRoadie.java:49)
	DEBUG_FRAME = org.powermock.modules.junit4.internal.impl.PowerMockJUnit44RunnerDelegateImpl.invokeTestMethod(PowerMockJUnit44RunnerDelegateImpl.java:207)
	DEBUG_FRAME = org.powermock.modules.junit4.internal.impl.PowerMockJUnit44RunnerDelegateImpl.runMethods(PowerMockJUnit44RunnerDelegateImpl.java:146)
	DEBUG_FRAME = org.powermock.modules.junit4.internal.impl.PowerMockJUnit44RunnerDelegateImpl$1.run(PowerMockJUnit44RunnerDelegateImpl.java:120)
	DEBUG_FRAME = org.junit.internal.runners.ClassRoadie.runUnprotected(ClassRoadie.java:34)
	DEBUG_FRAME = org.junit.internal.runners.ClassRoadie.runProtected(ClassRoadie.java:44)
	DEBUG_FRAME = org.powermock.modules.junit4.internal.impl.PowerMockJUnit44RunnerDelegateImpl.run(PowerMockJUnit44RunnerDelegateImpl.java:118)
	DEBUG_FRAME = org.powermock.modules.junit4.common.internal.impl.JUnit4TestSuiteChunkerImpl.run(JUnit4TestSuiteChunkerImpl.java:101)
	DEBUG_FRAME = org.powermock.modules.junit4.common.internal.impl.AbstractCommonPowerMockRunner.run(AbstractCommonPowerMockRunner.java:53)
	DEBUG_FRAME = org.powermock.modules.junit4.PowerMockRunner.run(PowerMockRunner.java:53)
	DEBUG_FRAME = org.junit.runners.Suite.runChild(Suite.java:128)
	DEBUG_FRAME = org.junit.runners.Suite.runChild(Suite.java:24)
	DEBUG_FRAME = org.junit.runners.ParentRunner$3.run(ParentRunner.java:193)
	DEBUG_FRAME = org.junit.runners.ParentRunner$1.schedule(ParentRunner.java:52)
	DEBUG_FRAME = org.junit.runners.ParentRunner.runChildren(ParentRunner.java:191)
	DEBUG_FRAME = org.junit.runners.ParentRunner.access$000(ParentRunner.java:42)
	DEBUG_FRAME = org.junit.runners.ParentRunner$2.evaluate(ParentRunner.java:184)
	DEBUG_FRAME = org.junit.runners.ParentRunner.run(ParentRunner.java:236)
	DEBUG_FRAME = org.junit.runners.Suite.runChild(Suite.java:128)
	DEBUG_FRAME = org.junit.runners.Suite.runChild(Suite.java:24)
	DEBUG_FRAME = org.junit.runners.ParentRunner$3.run(ParentRunner.java:193)
	DEBUG_FRAME = org.junit.runners.ParentRunner$1.schedule(ParentRunner.java:52)
	DEBUG_FRAME = org.junit.runners.ParentRunner.runChildren(ParentRunner.java:191)
	DEBUG_FRAME = org.junit.runners.ParentRunner.access$000(ParentRunner.java:42)
	DEBUG_FRAME = org.junit.runners.ParentRunner$2.evaluate(ParentRunner.java:184)
	DEBUG_FRAME = org.junit.runners.ParentRunner.run(ParentRunner.java:236)
	DEBUG_FRAME = org.apache.maven.surefire.junitcore.JUnitCore.run(JUnitCore.java:55)
	DEBUG_FRAME = org.apache.maven.surefire.junitcore.JUnitCoreWrapper.createRequestAndRun(JUnitCoreWrapper.java:137)
	DEBUG_FRAME = org.apache.maven.surefire.junitcore.JUnitCoreWrapper.executeEager(JUnitCoreWrapper.java:107)
	DEBUG_FRAME = org.apache.maven.surefire.junitcore.JUnitCoreWrapper.execute(JUnitCoreWrapper.java:83)
	DEBUG_FRAME = org.apache.maven.surefire.junitcore.JUnitCoreWrapper.execute(JUnitCoreWrapper.java:75)
	DEBUG_FRAME = org.apache.maven.surefire.junitcore.JUnitCoreProvider.invoke(JUnitCoreProvider.java:157)
	DEBUG_FRAME = org.apache.maven.surefire.booter.ForkedBooter.invokeProviderInSameClassLoader(ForkedBooter.java:386)
	DEBUG_FRAME = org.apache.maven.surefire.booter.ForkedBooter.runSuitesInProcess(ForkedBooter.java:323)
	DEBUG_FRAME = org.apache.maven.surefire.booter.ForkedBooter.main(ForkedBooter.java:143)

10:31:51,276 DEBUG [main] AxisOperation:485 - Entry: AxisOperation::getInputAction
10:31:51,276 DEBUG [main] AxisOperation:506 - Exit: AxisOperation::getInputAction null
10:31:51,276 DEBUG [main] AxisOperation:467 - Entry: AxisOperation::setSoapAction, previous soapAction: null updated soapAction: urn:getTestInstancesByTestingSession
10:31:51,276 DEBUG [main] AxisOperation:471 - Exit: AxisOperation::setSoapAction
10:31:51,276 DEBUG [main] AxisService:872 - mapActionToOperation: Mapping Action to Operation: action: getTestInstancesByTestingSession; operation: org.apache.axis2.description.OutInAxisOperation@25247961named: {http://trm.ws.gazelletest.tm.gazelle.ihe.net/}getTestInstancesByTestingSession
10:31:51,276 DEBUG [main] AxisService:878 - DEBUG_FRAME = org.apache.axis2.util.JavaUtils.callStackToString(JavaUtils.java:564)
	DEBUG_FRAME = org.apache.axis2.description.AxisService.mapActionToOperation(AxisService.java:878)
	DEBUG_FRAME = org.apache.axis2.description.AxisService.addOperation(AxisService.java:724)
	DEBUG_FRAME = net.ihe.gazelle.ws.client.GazelleTRMServiceStub.populateAxisService(GazelleTRMServiceStub.java:115)
	DEBUG_FRAME = net.ihe.gazelle.ws.client.GazelleTRMServiceStub.<init>(GazelleTRMServiceStub.java:40)
	DEBUG_FRAME = net.ihe.gazelle.ws.client.GazelleTRMServiceStub.<init>(GazelleTRMServiceStub.java:29)
	DEBUG_FRAME = net.ihe.gazelle.ws.client.GazelleTRMServiceStub.<init>(GazelleTRMServiceStub.java:75)
	DEBUG_FRAME = net.ihe.gazelle.ws.client.GazelleTRMServiceClient.<init>(GazelleTRMServiceClient.java:11)
	DEBUG_FRAME = net.ihe.gazelle.wstester.xdstools.ws.Xdstools.getNonce(Xdstools.java:61)
	DEBUG_FRAME = net.ihe.gazelle.wstester.xdstools.Ws.noNonceReturned(Ws.java:79)
	DEBUG_FRAME = sun.reflect.NativeMethodAccessorImpl.invoke0(Native Method)
	DEBUG_FRAME = sun.reflect.NativeMethodAccessorImpl.invoke(NativeMethodAccessorImpl.java:62)
	DEBUG_FRAME = sun.reflect.DelegatingMethodAccessorImpl.invoke(DelegatingMethodAccessorImpl.java:43)
	DEBUG_FRAME = java.lang.reflect.Method.invoke(Method.java:498)
	DEBUG_FRAME = org.junit.internal.runners.TestMethod.invoke(TestMethod.java:66)
	DEBUG_FRAME = org.powermock.modules.junit4.internal.impl.PowerMockJUnit44RunnerDelegateImpl$PowerMockJUnit44MethodRunner.runTestMethod(PowerMockJUnit44RunnerDelegateImpl.java:310)
	DEBUG_FRAME = org.junit.internal.runners.MethodRoadie$2.run(MethodRoadie.java:86)
	DEBUG_FRAME = org.junit.internal.runners.MethodRoadie.runBeforesThenTestThenAfters(MethodRoadie.java:94)
	DEBUG_FRAME = org.powermock.modules.junit4.internal.impl.PowerMockJUnit44RunnerDelegateImpl$PowerMockJUnit44MethodRunner.executeTest(PowerMockJUnit44RunnerDelegateImpl.java:294)
	DEBUG_FRAME = org.powermock.modules.junit4.internal.impl.PowerMockJUnit47RunnerDelegateImpl$PowerMockJUnit47MethodRunner.executeTestInSuper(PowerMockJUnit47RunnerDelegateImpl.java:127)
	DEBUG_FRAME = org.powermock.modules.junit4.internal.impl.PowerMockJUnit47RunnerDelegateImpl$PowerMockJUnit47MethodRunner.executeTest(PowerMockJUnit47RunnerDelegateImpl.java:82)
	DEBUG_FRAME = org.powermock.modules.junit4.internal.impl.PowerMockJUnit44RunnerDelegateImpl$PowerMockJUnit44MethodRunner.runBeforesThenTestThenAfters(PowerMockJUnit44RunnerDelegateImpl.java:282)
	DEBUG_FRAME = org.junit.internal.runners.MethodRoadie.runTest(MethodRoadie.java:84)
	DEBUG_FRAME = org.junit.internal.runners.MethodRoadie.run(MethodRoadie.java:49)
	DEBUG_FRAME = org.powermock.modules.junit4.internal.impl.PowerMockJUnit44RunnerDelegateImpl.invokeTestMethod(PowerMockJUnit44RunnerDelegateImpl.java:207)
	DEBUG_FRAME = org.powermock.modules.junit4.internal.impl.PowerMockJUnit44RunnerDelegateImpl.runMethods(PowerMockJUnit44RunnerDelegateImpl.java:146)
	DEBUG_FRAME = org.powermock.modules.junit4.internal.impl.PowerMockJUnit44RunnerDelegateImpl$1.run(PowerMockJUnit44RunnerDelegateImpl.java:120)
	DEBUG_FRAME = org.junit.internal.runners.ClassRoadie.runUnprotected(ClassRoadie.java:34)
	DEBUG_FRAME = org.junit.internal.runners.ClassRoadie.runProtected(ClassRoadie.java:44)
	DEBUG_FRAME = org.powermock.modules.junit4.internal.impl.PowerMockJUnit44RunnerDelegateImpl.run(PowerMockJUnit44RunnerDelegateImpl.java:118)
	DEBUG_FRAME = org.powermock.modules.junit4.common.internal.impl.JUnit4TestSuiteChunkerImpl.run(JUnit4TestSuiteChunkerImpl.java:101)
	DEBUG_FRAME = org.powermock.modules.junit4.common.internal.impl.AbstractCommonPowerMockRunner.run(AbstractCommonPowerMockRunner.java:53)
	DEBUG_FRAME = org.powermock.modules.junit4.PowerMockRunner.run(PowerMockRunner.java:53)
	DEBUG_FRAME = org.junit.runners.Suite.runChild(Suite.java:128)
	DEBUG_FRAME = org.junit.runners.Suite.runChild(Suite.java:24)
	DEBUG_FRAME = org.junit.runners.ParentRunner$3.run(ParentRunner.java:193)
	DEBUG_FRAME = org.junit.runners.ParentRunner$1.schedule(ParentRunner.java:52)
	DEBUG_FRAME = org.junit.runners.ParentRunner.runChildren(ParentRunner.java:191)
	DEBUG_FRAME = org.junit.runners.ParentRunner.access$000(ParentRunner.java:42)
	DEBUG_FRAME = org.junit.runners.ParentRunner$2.evaluate(ParentRunner.java:184)
	DEBUG_FRAME = org.junit.runners.ParentRunner.run(ParentRunner.java:236)
	DEBUG_FRAME = org.junit.runners.Suite.runChild(Suite.java:128)
	DEBUG_FRAME = org.junit.runners.Suite.runChild(Suite.java:24)
	DEBUG_FRAME = org.junit.runners.ParentRunner$3.run(ParentRunner.java:193)
	DEBUG_FRAME = org.junit.runners.ParentRunner$1.schedule(ParentRunner.java:52)
	DEBUG_FRAME = org.junit.runners.ParentRunner.runChildren(ParentRunner.java:191)
	DEBUG_FRAME = org.junit.runners.ParentRunner.access$000(ParentRunner.java:42)
	DEBUG_FRAME = org.junit.runners.ParentRunner$2.evaluate(ParentRunner.java:184)
	DEBUG_FRAME = org.junit.runners.ParentRunner.run(ParentRunner.java:236)
	DEBUG_FRAME = org.apache.maven.surefire.junitcore.JUnitCore.run(JUnitCore.java:55)
	DEBUG_FRAME = org.apache.maven.surefire.junitcore.JUnitCoreWrapper.createRequestAndRun(JUnitCoreWrapper.java:137)
	DEBUG_FRAME = org.apache.maven.surefire.junitcore.JUnitCoreWrapper.executeEager(JUnitCoreWrapper.java:107)
	DEBUG_FRAME = org.apache.maven.surefire.junitcore.JUnitCoreWrapper.execute(JUnitCoreWrapper.java:83)
	DEBUG_FRAME = org.apache.maven.surefire.junitcore.JUnitCoreWrapper.execute(JUnitCoreWrapper.java:75)
	DEBUG_FRAME = org.apache.maven.surefire.junitcore.JUnitCoreProvider.invoke(JUnitCoreProvider.java:157)
	DEBUG_FRAME = org.apache.maven.surefire.booter.ForkedBooter.invokeProviderInSameClassLoader(ForkedBooter.java:386)
	DEBUG_FRAME = org.apache.maven.surefire.booter.ForkedBooter.runSuitesInProcess(ForkedBooter.java:323)
	DEBUG_FRAME = org.apache.maven.surefire.booter.ForkedBooter.main(ForkedBooter.java:143)

10:31:51,277 DEBUG [main] AxisOperation:485 - Entry: AxisOperation::getInputAction
10:31:51,277 DEBUG [main] AxisOperation:490 - Debug: AxisOperation::getInputAction - using soapAction
10:31:51,277 DEBUG [main] AxisOperation:506 - Exit: AxisOperation::getInputAction urn:getTestInstancesByTestingSession
10:31:51,277 DEBUG [main] AxisService:872 - mapActionToOperation: Mapping Action to Operation: action: urn:getTestInstancesByTestingSession; operation: org.apache.axis2.description.OutInAxisOperation@25247961named: {http://trm.ws.gazelletest.tm.gazelle.ihe.net/}getTestInstancesByTestingSession
10:31:51,277 DEBUG [main] AxisService:878 - DEBUG_FRAME = org.apache.axis2.util.JavaUtils.callStackToString(JavaUtils.java:564)
	DEBUG_FRAME = org.apache.axis2.description.AxisService.mapActionToOperation(AxisService.java:878)
	DEBUG_FRAME = org.apache.axis2.description.AxisService.addOperation(AxisService.java:728)
	DEBUG_FRAME = net.ihe.gazelle.ws.client.GazelleTRMServiceStub.populateAxisService(GazelleTRMServiceStub.java:115)
	DEBUG_FRAME = net.ihe.gazelle.ws.client.GazelleTRMServiceStub.<init>(GazelleTRMServiceStub.java:40)
	DEBUG_FRAME = net.ihe.gazelle.ws.client.GazelleTRMServiceStub.<init>(GazelleTRMServiceStub.java:29)
	DEBUG_FRAME = net.ihe.gazelle.ws.client.GazelleTRMServiceStub.<init>(GazelleTRMServiceStub.java:75)
	DEBUG_FRAME = net.ihe.gazelle.ws.client.GazelleTRMServiceClient.<init>(GazelleTRMServiceClient.java:11)
	DEBUG_FRAME = net.ihe.gazelle.wstester.xdstools.ws.Xdstools.getNonce(Xdstools.java:61)
	DEBUG_FRAME = net.ihe.gazelle.wstester.xdstools.Ws.noNonceReturned(Ws.java:79)
	DEBUG_FRAME = sun.reflect.NativeMethodAccessorImpl.invoke0(Native Method)
	DEBUG_FRAME = sun.reflect.NativeMethodAccessorImpl.invoke(NativeMethodAccessorImpl.java:62)
	DEBUG_FRAME = sun.reflect.DelegatingMethodAccessorImpl.invoke(DelegatingMethodAccessorImpl.java:43)
	DEBUG_FRAME = java.lang.reflect.Method.invoke(Method.java:498)
	DEBUG_FRAME = org.junit.internal.runners.TestMethod.invoke(TestMethod.java:66)
	DEBUG_FRAME = org.powermock.modules.junit4.internal.impl.PowerMockJUnit44RunnerDelegateImpl$PowerMockJUnit44MethodRunner.runTestMethod(PowerMockJUnit44RunnerDelegateImpl.java:310)
	DEBUG_FRAME = org.junit.internal.runners.MethodRoadie$2.run(MethodRoadie.java:86)
	DEBUG_FRAME = org.junit.internal.runners.MethodRoadie.runBeforesThenTestThenAfters(MethodRoadie.java:94)
	DEBUG_FRAME = org.powermock.modules.junit4.internal.impl.PowerMockJUnit44RunnerDelegateImpl$PowerMockJUnit44MethodRunner.executeTest(PowerMockJUnit44RunnerDelegateImpl.java:294)
	DEBUG_FRAME = org.powermock.modules.junit4.internal.impl.PowerMockJUnit47RunnerDelegateImpl$PowerMockJUnit47MethodRunner.executeTestInSuper(PowerMockJUnit47RunnerDelegateImpl.java:127)
	DEBUG_FRAME = org.powermock.modules.junit4.internal.impl.PowerMockJUnit47RunnerDelegateImpl$PowerMockJUnit47MethodRunner.executeTest(PowerMockJUnit47RunnerDelegateImpl.java:82)
	DEBUG_FRAME = org.powermock.modules.junit4.internal.impl.PowerMockJUnit44RunnerDelegateImpl$PowerMockJUnit44MethodRunner.runBeforesThenTestThenAfters(PowerMockJUnit44RunnerDelegateImpl.java:282)
	DEBUG_FRAME = org.junit.internal.runners.MethodRoadie.runTest(MethodRoadie.java:84)
	DEBUG_FRAME = org.junit.internal.runners.MethodRoadie.run(MethodRoadie.java:49)
	DEBUG_FRAME = org.powermock.modules.junit4.internal.impl.PowerMockJUnit44RunnerDelegateImpl.invokeTestMethod(PowerMockJUnit44RunnerDelegateImpl.java:207)
	DEBUG_FRAME = org.powermock.modules.junit4.internal.impl.PowerMockJUnit44RunnerDelegateImpl.runMethods(PowerMockJUnit44RunnerDelegateImpl.java:146)
	DEBUG_FRAME = org.powermock.modules.junit4.internal.impl.PowerMockJUnit44RunnerDelegateImpl$1.run(PowerMockJUnit44RunnerDelegateImpl.java:120)
	DEBUG_FRAME = org.junit.internal.runners.ClassRoadie.runUnprotected(ClassRoadie.java:34)
	DEBUG_FRAME = org.junit.internal.runners.ClassRoadie.runProtected(ClassRoadie.java:44)
	DEBUG_FRAME = org.powermock.modules.junit4.internal.impl.PowerMockJUnit44RunnerDelegateImpl.run(PowerMockJUnit44RunnerDelegateImpl.java:118)
	DEBUG_FRAME = org.powermock.modules.junit4.common.internal.impl.JUnit4TestSuiteChunkerImpl.run(JUnit4TestSuiteChunkerImpl.java:101)
	DEBUG_FRAME = org.powermock.modules.junit4.common.internal.impl.AbstractCommonPowerMockRunner.run(AbstractCommonPowerMockRunner.java:53)
	DEBUG_FRAME = org.powermock.modules.junit4.PowerMockRunner.run(PowerMockRunner.java:53)
	DEBUG_FRAME = org.junit.runners.Suite.runChild(Suite.java:128)
	DEBUG_FRAME = org.junit.runners.Suite.runChild(Suite.java:24)
	DEBUG_FRAME = org.junit.runners.ParentRunner$3.run(ParentRunner.java:193)
	DEBUG_FRAME = org.junit.runners.ParentRunner$1.schedule(ParentRunner.java:52)
	DEBUG_FRAME = org.junit.runners.ParentRunner.runChildren(ParentRunner.java:191)
	DEBUG_FRAME = org.junit.runners.ParentRunner.access$000(ParentRunner.java:42)
	DEBUG_FRAME = org.junit.runners.ParentRunner$2.evaluate(ParentRunner.java:184)
	DEBUG_FRAME = org.junit.runners.ParentRunner.run(ParentRunner.java:236)
	DEBUG_FRAME = org.junit.runners.Suite.runChild(Suite.java:128)
	DEBUG_FRAME = org.junit.runners.Suite.runChild(Suite.java:24)
	DEBUG_FRAME = org.junit.runners.ParentRunner$3.run(ParentRunner.java:193)
	DEBUG_FRAME = org.junit.runners.ParentRunner$1.schedule(ParentRunner.java:52)
	DEBUG_FRAME = org.junit.runners.ParentRunner.runChildren(ParentRunner.java:191)
	DEBUG_FRAME = org.junit.runners.ParentRunner.access$000(ParentRunner.java:42)
	DEBUG_FRAME = org.junit.runners.ParentRunner$2.evaluate(ParentRunner.java:184)
	DEBUG_FRAME = org.junit.runners.ParentRunner.run(ParentRunner.java:236)
	DEBUG_FRAME = org.apache.maven.surefire.junitcore.JUnitCore.run(JUnitCore.java:55)
	DEBUG_FRAME = org.apache.maven.surefire.junitcore.JUnitCoreWrapper.createRequestAndRun(JUnitCoreWrapper.java:137)
	DEBUG_FRAME = org.apache.maven.surefire.junitcore.JUnitCoreWrapper.executeEager(JUnitCoreWrapper.java:107)
	DEBUG_FRAME = org.apache.maven.surefire.junitcore.JUnitCoreWrapper.execute(JUnitCoreWrapper.java:83)
	DEBUG_FRAME = org.apache.maven.surefire.junitcore.JUnitCoreWrapper.execute(JUnitCoreWrapper.java:75)
	DEBUG_FRAME = org.apache.maven.surefire.junitcore.JUnitCoreProvider.invoke(JUnitCoreProvider.java:157)
	DEBUG_FRAME = org.apache.maven.surefire.booter.ForkedBooter.invokeProviderInSameClassLoader(ForkedBooter.java:386)
	DEBUG_FRAME = org.apache.maven.surefire.booter.ForkedBooter.runSuitesInProcess(ForkedBooter.java:323)
	DEBUG_FRAME = org.apache.maven.surefire.booter.ForkedBooter.main(ForkedBooter.java:143)

10:31:51,277 DEBUG [main] AxisOperation:485 - Entry: AxisOperation::getInputAction
10:31:51,277 DEBUG [main] AxisOperation:506 - Exit: AxisOperation::getInputAction null
10:31:51,277 DEBUG [main] AxisOperation:467 - Entry: AxisOperation::setSoapAction, previous soapAction: null updated soapAction: urn:getTestInstanceById
10:31:51,277 DEBUG [main] AxisOperation:471 - Exit: AxisOperation::setSoapAction
10:31:51,278 DEBUG [main] AxisService:872 - mapActionToOperation: Mapping Action to Operation: action: getTestInstanceById; operation: org.apache.axis2.description.OutInAxisOperation@23aad2f2named: {http://trm.ws.gazelletest.tm.gazelle.ihe.net/}getTestInstanceById
10:31:51,278 DEBUG [main] AxisService:878 - DEBUG_FRAME = org.apache.axis2.util.JavaUtils.callStackToString(JavaUtils.java:564)
	DEBUG_FRAME = org.apache.axis2.description.AxisService.mapActionToOperation(AxisService.java:878)
	DEBUG_FRAME = org.apache.axis2.description.AxisService.addOperation(AxisService.java:724)
	DEBUG_FRAME = net.ihe.gazelle.ws.client.GazelleTRMServiceStub.populateAxisService(GazelleTRMServiceStub.java:124)
	DEBUG_FRAME = net.ihe.gazelle.ws.client.GazelleTRMServiceStub.<init>(GazelleTRMServiceStub.java:40)
	DEBUG_FRAME = net.ihe.gazelle.ws.client.GazelleTRMServiceStub.<init>(GazelleTRMServiceStub.java:29)
	DEBUG_FRAME = net.ihe.gazelle.ws.client.GazelleTRMServiceStub.<init>(GazelleTRMServiceStub.java:75)
	DEBUG_FRAME = net.ihe.gazelle.ws.client.GazelleTRMServiceClient.<init>(GazelleTRMServiceClient.java:11)
	DEBUG_FRAME = net.ihe.gazelle.wstester.xdstools.ws.Xdstools.getNonce(Xdstools.java:61)
	DEBUG_FRAME = net.ihe.gazelle.wstester.xdstools.Ws.noNonceReturned(Ws.java:79)
	DEBUG_FRAME = sun.reflect.NativeMethodAccessorImpl.invoke0(Native Method)
	DEBUG_FRAME = sun.reflect.NativeMethodAccessorImpl.invoke(NativeMethodAccessorImpl.java:62)
	DEBUG_FRAME = sun.reflect.DelegatingMethodAccessorImpl.invoke(DelegatingMethodAccessorImpl.java:43)
	DEBUG_FRAME = java.lang.reflect.Method.invoke(Method.java:498)
	DEBUG_FRAME = org.junit.internal.runners.TestMethod.invoke(TestMethod.java:66)
	DEBUG_FRAME = org.powermock.modules.junit4.internal.impl.PowerMockJUnit44RunnerDelegateImpl$PowerMockJUnit44MethodRunner.runTestMethod(PowerMockJUnit44RunnerDelegateImpl.java:310)
	DEBUG_FRAME = org.junit.internal.runners.MethodRoadie$2.run(MethodRoadie.java:86)
	DEBUG_FRAME = org.junit.internal.runners.MethodRoadie.runBeforesThenTestThenAfters(MethodRoadie.java:94)
	DEBUG_FRAME = org.powermock.modules.junit4.internal.impl.PowerMockJUnit44RunnerDelegateImpl$PowerMockJUnit44MethodRunner.executeTest(PowerMockJUnit44RunnerDelegateImpl.java:294)
	DEBUG_FRAME = org.powermock.modules.junit4.internal.impl.PowerMockJUnit47RunnerDelegateImpl$PowerMockJUnit47MethodRunner.executeTestInSuper(PowerMockJUnit47RunnerDelegateImpl.java:127)
	DEBUG_FRAME = org.powermock.modules.junit4.internal.impl.PowerMockJUnit47RunnerDelegateImpl$PowerMockJUnit47MethodRunner.executeTest(PowerMockJUnit47RunnerDelegateImpl.java:82)
	DEBUG_FRAME = org.powermock.modules.junit4.internal.impl.PowerMockJUnit44RunnerDelegateImpl$PowerMockJUnit44MethodRunner.runBeforesThenTestThenAfters(PowerMockJUnit44RunnerDelegateImpl.java:282)
	DEBUG_FRAME = org.junit.internal.runners.MethodRoadie.runTest(MethodRoadie.java:84)
	DEBUG_FRAME = org.junit.internal.runners.MethodRoadie.run(MethodRoadie.java:49)
	DEBUG_FRAME = org.powermock.modules.junit4.internal.impl.PowerMockJUnit44RunnerDelegateImpl.invokeTestMethod(PowerMockJUnit44RunnerDelegateImpl.java:207)
	DEBUG_FRAME = org.powermock.modules.junit4.internal.impl.PowerMockJUnit44RunnerDelegateImpl.runMethods(PowerMockJUnit44RunnerDelegateImpl.java:146)
	DEBUG_FRAME = org.powermock.modules.junit4.internal.impl.PowerMockJUnit44RunnerDelegateImpl$1.run(PowerMockJUnit44RunnerDelegateImpl.java:120)
	DEBUG_FRAME = org.junit.internal.runners.ClassRoadie.runUnprotected(ClassRoadie.java:34)
	DEBUG_FRAME = org.junit.internal.runners.ClassRoadie.runProtected(ClassRoadie.java:44)
	DEBUG_FRAME = org.powermock.modules.junit4.internal.impl.PowerMockJUnit44RunnerDelegateImpl.run(PowerMockJUnit44RunnerDelegateImpl.java:118)
	DEBUG_FRAME = org.powermock.modules.junit4.common.internal.impl.JUnit4TestSuiteChunkerImpl.run(JUnit4TestSuiteChunkerImpl.java:101)
	DEBUG_FRAME = org.powermock.modules.junit4.common.internal.impl.AbstractCommonPowerMockRunner.run(AbstractCommonPowerMockRunner.java:53)
	DEBUG_FRAME = org.powermock.modules.junit4.PowerMockRunner.run(PowerMockRunner.java:53)
	DEBUG_FRAME = org.junit.runners.Suite.runChild(Suite.java:128)
	DEBUG_FRAME = org.junit.runners.Suite.runChild(Suite.java:24)
	DEBUG_FRAME = org.junit.runners.ParentRunner$3.run(ParentRunner.java:193)
	DEBUG_FRAME = org.junit.runners.ParentRunner$1.schedule(ParentRunner.java:52)
	DEBUG_FRAME = org.junit.runners.ParentRunner.runChildren(ParentRunner.java:191)
	DEBUG_FRAME = org.junit.runners.ParentRunner.access$000(ParentRunner.java:42)
	DEBUG_FRAME = org.junit.runners.ParentRunner$2.evaluate(ParentRunner.java:184)
	DEBUG_FRAME = org.junit.runners.ParentRunner.run(ParentRunner.java:236)
	DEBUG_FRAME = org.junit.runners.Suite.runChild(Suite.java:128)
	DEBUG_FRAME = org.junit.runners.Suite.runChild(Suite.java:24)
	DEBUG_FRAME = org.junit.runners.ParentRunner$3.run(ParentRunner.java:193)
	DEBUG_FRAME = org.junit.runners.ParentRunner$1.schedule(ParentRunner.java:52)
	DEBUG_FRAME = org.junit.runners.ParentRunner.runChildren(ParentRunner.java:191)
	DEBUG_FRAME = org.junit.runners.ParentRunner.access$000(ParentRunner.java:42)
	DEBUG_FRAME = org.junit.runners.ParentRunner$2.evaluate(ParentRunner.java:184)
	DEBUG_FRAME = org.junit.runners.ParentRunner.run(ParentRunner.java:236)
	DEBUG_FRAME = org.apache.maven.surefire.junitcore.JUnitCore.run(JUnitCore.java:55)
	DEBUG_FRAME = org.apache.maven.surefire.junitcore.JUnitCoreWrapper.createRequestAndRun(JUnitCoreWrapper.java:137)
	DEBUG_FRAME = org.apache.maven.surefire.junitcore.JUnitCoreWrapper.executeEager(JUnitCoreWrapper.java:107)
	DEBUG_FRAME = org.apache.maven.surefire.junitcore.JUnitCoreWrapper.execute(JUnitCoreWrapper.java:83)
	DEBUG_FRAME = org.apache.maven.surefire.junitcore.JUnitCoreWrapper.execute(JUnitCoreWrapper.java:75)
	DEBUG_FRAME = org.apache.maven.surefire.junitcore.JUnitCoreProvider.invoke(JUnitCoreProvider.java:157)
	DEBUG_FRAME = org.apache.maven.surefire.booter.ForkedBooter.invokeProviderInSameClassLoader(ForkedBooter.java:386)
	DEBUG_FRAME = org.apache.maven.surefire.booter.ForkedBooter.runSuitesInProcess(ForkedBooter.java:323)
	DEBUG_FRAME = org.apache.maven.surefire.booter.ForkedBooter.main(ForkedBooter.java:143)

10:31:51,278 DEBUG [main] AxisOperation:485 - Entry: AxisOperation::getInputAction
10:31:51,278 DEBUG [main] AxisOperation:490 - Debug: AxisOperation::getInputAction - using soapAction
10:31:51,278 DEBUG [main] AxisOperation:506 - Exit: AxisOperation::getInputAction urn:getTestInstanceById
10:31:51,278 DEBUG [main] AxisService:872 - mapActionToOperation: Mapping Action to Operation: action: urn:getTestInstanceById; operation: org.apache.axis2.description.OutInAxisOperation@23aad2f2named: {http://trm.ws.gazelletest.tm.gazelle.ihe.net/}getTestInstanceById
10:31:51,278 DEBUG [main] AxisService:878 - DEBUG_FRAME = org.apache.axis2.util.JavaUtils.callStackToString(JavaUtils.java:564)
	DEBUG_FRAME = org.apache.axis2.description.AxisService.mapActionToOperation(AxisService.java:878)
	DEBUG_FRAME = org.apache.axis2.description.AxisService.addOperation(AxisService.java:728)
	DEBUG_FRAME = net.ihe.gazelle.ws.client.GazelleTRMServiceStub.populateAxisService(GazelleTRMServiceStub.java:124)
	DEBUG_FRAME = net.ihe.gazelle.ws.client.GazelleTRMServiceStub.<init>(GazelleTRMServiceStub.java:40)
	DEBUG_FRAME = net.ihe.gazelle.ws.client.GazelleTRMServiceStub.<init>(GazelleTRMServiceStub.java:29)
	DEBUG_FRAME = net.ihe.gazelle.ws.client.GazelleTRMServiceStub.<init>(GazelleTRMServiceStub.java:75)
	DEBUG_FRAME = net.ihe.gazelle.ws.client.GazelleTRMServiceClient.<init>(GazelleTRMServiceClient.java:11)
	DEBUG_FRAME = net.ihe.gazelle.wstester.xdstools.ws.Xdstools.getNonce(Xdstools.java:61)
	DEBUG_FRAME = net.ihe.gazelle.wstester.xdstools.Ws.noNonceReturned(Ws.java:79)
	DEBUG_FRAME = sun.reflect.NativeMethodAccessorImpl.invoke0(Native Method)
	DEBUG_FRAME = sun.reflect.NativeMethodAccessorImpl.invoke(NativeMethodAccessorImpl.java:62)
	DEBUG_FRAME = sun.reflect.DelegatingMethodAccessorImpl.invoke(DelegatingMethodAccessorImpl.java:43)
	DEBUG_FRAME = java.lang.reflect.Method.invoke(Method.java:498)
	DEBUG_FRAME = org.junit.internal.runners.TestMethod.invoke(TestMethod.java:66)
	DEBUG_FRAME = org.powermock.modules.junit4.internal.impl.PowerMockJUnit44RunnerDelegateImpl$PowerMockJUnit44MethodRunner.runTestMethod(PowerMockJUnit44RunnerDelegateImpl.java:310)
	DEBUG_FRAME = org.junit.internal.runners.MethodRoadie$2.run(MethodRoadie.java:86)
	DEBUG_FRAME = org.junit.internal.runners.MethodRoadie.runBeforesThenTestThenAfters(MethodRoadie.java:94)
	DEBUG_FRAME = org.powermock.modules.junit4.internal.impl.PowerMockJUnit44RunnerDelegateImpl$PowerMockJUnit44MethodRunner.executeTest(PowerMockJUnit44RunnerDelegateImpl.java:294)
	DEBUG_FRAME = org.powermock.modules.junit4.internal.impl.PowerMockJUnit47RunnerDelegateImpl$PowerMockJUnit47MethodRunner.executeTestInSuper(PowerMockJUnit47RunnerDelegateImpl.java:127)
	DEBUG_FRAME = org.powermock.modules.junit4.internal.impl.PowerMockJUnit47RunnerDelegateImpl$PowerMockJUnit47MethodRunner.executeTest(PowerMockJUnit47RunnerDelegateImpl.java:82)
	DEBUG_FRAME = org.powermock.modules.junit4.internal.impl.PowerMockJUnit44RunnerDelegateImpl$PowerMockJUnit44MethodRunner.runBeforesThenTestThenAfters(PowerMockJUnit44RunnerDelegateImpl.java:282)
	DEBUG_FRAME = org.junit.internal.runners.MethodRoadie.runTest(MethodRoadie.java:84)
	DEBUG_FRAME = org.junit.internal.runners.MethodRoadie.run(MethodRoadie.java:49)
	DEBUG_FRAME = org.powermock.modules.junit4.internal.impl.PowerMockJUnit44RunnerDelegateImpl.invokeTestMethod(PowerMockJUnit44RunnerDelegateImpl.java:207)
	DEBUG_FRAME = org.powermock.modules.junit4.internal.impl.PowerMockJUnit44RunnerDelegateImpl.runMethods(PowerMockJUnit44RunnerDelegateImpl.java:146)
	DEBUG_FRAME = org.powermock.modules.junit4.internal.impl.PowerMockJUnit44RunnerDelegateImpl$1.run(PowerMockJUnit44RunnerDelegateImpl.java:120)
	DEBUG_FRAME = org.junit.internal.runners.ClassRoadie.runUnprotected(ClassRoadie.java:34)
	DEBUG_FRAME = org.junit.internal.runners.ClassRoadie.runProtected(ClassRoadie.java:44)
	DEBUG_FRAME = org.powermock.modules.junit4.internal.impl.PowerMockJUnit44RunnerDelegateImpl.run(PowerMockJUnit44RunnerDelegateImpl.java:118)
	DEBUG_FRAME = org.powermock.modules.junit4.common.internal.impl.JUnit4TestSuiteChunkerImpl.run(JUnit4TestSuiteChunkerImpl.java:101)
	DEBUG_FRAME = org.powermock.modules.junit4.common.internal.impl.AbstractCommonPowerMockRunner.run(AbstractCommonPowerMockRunner.java:53)
	DEBUG_FRAME = org.powermock.modules.junit4.PowerMockRunner.run(PowerMockRunner.java:53)
	DEBUG_FRAME = org.junit.runners.Suite.runChild(Suite.java:128)
	DEBUG_FRAME = org.junit.runners.Suite.runChild(Suite.java:24)
	DEBUG_FRAME = org.junit.runners.ParentRunner$3.run(ParentRunner.java:193)
	DEBUG_FRAME = org.junit.runners.ParentRunner$1.schedule(ParentRunner.java:52)
	DEBUG_FRAME = org.junit.runners.ParentRunner.runChildren(ParentRunner.java:191)
	DEBUG_FRAME = org.junit.runners.ParentRunner.access$000(ParentRunner.java:42)
	DEBUG_FRAME = org.junit.runners.ParentRunner$2.evaluate(ParentRunner.java:184)
	DEBUG_FRAME = org.junit.runners.ParentRunner.run(ParentRunner.java:236)
	DEBUG_FRAME = org.junit.runners.Suite.runChild(Suite.java:128)
	DEBUG_FRAME = org.junit.runners.Suite.runChild(Suite.java:24)
	DEBUG_FRAME = org.junit.runners.ParentRunner$3.run(ParentRunner.java:193)
	DEBUG_FRAME = org.junit.runners.ParentRunner$1.schedule(ParentRunner.java:52)
	DEBUG_FRAME = org.junit.runners.ParentRunner.runChildren(ParentRunner.java:191)
	DEBUG_FRAME = org.junit.runners.ParentRunner.access$000(ParentRunner.java:42)
	DEBUG_FRAME = org.junit.runners.ParentRunner$2.evaluate(ParentRunner.java:184)
	DEBUG_FRAME = org.junit.runners.ParentRunner.run(ParentRunner.java:236)
	DEBUG_FRAME = org.apache.maven.surefire.junitcore.JUnitCore.run(JUnitCore.java:55)
	DEBUG_FRAME = org.apache.maven.surefire.junitcore.JUnitCoreWrapper.createRequestAndRun(JUnitCoreWrapper.java:137)
	DEBUG_FRAME = org.apache.maven.surefire.junitcore.JUnitCoreWrapper.executeEager(JUnitCoreWrapper.java:107)
	DEBUG_FRAME = org.apache.maven.surefire.junitcore.JUnitCoreWrapper.execute(JUnitCoreWrapper.java:83)
	DEBUG_FRAME = org.apache.maven.surefire.junitcore.JUnitCoreWrapper.execute(JUnitCoreWrapper.java:75)
	DEBUG_FRAME = org.apache.maven.surefire.junitcore.JUnitCoreProvider.invoke(JUnitCoreProvider.java:157)
	DEBUG_FRAME = org.apache.maven.surefire.booter.ForkedBooter.invokeProviderInSameClassLoader(ForkedBooter.java:386)
	DEBUG_FRAME = org.apache.maven.surefire.booter.ForkedBooter.runSuitesInProcess(ForkedBooter.java:323)
	DEBUG_FRAME = org.apache.maven.surefire.booter.ForkedBooter.main(ForkedBooter.java:143)

10:31:51,288 DEBUG [main] AbstractContext:55 - OnDemandLogger initialized for class org.apache.axis2.context.AbstractContext is:org.apache.commons.logging.impl.Log4JLogger@55698d56
10:31:51,295 DEBUG [main] Loader:132 - Trying to find [org/apache/axis2/deployment/axis2_default.xml] using org.powermock.core.classloader.MockClassLoader@5aa62ee7 class loader.
10:31:51,309 DEBUG [main] StAXUtils:489 - About to create XMLInputFactory implementation with classloader=org.powermock.core.classloader.MockClassLoader@5aa62ee7
10:31:51,309 DEBUG [main] StAXUtils:491 - The classloader for javax.xml.stream.XMLInputFactory is: org.powermock.core.classloader.MockClassLoader@5aa62ee7
10:31:51,327 DEBUG [main] StAXDialectDetector:256 - StAX implementation at jar:file:/home/jenkins/.m2/repository/org/codehaus/woodstox/woodstox-core-asl/4.1.1/woodstox-core-asl-4.1.1.jar!/ is:
  Title:         Woodstox XML-processor
  Symbolic name: woodstox-core-asl
  Vendor:        http://woodstox.codehaus.org
  Version:       4.1.1
10:31:51,331 DEBUG [main] StAXDialectDetector:218 - Detected StAX dialect: Woodstox 4.x [WSTX-276]
10:31:51,332 DEBUG [main] StAXUtils:513 - Created XMLInputFactory = class org.apache.axiom.util.stax.wrapper.ImmutableXMLInputFactory with classloader=org.powermock.core.classloader.MockClassLoader@5aa62ee7
10:31:51,333 DEBUG [main] StAXUtils:515 - Configuration = DEFAULT
10:31:51,333 DEBUG [main] StAXUtils:516 - Size of XMLInputFactory map for this configuration = 1
10:31:51,333 DEBUG [main] StAXUtils:517 - Configurations for which factories have been cached = [DEFAULT]
10:31:51,475 DEBUG [main] StAXUtils:210 - XMLStreamReader is org.apache.axiom.util.stax.dialect.Woodstox4StreamReaderWrapper
10:31:51,520 DEBUG [main] AxiomContainerSupport:172 - Builder is already complete.
10:31:51,547 DEBUG [main] Phase:98 - Handler RequestURIBasedDispatcher added to Phase Transport
10:31:51,549 DEBUG [main] Phase:98 - Handler SOAPActionBasedDispatcher added to Phase Transport
10:31:51,551 DEBUG [main] Phase:98 - Handler AddressingBasedDispatcher added to Phase Addressing
10:31:51,552 DEBUG [main] Phase:98 - Handler RequestURIBasedDispatcher added to Phase Dispatch
10:31:51,552 DEBUG [main] Phase:98 - Handler SOAPActionBasedDispatcher added to Phase Dispatch
10:31:51,553 DEBUG [main] Phase:98 - Handler RequestURIOperationDispatcher added to Phase Dispatch
10:31:51,554 DEBUG [main] Phase:98 - Handler SOAPMessageBodyBasedDispatcher added to Phase Dispatch
10:31:51,555 DEBUG [main] Phase:98 - Handler HTTPLocationBasedDispatcher added to Phase Dispatch
10:31:51,555 DEBUG [main] Phase:98 - Handler RequestURIBasedDispatcher added to Phase Transport
10:31:51,555 DEBUG [main] Phase:98 - Handler SOAPActionBasedDispatcher added to Phase Transport
10:31:51,556 DEBUG [main] Phase:98 - Handler AddressingBasedDispatcher added to Phase Addressing
10:31:51,556 DEBUG [main] Phase:98 - Handler RequestURIBasedDispatcher added to Phase Dispatch
10:31:51,556 DEBUG [main] Phase:98 - Handler SOAPActionBasedDispatcher added to Phase Dispatch
10:31:51,556 DEBUG [main] Phase:98 - Handler RequestURIOperationDispatcher added to Phase Dispatch
10:31:51,556 DEBUG [main] Phase:98 - Handler SOAPMessageBodyBasedDispatcher added to Phase Dispatch
10:31:51,556 DEBUG [main] Phase:98 - Handler HTTPLocationBasedDispatcher added to Phase Dispatch
10:31:51,569 DEBUG [main] Loader:256 - java.lang.ClassNotFoundException: org.apache.axis2.jaxws.framework.JAXWSServiceBuilderExtension
10:31:51,570  WARN [main] AxisConfigBuilder:442 - Unable to instantiate deployer org.apache.axis2.deployment.ServiceDeployer; see debug logs for more details
10:31:51,570 DEBUG [main] AxisConfigBuilder:444 - org.apache.axis2.jaxws.framework.JAXWSServiceBuilderExtension
java.lang.ClassNotFoundException: org.apache.axis2.jaxws.framework.JAXWSServiceBuilderExtension
	at java.net.URLClassLoader.findClass(URLClassLoader.java:382)
	at java.lang.ClassLoader.loadClass(ClassLoader.java:424)
	at sun.misc.Launcher$AppClassLoader.loadClass(Launcher.java:349)
	at java.lang.ClassLoader.loadClass(ClassLoader.java:357)
	at org.powermock.core.classloader.MockClassLoader.loadModifiedClass(MockClassLoader.java:145)
	at org.powermock.core.classloader.DeferSupportingClassLoader.loadClass(DeferSupportingClassLoader.java:67)
	at java.lang.ClassLoader.loadClass(ClassLoader.java:357)
	at java.lang.Class.forName0(Native Method)
	at java.lang.Class.forName(Class.java:264)
	at org.apache.axis2.util.Loader.loadClass(Loader.java:261)
	at org.apache.axis2.deployment.AxisConfigBuilder.processDeployers(AxisConfigBuilder.java:434)
	at org.apache.axis2.deployment.AxisConfigBuilder.populateConfig(AxisConfigBuilder.java:275)
	at org.apache.axis2.deployment.DeploymentEngine.populateAxisConfiguration(DeploymentEngine.java:629)
	at org.apache.axis2.deployment.FileSystemConfigurator.getAxisConfiguration(FileSystemConfigurator.java:116)
	at org.apache.axis2.context.ConfigurationContextFactory.createConfigurationContext(ConfigurationContextFactory.java:64)
	at org.apache.axis2.context.ConfigurationContextFactory.createConfigurationContextFromFileSystem(ConfigurationContextFactory.java:210)
	at org.apache.axis2.client.ServiceClient.configureServiceClient(ServiceClient.java:150)
	at org.apache.axis2.client.ServiceClient.<init>(ServiceClient.java:143)
	at net.ihe.gazelle.ws.client.GazelleTRMServiceStub.<init>(GazelleTRMServiceStub.java:43)
	at net.ihe.gazelle.ws.client.GazelleTRMServiceStub.<init>(GazelleTRMServiceStub.java:29)
	at net.ihe.gazelle.ws.client.GazelleTRMServiceStub.<init>(GazelleTRMServiceStub.java:75)
	at net.ihe.gazelle.ws.client.GazelleTRMServiceClient.<init>(GazelleTRMServiceClient.java:11)
	at net.ihe.gazelle.wstester.xdstools.ws.Xdstools.getNonce(Xdstools.java:61)
	at net.ihe.gazelle.wstester.xdstools.Ws.noNonceReturned(Ws.java:79)
	at sun.reflect.NativeMethodAccessorImpl.invoke0(Native Method)
	at sun.reflect.NativeMethodAccessorImpl.invoke(NativeMethodAccessorImpl.java:62)
	at sun.reflect.DelegatingMethodAccessorImpl.invoke(DelegatingMethodAccessorImpl.java:43)
	at java.lang.reflect.Method.invoke(Method.java:498)
	at org.junit.internal.runners.TestMethod.invoke(TestMethod.java:66)
	at org.powermock.modules.junit4.internal.impl.PowerMockJUnit44RunnerDelegateImpl$PowerMockJUnit44MethodRunner.runTestMethod(PowerMockJUnit44RunnerDelegateImpl.java:310)
	at org.junit.internal.runners.MethodRoadie$2.run(MethodRoadie.java:86)
	at org.junit.internal.runners.MethodRoadie.runBeforesThenTestThenAfters(MethodRoadie.java:94)
	at org.powermock.modules.junit4.internal.impl.PowerMockJUnit44RunnerDelegateImpl$PowerMockJUnit44MethodRunner.executeTest(PowerMockJUnit44RunnerDelegateImpl.java:294)
	at org.powermock.modules.junit4.internal.impl.PowerMockJUnit47RunnerDelegateImpl$PowerMockJUnit47MethodRunner.executeTestInSuper(PowerMockJUnit47RunnerDelegateImpl.java:127)
	at org.powermock.modules.junit4.internal.impl.PowerMockJUnit47RunnerDelegateImpl$PowerMockJUnit47MethodRunner.executeTest(PowerMockJUnit47RunnerDelegateImpl.java:82)
	at org.powermock.modules.junit4.internal.impl.PowerMockJUnit44RunnerDelegateImpl$PowerMockJUnit44MethodRunner.runBeforesThenTestThenAfters(PowerMockJUnit44RunnerDelegateImpl.java:282)
	at org.junit.internal.runners.MethodRoadie.runTest(MethodRoadie.java:84)
	at org.junit.internal.runners.MethodRoadie.run(MethodRoadie.java:49)
	at org.powermock.modules.junit4.internal.impl.PowerMockJUnit44RunnerDelegateImpl.invokeTestMethod(PowerMockJUnit44RunnerDelegateImpl.java:207)
	at org.powermock.modules.junit4.internal.impl.PowerMockJUnit44RunnerDelegateImpl.runMethods(PowerMockJUnit44RunnerDelegateImpl.java:146)
	at org.powermock.modules.junit4.internal.impl.PowerMockJUnit44RunnerDelegateImpl$1.run(PowerMockJUnit44RunnerDelegateImpl.java:120)
	at org.junit.internal.runners.ClassRoadie.runUnprotected(ClassRoadie.java:34)
	at org.junit.internal.runners.ClassRoadie.runProtected(ClassRoadie.java:44)
	at org.powermock.modules.junit4.internal.impl.PowerMockJUnit44RunnerDelegateImpl.run(PowerMockJUnit44RunnerDelegateImpl.java:118)
	at org.powermock.modules.junit4.common.internal.impl.JUnit4TestSuiteChunkerImpl.run(JUnit4TestSuiteChunkerImpl.java:101)
	at org.powermock.modules.junit4.common.internal.impl.AbstractCommonPowerMockRunner.run(AbstractCommonPowerMockRunner.java:53)
	at org.powermock.modules.junit4.PowerMockRunner.run(PowerMockRunner.java:53)
	at org.junit.runners.Suite.runChild(Suite.java:128)
	at org.junit.runners.Suite.runChild(Suite.java:24)
	at org.junit.runners.ParentRunner$3.run(ParentRunner.java:193)
	at org.junit.runners.ParentRunner$1.schedule(ParentRunner.java:52)
	at org.junit.runners.ParentRunner.runChildren(ParentRunner.java:191)
	at org.junit.runners.ParentRunner.access$000(ParentRunner.java:42)
	at org.junit.runners.ParentRunner$2.evaluate(ParentRunner.java:184)
	at org.junit.runners.ParentRunner.run(ParentRunner.java:236)
	at org.junit.runners.Suite.runChild(Suite.java:128)
	at org.junit.runners.Suite.runChild(Suite.java:24)
	at org.junit.runners.ParentRunner$3.run(ParentRunner.java:193)
	at org.junit.runners.ParentRunner$1.schedule(ParentRunner.java:52)
	at org.junit.runners.ParentRunner.runChildren(ParentRunner.java:191)
	at org.junit.runners.ParentRunner.access$000(ParentRunner.java:42)
	at org.junit.runners.ParentRunner$2.evaluate(ParentRunner.java:184)
	at org.junit.runners.ParentRunner.run(ParentRunner.java:236)
	at org.apache.maven.surefire.junitcore.JUnitCore.run(JUnitCore.java:55)
	at org.apache.maven.surefire.junitcore.JUnitCoreWrapper.createRequestAndRun(JUnitCoreWrapper.java:137)
	at org.apache.maven.surefire.junitcore.JUnitCoreWrapper.executeEager(JUnitCoreWrapper.java:107)
	at org.apache.maven.surefire.junitcore.JUnitCoreWrapper.execute(JUnitCoreWrapper.java:83)
	at org.apache.maven.surefire.junitcore.JUnitCoreWrapper.execute(JUnitCoreWrapper.java:75)
	at org.apache.maven.surefire.junitcore.JUnitCoreProvider.invoke(JUnitCoreProvider.java:157)
	at org.apache.maven.surefire.booter.ForkedBooter.invokeProviderInSameClassLoader(ForkedBooter.java:386)
	at org.apache.maven.surefire.booter.ForkedBooter.runSuitesInProcess(ForkedBooter.java:323)
	at org.apache.maven.surefire.booter.ForkedBooter.main(ForkedBooter.java:143)
10:31:51,588 DEBUG [main] AxisConfiguration:486 - Adding service to allServices map: [GazelleTRMService1570609911102_1] 
10:31:51,590 DEBUG [main] AxisOperation:567 - AxisOperation::getSoapAction urn:anonRobustOp
10:31:51,591 DEBUG [main] AxisOperation:567 - AxisOperation::getSoapAction urn:anonOutonlyOp
10:31:51,591 DEBUG [main] AxisOperation:567 - AxisOperation::getSoapAction urn:getSystemIsATool
10:31:51,591 DEBUG [main] AxisOperation:567 - AxisOperation::getSoapAction urn:anonOutInOp
10:31:51,591 DEBUG [main] AxisOperation:567 - AxisOperation::getSoapAction urn:getTestInstancesByTestingSession
10:31:51,591 DEBUG [main] AxisOperation:567 - AxisOperation::getSoapAction urn:getTestInstanceById
10:31:51,592 DEBUG [main] AxisOperation:567 - AxisOperation::getSoapAction urn:anonRobustOp
10:31:51,592 DEBUG [main] AxisOperation:567 - AxisOperation::getSoapAction urn:anonOutonlyOp
10:31:51,592 DEBUG [main] AxisOperation:567 - AxisOperation::getSoapAction urn:getSystemIsATool
10:31:51,592 DEBUG [main] AxisOperation:567 - AxisOperation::getSoapAction urn:anonOutInOp
10:31:51,592 DEBUG [main] AxisOperation:567 - AxisOperation::getSoapAction urn:getTestInstancesByTestingSession
10:31:51,592 DEBUG [main] AxisOperation:567 - AxisOperation::getSoapAction urn:getTestInstanceById
10:31:51,593 DEBUG [main] AxisConfiguration:396 - Adding service to allEndpoints map: (GazelleTRMService1570609911102_1,GazelleTRMService1570609911102_1HttpSoap11Endpoint) 
10:31:51,593 DEBUG [main] AxisConfiguration:396 - Adding service to allEndpoints map: (GazelleTRMService1570609911102_1,GazelleTRMService1570609911102_1HttpEndpoint) 
10:31:51,593 DEBUG [main] AxisConfiguration:396 - Adding service to allEndpoints map: (GazelleTRMService1570609911102_1,GazelleTRMService1570609911102_1HttpSoap12Endpoint) 
10:31:51,593 DEBUG [main] AxisConfiguration:403 - After adding to allEndpoints map, size is 3
10:31:51,598 DEBUG [main] AxisService:1971 - Get operation for {http://trm.ws.gazelletest.tm.gazelle.ihe.net/}getTestInstanceById
10:31:51,598 DEBUG [main] AxisService:2014 - Found axis operation:  org.apache.axis2.description.OutInAxisOperation@23aad2f2
10:31:51,599 DEBUG [main] Options:589 - setAction Old action is (null)
10:31:51,600 DEBUG [main] Options:590 - setAction New action is (http://trm.ws.gazelletest.tm.gazelle.ihe.net/gazelleTRM/getTestInstanceById)
10:31:51,609 DEBUG [main] ConfigurationContext:55 - OnDemandLogger initialized for class org.apache.axis2.context.ConfigurationContext is:org.apache.commons.logging.impl.Log4JLogger@591c80e0
10:31:51,610 DEBUG [main] ConfigurationContext:85 - registerOperationContext (false): org.apache.axis2.context.OperationContext@4be4a158 with key: urn:uuid:8af11876-484f-4b83-b339-8835a2c03e78
10:31:51,610 DEBUG [main] OutInAxisOperationClient:164 - Entry: OutInAxisOperationClient::execute, true
10:31:51,610 DEBUG [main] Options:246 - getAction (null) from org.apache.axis2.client.Options@2c16fca4
10:31:51,610 DEBUG [main] MessageContext:1119 - SoapAction is (null)
10:31:51,610 DEBUG [main] Options:246 - getAction (http://trm.ws.gazelletest.tm.gazelle.ihe.net/gazelleTRM/getTestInstanceById) from org.apache.axis2.client.Options@70b9bbe2
10:31:51,610 DEBUG [main] Options:246 - getAction (null) from org.apache.axis2.client.Options@2c16fca4
10:31:51,610 DEBUG [main] MessageContext:1524 - Old SoapAction is (null)
10:31:51,610 DEBUG [main] MessageContext:1525 - New SoapAction is (http://trm.ws.gazelletest.tm.gazelle.ihe.net/gazelleTRM/getTestInstanceById)
10:31:51,610 DEBUG [main] Options:589 - setAction Old action is (null)
10:31:51,611 DEBUG [main] Options:590 - setAction New action is (http://trm.ws.gazelletest.tm.gazelle.ihe.net/gazelleTRM/getTestInstanceById)
10:31:51,614 DEBUG [main] ProjectResourceBundle:236 - getBundle(org.apache.axis2,org.apache.axis2.i18n,resource,null,...)
10:31:51,619 DEBUG [main] ProjectResourceBundle:412 - loadBundle: Ignoring MissingResourceException: Can't find bundle for base name org.apache.axis2.resource, locale en_GB
10:31:51,619 DEBUG [main] ProjectResourceBundle:289 - Created org.apache.axis2.i18n.resource, linked to parent null
10:31:51,620 DEBUG [main] ProjectResourceBundle:236 - getBundle(org.apache.axis2,org.apache.axis2.i18n,resource,null,...)
10:31:51,620 DEBUG [main] ProjectResourceBundle:70 - org.apache.axis2.i18n.resource::handleGetObject(cannotInferTransport)
10:31:51,620 ERROR [main] ClientUtils:80 - The system cannot infer the transport information from the null/gazelle-tm-ejb/GazelleTRMService/gazelleTRM URL.
10:31:51,621 DEBUG [main] ProjectResourceBundle:70 - org.apache.axis2.i18n.resource::handleGetObject(cannotInferTransport)
10:31:51,621 ERROR [main] Xdstools:91 - The system cannot infer the transport information from the null/gazelle-tm-ejb/GazelleTRMService/gazelleTRM URL.
[INFO] Tests run: 2, Failures: 0, Errors: 0, Skipped: 0, Time elapsed: 1.078 s - in net.ihe.gazelle.wstester.xdstools.Ws
[INFO] Running net.ihe.gazelle.wstester.model.GwtTestStepResultTest
[INFO] Tests run: 3, Failures: 0, Errors: 0, Skipped: 0, Time elapsed: 0.001 s - in net.ihe.gazelle.wstester.model.GwtTestStepResultTest
[INFO] 
[INFO] Results:
[INFO] 
[INFO] Tests run: 21, Failures: 0, Errors: 0, Skipped: 0
[INFO] 
[JENKINS] Recording test results
[INFO] 
[INFO] --- jacoco-maven-plugin:0.7.9:report (post-unit-test) @ gazelle-webservice-tester-ejb ---
[INFO] Loading execution data file /home/jenkins/.hudson/jobs/gazelle-webservice-tester-SNAPSHOT/workspace/gazelle-webservice-tester-ejb/target/jacoco.exec
[INFO] Analyzed bundle 'gazelle-webservice-tester - EJB - JAR' with 160 classes
[INFO] 
[INFO] --- jacoco-maven-plugin:0.7.9:report (default-report) @ gazelle-webservice-tester-ejb ---
[INFO] Loading execution data file /home/jenkins/.hudson/jobs/gazelle-webservice-tester-SNAPSHOT/workspace/gazelle-webservice-tester-ejb/target/jacoco.exec
[INFO] Analyzed bundle 'gazelle-webservice-tester - EJB - JAR' with 160 classes
[INFO] 
[INFO] --- maven-ejb-plugin:2.3:ejb (default-ejb) @ gazelle-webservice-tester-ejb ---
[INFO] Building EJB gazelle-webservice-tester-ejb with EJB version 3.0
[INFO] Building jar: /home/jenkins/.hudson/jobs/gazelle-webservice-tester-SNAPSHOT/workspace/gazelle-webservice-tester-ejb/target/gazelle-webservice-tester-ejb.jar
[INFO] 
[INFO] --- maven-source-plugin:3.0.1:jar-no-fork (attach-sources) @ gazelle-webservice-tester-ejb ---
[INFO] Building jar: /home/jenkins/.hudson/jobs/gazelle-webservice-tester-SNAPSHOT/workspace/gazelle-webservice-tester-ejb/target/gazelle-webservice-tester-ejb-sources.jar
[INFO] 
[INFO] --- maven-jar-plugin:2.6:test-jar (default) @ gazelle-webservice-tester-ejb ---
[INFO] Building jar: /home/jenkins/.hudson/jobs/gazelle-webservice-tester-SNAPSHOT/workspace/gazelle-webservice-tester-ejb/target/gazelle-webservice-tester-ejb-tests.jar