SuccessConsole Output

Skipping 329 KB.. Full Log
unit.internal.runners.MethodRoadie.runTest(MethodRoadie.java:84)
	DEBUG_FRAME = org.junit.internal.runners.MethodRoadie.run(MethodRoadie.java:49)
	DEBUG_FRAME = org.powermock.modules.junit4.internal.impl.PowerMockJUnit44RunnerDelegateImpl.invokeTestMethod(PowerMockJUnit44RunnerDelegateImpl.java:207)
	DEBUG_FRAME = org.powermock.modules.junit4.internal.impl.PowerMockJUnit44RunnerDelegateImpl.runMethods(PowerMockJUnit44RunnerDelegateImpl.java:146)
	DEBUG_FRAME = org.powermock.modules.junit4.internal.impl.PowerMockJUnit44RunnerDelegateImpl$1.run(PowerMockJUnit44RunnerDelegateImpl.java:120)
	DEBUG_FRAME = org.junit.internal.runners.ClassRoadie.runUnprotected(ClassRoadie.java:34)
	DEBUG_FRAME = org.junit.internal.runners.ClassRoadie.runProtected(ClassRoadie.java:44)
	DEBUG_FRAME = org.powermock.modules.junit4.internal.impl.PowerMockJUnit44RunnerDelegateImpl.run(PowerMockJUnit44RunnerDelegateImpl.java:118)
	DEBUG_FRAME = org.powermock.modules.junit4.common.internal.impl.JUnit4TestSuiteChunkerImpl.run(JUnit4TestSuiteChunkerImpl.java:101)
	DEBUG_FRAME = org.powermock.modules.junit4.common.internal.impl.AbstractCommonPowerMockRunner.run(AbstractCommonPowerMockRunner.java:53)
	DEBUG_FRAME = org.powermock.modules.junit4.PowerMockRunner.run(PowerMockRunner.java:53)
	DEBUG_FRAME = org.junit.runners.Suite.runChild(Suite.java:128)
	DEBUG_FRAME = org.junit.runners.Suite.runChild(Suite.java:24)
	DEBUG_FRAME = org.junit.runners.ParentRunner$3.run(ParentRunner.java:193)
	DEBUG_FRAME = org.junit.runners.ParentRunner$1.schedule(ParentRunner.java:52)
	DEBUG_FRAME = org.junit.runners.ParentRunner.runChildren(ParentRunner.java:191)
	DEBUG_FRAME = org.junit.runners.ParentRunner.access$000(ParentRunner.java:42)
	DEBUG_FRAME = org.junit.runners.ParentRunner$2.evaluate(ParentRunner.java:184)
	DEBUG_FRAME = org.junit.runners.ParentRunner.run(ParentRunner.java:236)
	DEBUG_FRAME = org.junit.runners.Suite.runChild(Suite.java:128)
	DEBUG_FRAME = org.junit.runners.Suite.runChild(Suite.java:24)
	DEBUG_FRAME = org.junit.runners.ParentRunner$3.run(ParentRunner.java:193)
	DEBUG_FRAME = org.junit.runners.ParentRunner$1.schedule(ParentRunner.java:52)
	DEBUG_FRAME = org.junit.runners.ParentRunner.runChildren(ParentRunner.java:191)
	DEBUG_FRAME = org.junit.runners.ParentRunner.access$000(ParentRunner.java:42)
	DEBUG_FRAME = org.junit.runners.ParentRunner$2.evaluate(ParentRunner.java:184)
	DEBUG_FRAME = org.junit.runners.ParentRunner.run(ParentRunner.java:236)
	DEBUG_FRAME = org.apache.maven.surefire.junitcore.JUnitCore.run(JUnitCore.java:55)
	DEBUG_FRAME = org.apache.maven.surefire.junitcore.JUnitCoreWrapper.createRequestAndRun(JUnitCoreWrapper.java:137)
	DEBUG_FRAME = org.apache.maven.surefire.junitcore.JUnitCoreWrapper.executeEager(JUnitCoreWrapper.java:107)
	DEBUG_FRAME = org.apache.maven.surefire.junitcore.JUnitCoreWrapper.execute(JUnitCoreWrapper.java:83)
	DEBUG_FRAME = org.apache.maven.surefire.junitcore.JUnitCoreWrapper.execute(JUnitCoreWrapper.java:75)
	DEBUG_FRAME = org.apache.maven.surefire.junitcore.JUnitCoreProvider.invoke(JUnitCoreProvider.java:157)
	DEBUG_FRAME = org.apache.maven.surefire.booter.ForkedBooter.invokeProviderInSameClassLoader(ForkedBooter.java:386)
	DEBUG_FRAME = org.apache.maven.surefire.booter.ForkedBooter.runSuitesInProcess(ForkedBooter.java:323)
	DEBUG_FRAME = org.apache.maven.surefire.booter.ForkedBooter.main(ForkedBooter.java:143)

15:51:16,677 DEBUG [main] AxisOperation:485 - Entry: AxisOperation::getInputAction
15:51:16,677 DEBUG [main] AxisOperation:506 - Exit: AxisOperation::getInputAction null
15:51:16,677 DEBUG [main] AxisOperation:467 - Entry: AxisOperation::setSoapAction, previous soapAction: null updated soapAction: urn:listAllConfigurationsForATypeAsCSV
15:51:16,677 DEBUG [main] AxisOperation:471 - Exit: AxisOperation::setSoapAction
15:51:16,677 DEBUG [main] AxisService:872 - mapActionToOperation: Mapping Action to Operation: action: listAllConfigurationsForATypeAsCSV; operation: org.apache.axis2.description.OutInAxisOperation@78b79e3named: {http://ws.configurations.tm.gazelle.ihe.net/}listAllConfigurationsForATypeAsCSV
15:51:16,678 DEBUG [main] AxisService:878 - DEBUG_FRAME = org.apache.axis2.util.JavaUtils.callStackToString(JavaUtils.java:564)
	DEBUG_FRAME = org.apache.axis2.description.AxisService.mapActionToOperation(AxisService.java:878)
	DEBUG_FRAME = org.apache.axis2.description.AxisService.addOperation(AxisService.java:724)
	DEBUG_FRAME = net.ihe.gazelle.ws.client.GazelleProxyWebServiceNameStub.populateAxisService(GazelleProxyWebServiceNameStub.java:160)
	DEBUG_FRAME = net.ihe.gazelle.ws.client.GazelleProxyWebServiceNameStub.<init>(GazelleProxyWebServiceNameStub.java:40)
	DEBUG_FRAME = net.ihe.gazelle.ws.client.GazelleProxyWebServiceNameStub.<init>(GazelleProxyWebServiceNameStub.java:29)
	DEBUG_FRAME = net.ihe.gazelle.ws.client.GazelleProxyWebServiceNameStub.<init>(GazelleProxyWebServiceNameStub.java:75)
	DEBUG_FRAME = net.ihe.gazelle.wstester.util.WsClient.listConfigurationsBySystemBySessionByTypeAsCSV(WsClient.java:36)
	DEBUG_FRAME = net.ihe.gazelle.wstester.action.RunInstanceAction.getEndPointBySystem(RunInstanceAction.java:709)
	DEBUG_FRAME = net.ihe.gazelle.wstester.action.RunInstanceActionTest2.getEndPointBySystemOK(RunInstanceActionTest2.java:61)
	DEBUG_FRAME = sun.reflect.NativeMethodAccessorImpl.invoke0(Native Method)
	DEBUG_FRAME = sun.reflect.NativeMethodAccessorImpl.invoke(NativeMethodAccessorImpl.java:62)
	DEBUG_FRAME = sun.reflect.DelegatingMethodAccessorImpl.invoke(DelegatingMethodAccessorImpl.java:43)
	DEBUG_FRAME = java.lang.reflect.Method.invoke(Method.java:498)
	DEBUG_FRAME = org.junit.internal.runners.TestMethod.invoke(TestMethod.java:66)
	DEBUG_FRAME = org.powermock.modules.junit4.internal.impl.PowerMockJUnit44RunnerDelegateImpl$PowerMockJUnit44MethodRunner.runTestMethod(PowerMockJUnit44RunnerDelegateImpl.java:310)
	DEBUG_FRAME = org.junit.internal.runners.MethodRoadie$2.run(MethodRoadie.java:86)
	DEBUG_FRAME = org.junit.internal.runners.MethodRoadie.runBeforesThenTestThenAfters(MethodRoadie.java:94)
	DEBUG_FRAME = org.powermock.modules.junit4.internal.impl.PowerMockJUnit44RunnerDelegateImpl$PowerMockJUnit44MethodRunner.executeTest(PowerMockJUnit44RunnerDelegateImpl.java:294)
	DEBUG_FRAME = org.powermock.modules.junit4.internal.impl.PowerMockJUnit47RunnerDelegateImpl$PowerMockJUnit47MethodRunner.executeTestInSuper(PowerMockJUnit47RunnerDelegateImpl.java:127)
	DEBUG_FRAME = org.powermock.modules.junit4.internal.impl.PowerMockJUnit47RunnerDelegateImpl$PowerMockJUnit47MethodRunner.executeTest(PowerMockJUnit47RunnerDelegateImpl.java:82)
	DEBUG_FRAME = org.powermock.modules.junit4.internal.impl.PowerMockJUnit44RunnerDelegateImpl$PowerMockJUnit44MethodRunner.runBeforesThenTestThenAfters(PowerMockJUnit44RunnerDelegateImpl.java:282)
	DEBUG_FRAME = org.junit.internal.runners.MethodRoadie.runTest(MethodRoadie.java:84)
	DEBUG_FRAME = org.junit.internal.runners.MethodRoadie.run(MethodRoadie.java:49)
	DEBUG_FRAME = org.powermock.modules.junit4.internal.impl.PowerMockJUnit44RunnerDelegateImpl.invokeTestMethod(PowerMockJUnit44RunnerDelegateImpl.java:207)
	DEBUG_FRAME = org.powermock.modules.junit4.internal.impl.PowerMockJUnit44RunnerDelegateImpl.runMethods(PowerMockJUnit44RunnerDelegateImpl.java:146)
	DEBUG_FRAME = org.powermock.modules.junit4.internal.impl.PowerMockJUnit44RunnerDelegateImpl$1.run(PowerMockJUnit44RunnerDelegateImpl.java:120)
	DEBUG_FRAME = org.junit.internal.runners.ClassRoadie.runUnprotected(ClassRoadie.java:34)
	DEBUG_FRAME = org.junit.internal.runners.ClassRoadie.runProtected(ClassRoadie.java:44)
	DEBUG_FRAME = org.powermock.modules.junit4.internal.impl.PowerMockJUnit44RunnerDelegateImpl.run(PowerMockJUnit44RunnerDelegateImpl.java:118)
	DEBUG_FRAME = org.powermock.modules.junit4.common.internal.impl.JUnit4TestSuiteChunkerImpl.run(JUnit4TestSuiteChunkerImpl.java:101)
	DEBUG_FRAME = org.powermock.modules.junit4.common.internal.impl.AbstractCommonPowerMockRunner.run(AbstractCommonPowerMockRunner.java:53)
	DEBUG_FRAME = org.powermock.modules.junit4.PowerMockRunner.run(PowerMockRunner.java:53)
	DEBUG_FRAME = org.junit.runners.Suite.runChild(Suite.java:128)
	DEBUG_FRAME = org.junit.runners.Suite.runChild(Suite.java:24)
	DEBUG_FRAME = org.junit.runners.ParentRunner$3.run(ParentRunner.java:193)
	DEBUG_FRAME = org.junit.runners.ParentRunner$1.schedule(ParentRunner.java:52)
	DEBUG_FRAME = org.junit.runners.ParentRunner.runChildren(ParentRunner.java:191)
	DEBUG_FRAME = org.junit.runners.ParentRunner.access$000(ParentRunner.java:42)
	DEBUG_FRAME = org.junit.runners.ParentRunner$2.evaluate(ParentRunner.java:184)
	DEBUG_FRAME = org.junit.runners.ParentRunner.run(ParentRunner.java:236)
	DEBUG_FRAME = org.junit.runners.Suite.runChild(Suite.java:128)
	DEBUG_FRAME = org.junit.runners.Suite.runChild(Suite.java:24)
	DEBUG_FRAME = org.junit.runners.ParentRunner$3.run(ParentRunner.java:193)
	DEBUG_FRAME = org.junit.runners.ParentRunner$1.schedule(ParentRunner.java:52)
	DEBUG_FRAME = org.junit.runners.ParentRunner.runChildren(ParentRunner.java:191)
	DEBUG_FRAME = org.junit.runners.ParentRunner.access$000(ParentRunner.java:42)
	DEBUG_FRAME = org.junit.runners.ParentRunner$2.evaluate(ParentRunner.java:184)
	DEBUG_FRAME = org.junit.runners.ParentRunner.run(ParentRunner.java:236)
	DEBUG_FRAME = org.apache.maven.surefire.junitcore.JUnitCore.run(JUnitCore.java:55)
	DEBUG_FRAME = org.apache.maven.surefire.junitcore.JUnitCoreWrapper.createRequestAndRun(JUnitCoreWrapper.java:137)
	DEBUG_FRAME = org.apache.maven.surefire.junitcore.JUnitCoreWrapper.executeEager(JUnitCoreWrapper.java:107)
	DEBUG_FRAME = org.apache.maven.surefire.junitcore.JUnitCoreWrapper.execute(JUnitCoreWrapper.java:83)
	DEBUG_FRAME = org.apache.maven.surefire.junitcore.JUnitCoreWrapper.execute(JUnitCoreWrapper.java:75)
	DEBUG_FRAME = org.apache.maven.surefire.junitcore.JUnitCoreProvider.invoke(JUnitCoreProvider.java:157)
	DEBUG_FRAME = org.apache.maven.surefire.booter.ForkedBooter.invokeProviderInSameClassLoader(ForkedBooter.java:386)
	DEBUG_FRAME = org.apache.maven.surefire.booter.ForkedBooter.runSuitesInProcess(ForkedBooter.java:323)
	DEBUG_FRAME = org.apache.maven.surefire.booter.ForkedBooter.main(ForkedBooter.java:143)

15:51:16,678 DEBUG [main] AxisOperation:485 - Entry: AxisOperation::getInputAction
15:51:16,678 DEBUG [main] AxisOperation:490 - Debug: AxisOperation::getInputAction - using soapAction
15:51:16,678 DEBUG [main] AxisOperation:506 - Exit: AxisOperation::getInputAction urn:listAllConfigurationsForATypeAsCSV
15:51:16,678 DEBUG [main] AxisService:872 - mapActionToOperation: Mapping Action to Operation: action: urn:listAllConfigurationsForATypeAsCSV; operation: org.apache.axis2.description.OutInAxisOperation@78b79e3named: {http://ws.configurations.tm.gazelle.ihe.net/}listAllConfigurationsForATypeAsCSV
15:51:16,679 DEBUG [main] AxisService:878 - DEBUG_FRAME = org.apache.axis2.util.JavaUtils.callStackToString(JavaUtils.java:564)
	DEBUG_FRAME = org.apache.axis2.description.AxisService.mapActionToOperation(AxisService.java:878)
	DEBUG_FRAME = org.apache.axis2.description.AxisService.addOperation(AxisService.java:728)
	DEBUG_FRAME = net.ihe.gazelle.ws.client.GazelleProxyWebServiceNameStub.populateAxisService(GazelleProxyWebServiceNameStub.java:160)
	DEBUG_FRAME = net.ihe.gazelle.ws.client.GazelleProxyWebServiceNameStub.<init>(GazelleProxyWebServiceNameStub.java:40)
	DEBUG_FRAME = net.ihe.gazelle.ws.client.GazelleProxyWebServiceNameStub.<init>(GazelleProxyWebServiceNameStub.java:29)
	DEBUG_FRAME = net.ihe.gazelle.ws.client.GazelleProxyWebServiceNameStub.<init>(GazelleProxyWebServiceNameStub.java:75)
	DEBUG_FRAME = net.ihe.gazelle.wstester.util.WsClient.listConfigurationsBySystemBySessionByTypeAsCSV(WsClient.java:36)
	DEBUG_FRAME = net.ihe.gazelle.wstester.action.RunInstanceAction.getEndPointBySystem(RunInstanceAction.java:709)
	DEBUG_FRAME = net.ihe.gazelle.wstester.action.RunInstanceActionTest2.getEndPointBySystemOK(RunInstanceActionTest2.java:61)
	DEBUG_FRAME = sun.reflect.NativeMethodAccessorImpl.invoke0(Native Method)
	DEBUG_FRAME = sun.reflect.NativeMethodAccessorImpl.invoke(NativeMethodAccessorImpl.java:62)
	DEBUG_FRAME = sun.reflect.DelegatingMethodAccessorImpl.invoke(DelegatingMethodAccessorImpl.java:43)
	DEBUG_FRAME = java.lang.reflect.Method.invoke(Method.java:498)
	DEBUG_FRAME = org.junit.internal.runners.TestMethod.invoke(TestMethod.java:66)
	DEBUG_FRAME = org.powermock.modules.junit4.internal.impl.PowerMockJUnit44RunnerDelegateImpl$PowerMockJUnit44MethodRunner.runTestMethod(PowerMockJUnit44RunnerDelegateImpl.java:310)
	DEBUG_FRAME = org.junit.internal.runners.MethodRoadie$2.run(MethodRoadie.java:86)
	DEBUG_FRAME = org.junit.internal.runners.MethodRoadie.runBeforesThenTestThenAfters(MethodRoadie.java:94)
	DEBUG_FRAME = org.powermock.modules.junit4.internal.impl.PowerMockJUnit44RunnerDelegateImpl$PowerMockJUnit44MethodRunner.executeTest(PowerMockJUnit44RunnerDelegateImpl.java:294)
	DEBUG_FRAME = org.powermock.modules.junit4.internal.impl.PowerMockJUnit47RunnerDelegateImpl$PowerMockJUnit47MethodRunner.executeTestInSuper(PowerMockJUnit47RunnerDelegateImpl.java:127)
	DEBUG_FRAME = org.powermock.modules.junit4.internal.impl.PowerMockJUnit47RunnerDelegateImpl$PowerMockJUnit47MethodRunner.executeTest(PowerMockJUnit47RunnerDelegateImpl.java:82)
	DEBUG_FRAME = org.powermock.modules.junit4.internal.impl.PowerMockJUnit44RunnerDelegateImpl$PowerMockJUnit44MethodRunner.runBeforesThenTestThenAfters(PowerMockJUnit44RunnerDelegateImpl.java:282)
	DEBUG_FRAME = org.junit.internal.runners.MethodRoadie.runTest(MethodRoadie.java:84)
	DEBUG_FRAME = org.junit.internal.runners.MethodRoadie.run(MethodRoadie.java:49)
	DEBUG_FRAME = org.powermock.modules.junit4.internal.impl.PowerMockJUnit44RunnerDelegateImpl.invokeTestMethod(PowerMockJUnit44RunnerDelegateImpl.java:207)
	DEBUG_FRAME = org.powermock.modules.junit4.internal.impl.PowerMockJUnit44RunnerDelegateImpl.runMethods(PowerMockJUnit44RunnerDelegateImpl.java:146)
	DEBUG_FRAME = org.powermock.modules.junit4.internal.impl.PowerMockJUnit44RunnerDelegateImpl$1.run(PowerMockJUnit44RunnerDelegateImpl.java:120)
	DEBUG_FRAME = org.junit.internal.runners.ClassRoadie.runUnprotected(ClassRoadie.java:34)
	DEBUG_FRAME = org.junit.internal.runners.ClassRoadie.runProtected(ClassRoadie.java:44)
	DEBUG_FRAME = org.powermock.modules.junit4.internal.impl.PowerMockJUnit44RunnerDelegateImpl.run(PowerMockJUnit44RunnerDelegateImpl.java:118)
	DEBUG_FRAME = org.powermock.modules.junit4.common.internal.impl.JUnit4TestSuiteChunkerImpl.run(JUnit4TestSuiteChunkerImpl.java:101)
	DEBUG_FRAME = org.powermock.modules.junit4.common.internal.impl.AbstractCommonPowerMockRunner.run(AbstractCommonPowerMockRunner.java:53)
	DEBUG_FRAME = org.powermock.modules.junit4.PowerMockRunner.run(PowerMockRunner.java:53)
	DEBUG_FRAME = org.junit.runners.Suite.runChild(Suite.java:128)
	DEBUG_FRAME = org.junit.runners.Suite.runChild(Suite.java:24)
	DEBUG_FRAME = org.junit.runners.ParentRunner$3.run(ParentRunner.java:193)
	DEBUG_FRAME = org.junit.runners.ParentRunner$1.schedule(ParentRunner.java:52)
	DEBUG_FRAME = org.junit.runners.ParentRunner.runChildren(ParentRunner.java:191)
	DEBUG_FRAME = org.junit.runners.ParentRunner.access$000(ParentRunner.java:42)
	DEBUG_FRAME = org.junit.runners.ParentRunner$2.evaluate(ParentRunner.java:184)
	DEBUG_FRAME = org.junit.runners.ParentRunner.run(ParentRunner.java:236)
	DEBUG_FRAME = org.junit.runners.Suite.runChild(Suite.java:128)
	DEBUG_FRAME = org.junit.runners.Suite.runChild(Suite.java:24)
	DEBUG_FRAME = org.junit.runners.ParentRunner$3.run(ParentRunner.java:193)
	DEBUG_FRAME = org.junit.runners.ParentRunner$1.schedule(ParentRunner.java:52)
	DEBUG_FRAME = org.junit.runners.ParentRunner.runChildren(ParentRunner.java:191)
	DEBUG_FRAME = org.junit.runners.ParentRunner.access$000(ParentRunner.java:42)
	DEBUG_FRAME = org.junit.runners.ParentRunner$2.evaluate(ParentRunner.java:184)
	DEBUG_FRAME = org.junit.runners.ParentRunner.run(ParentRunner.java:236)
	DEBUG_FRAME = org.apache.maven.surefire.junitcore.JUnitCore.run(JUnitCore.java:55)
	DEBUG_FRAME = org.apache.maven.surefire.junitcore.JUnitCoreWrapper.createRequestAndRun(JUnitCoreWrapper.java:137)
	DEBUG_FRAME = org.apache.maven.surefire.junitcore.JUnitCoreWrapper.executeEager(JUnitCoreWrapper.java:107)
	DEBUG_FRAME = org.apache.maven.surefire.junitcore.JUnitCoreWrapper.execute(JUnitCoreWrapper.java:83)
	DEBUG_FRAME = org.apache.maven.surefire.junitcore.JUnitCoreWrapper.execute(JUnitCoreWrapper.java:75)
	DEBUG_FRAME = org.apache.maven.surefire.junitcore.JUnitCoreProvider.invoke(JUnitCoreProvider.java:157)
	DEBUG_FRAME = org.apache.maven.surefire.booter.ForkedBooter.invokeProviderInSameClassLoader(ForkedBooter.java:386)
	DEBUG_FRAME = org.apache.maven.surefire.booter.ForkedBooter.runSuitesInProcess(ForkedBooter.java:323)
	DEBUG_FRAME = org.apache.maven.surefire.booter.ForkedBooter.main(ForkedBooter.java:143)

15:51:16,679 DEBUG [main] Loader:132 - Trying to find [org/apache/axis2/deployment/axis2_default.xml] using org.powermock.core.classloader.MockClassLoader@62f4ff3b class loader.
15:51:16,680 DEBUG [main] StAXUtils:210 - XMLStreamReader is org.apache.axiom.util.stax.dialect.Woodstox4StreamReaderWrapper
15:51:16,694 DEBUG [main] AxiomContainerSupport:172 - Builder is already complete.
15:51:16,695 DEBUG [main] Phase:98 - Handler RequestURIBasedDispatcher added to Phase Transport
15:51:16,696 DEBUG [main] Phase:98 - Handler SOAPActionBasedDispatcher added to Phase Transport
15:51:16,696 DEBUG [main] Phase:98 - Handler AddressingBasedDispatcher added to Phase Addressing
15:51:16,696 DEBUG [main] Phase:98 - Handler RequestURIBasedDispatcher added to Phase Dispatch
15:51:16,696 DEBUG [main] Phase:98 - Handler SOAPActionBasedDispatcher added to Phase Dispatch
15:51:16,697 DEBUG [main] Phase:98 - Handler RequestURIOperationDispatcher added to Phase Dispatch
15:51:16,697 DEBUG [main] Phase:98 - Handler SOAPMessageBodyBasedDispatcher added to Phase Dispatch
15:51:16,697 DEBUG [main] Phase:98 - Handler HTTPLocationBasedDispatcher added to Phase Dispatch
15:51:16,697 DEBUG [main] Phase:98 - Handler RequestURIBasedDispatcher added to Phase Transport
15:51:16,698 DEBUG [main] Phase:98 - Handler SOAPActionBasedDispatcher added to Phase Transport
15:51:16,698 DEBUG [main] Phase:98 - Handler AddressingBasedDispatcher added to Phase Addressing
15:51:16,698 DEBUG [main] Phase:98 - Handler RequestURIBasedDispatcher added to Phase Dispatch
15:51:16,698 DEBUG [main] Phase:98 - Handler SOAPActionBasedDispatcher added to Phase Dispatch
15:51:16,698 DEBUG [main] Phase:98 - Handler RequestURIOperationDispatcher added to Phase Dispatch
15:51:16,699 DEBUG [main] Phase:98 - Handler SOAPMessageBodyBasedDispatcher added to Phase Dispatch
15:51:16,699 DEBUG [main] Phase:98 - Handler HTTPLocationBasedDispatcher added to Phase Dispatch
15:51:16,700 DEBUG [main] Loader:256 - java.lang.ClassNotFoundException: org.apache.axis2.jaxws.framework.JAXWSServiceBuilderExtension
15:51:16,701  WARN [main] AxisConfigBuilder:442 - Unable to instantiate deployer org.apache.axis2.deployment.ServiceDeployer; see debug logs for more details
15:51:16,701 DEBUG [main] AxisConfigBuilder:444 - org.apache.axis2.jaxws.framework.JAXWSServiceBuilderExtension
java.lang.ClassNotFoundException: org.apache.axis2.jaxws.framework.JAXWSServiceBuilderExtension
	at java.net.URLClassLoader.findClass(URLClassLoader.java:382)
	at java.lang.ClassLoader.loadClass(ClassLoader.java:424)
	at sun.misc.Launcher$AppClassLoader.loadClass(Launcher.java:349)
	at java.lang.ClassLoader.loadClass(ClassLoader.java:357)
	at org.powermock.core.classloader.MockClassLoader.loadModifiedClass(MockClassLoader.java:145)
	at org.powermock.core.classloader.DeferSupportingClassLoader.loadClass(DeferSupportingClassLoader.java:67)
	at java.lang.ClassLoader.loadClass(ClassLoader.java:357)
	at java.lang.Class.forName0(Native Method)
	at java.lang.Class.forName(Class.java:264)
	at org.apache.axis2.util.Loader.loadClass(Loader.java:261)
	at org.apache.axis2.deployment.AxisConfigBuilder.processDeployers(AxisConfigBuilder.java:434)
	at org.apache.axis2.deployment.AxisConfigBuilder.populateConfig(AxisConfigBuilder.java:275)
	at org.apache.axis2.deployment.DeploymentEngine.populateAxisConfiguration(DeploymentEngine.java:629)
	at org.apache.axis2.deployment.FileSystemConfigurator.getAxisConfiguration(FileSystemConfigurator.java:116)
	at org.apache.axis2.context.ConfigurationContextFactory.createConfigurationContext(ConfigurationContextFactory.java:64)
	at org.apache.axis2.context.ConfigurationContextFactory.createConfigurationContextFromFileSystem(ConfigurationContextFactory.java:210)
	at org.apache.axis2.client.ServiceClient.configureServiceClient(ServiceClient.java:150)
	at org.apache.axis2.client.ServiceClient.<init>(ServiceClient.java:143)
	at net.ihe.gazelle.ws.client.GazelleProxyWebServiceNameStub.<init>(GazelleProxyWebServiceNameStub.java:43)
	at net.ihe.gazelle.ws.client.GazelleProxyWebServiceNameStub.<init>(GazelleProxyWebServiceNameStub.java:29)
	at net.ihe.gazelle.ws.client.GazelleProxyWebServiceNameStub.<init>(GazelleProxyWebServiceNameStub.java:75)
	at net.ihe.gazelle.wstester.util.WsClient.listConfigurationsBySystemBySessionByTypeAsCSV(WsClient.java:36)
	at net.ihe.gazelle.wstester.action.RunInstanceAction.getEndPointBySystem(RunInstanceAction.java:709)
	at net.ihe.gazelle.wstester.action.RunInstanceActionTest2.getEndPointBySystemOK(RunInstanceActionTest2.java:61)
	at sun.reflect.NativeMethodAccessorImpl.invoke0(Native Method)
	at sun.reflect.NativeMethodAccessorImpl.invoke(NativeMethodAccessorImpl.java:62)
	at sun.reflect.DelegatingMethodAccessorImpl.invoke(DelegatingMethodAccessorImpl.java:43)
	at java.lang.reflect.Method.invoke(Method.java:498)
	at org.junit.internal.runners.TestMethod.invoke(TestMethod.java:66)
	at org.powermock.modules.junit4.internal.impl.PowerMockJUnit44RunnerDelegateImpl$PowerMockJUnit44MethodRunner.runTestMethod(PowerMockJUnit44RunnerDelegateImpl.java:310)
	at org.junit.internal.runners.MethodRoadie$2.run(MethodRoadie.java:86)
	at org.junit.internal.runners.MethodRoadie.runBeforesThenTestThenAfters(MethodRoadie.java:94)
	at org.powermock.modules.junit4.internal.impl.PowerMockJUnit44RunnerDelegateImpl$PowerMockJUnit44MethodRunner.executeTest(PowerMockJUnit44RunnerDelegateImpl.java:294)
	at org.powermock.modules.junit4.internal.impl.PowerMockJUnit47RunnerDelegateImpl$PowerMockJUnit47MethodRunner.executeTestInSuper(PowerMockJUnit47RunnerDelegateImpl.java:127)
	at org.powermock.modules.junit4.internal.impl.PowerMockJUnit47RunnerDelegateImpl$PowerMockJUnit47MethodRunner.executeTest(PowerMockJUnit47RunnerDelegateImpl.java:82)
	at org.powermock.modules.junit4.internal.impl.PowerMockJUnit44RunnerDelegateImpl$PowerMockJUnit44MethodRunner.runBeforesThenTestThenAfters(PowerMockJUnit44RunnerDelegateImpl.java:282)
	at org.junit.internal.runners.MethodRoadie.runTest(MethodRoadie.java:84)
	at org.junit.internal.runners.MethodRoadie.run(MethodRoadie.java:49)
	at org.powermock.modules.junit4.internal.impl.PowerMockJUnit44RunnerDelegateImpl.invokeTestMethod(PowerMockJUnit44RunnerDelegateImpl.java:207)
	at org.powermock.modules.junit4.internal.impl.PowerMockJUnit44RunnerDelegateImpl.runMethods(PowerMockJUnit44RunnerDelegateImpl.java:146)
	at org.powermock.modules.junit4.internal.impl.PowerMockJUnit44RunnerDelegateImpl$1.run(PowerMockJUnit44RunnerDelegateImpl.java:120)
	at org.junit.internal.runners.ClassRoadie.runUnprotected(ClassRoadie.java:34)
	at org.junit.internal.runners.ClassRoadie.runProtected(ClassRoadie.java:44)
	at org.powermock.modules.junit4.internal.impl.PowerMockJUnit44RunnerDelegateImpl.run(PowerMockJUnit44RunnerDelegateImpl.java:118)
	at org.powermock.modules.junit4.common.internal.impl.JUnit4TestSuiteChunkerImpl.run(JUnit4TestSuiteChunkerImpl.java:101)
	at org.powermock.modules.junit4.common.internal.impl.AbstractCommonPowerMockRunner.run(AbstractCommonPowerMockRunner.java:53)
	at org.powermock.modules.junit4.PowerMockRunner.run(PowerMockRunner.java:53)
	at org.junit.runners.Suite.runChild(Suite.java:128)
	at org.junit.runners.Suite.runChild(Suite.java:24)
	at org.junit.runners.ParentRunner$3.run(ParentRunner.java:193)
	at org.junit.runners.ParentRunner$1.schedule(ParentRunner.java:52)
	at org.junit.runners.ParentRunner.runChildren(ParentRunner.java:191)
	at org.junit.runners.ParentRunner.access$000(ParentRunner.java:42)
	at org.junit.runners.ParentRunner$2.evaluate(ParentRunner.java:184)
	at org.junit.runners.ParentRunner.run(ParentRunner.java:236)
	at org.junit.runners.Suite.runChild(Suite.java:128)
	at org.junit.runners.Suite.runChild(Suite.java:24)
	at org.junit.runners.ParentRunner$3.run(ParentRunner.java:193)
	at org.junit.runners.ParentRunner$1.schedule(ParentRunner.java:52)
	at org.junit.runners.ParentRunner.runChildren(ParentRunner.java:191)
	at org.junit.runners.ParentRunner.access$000(ParentRunner.java:42)
	at org.junit.runners.ParentRunner$2.evaluate(ParentRunner.java:184)
	at org.junit.runners.ParentRunner.run(ParentRunner.java:236)
	at org.apache.maven.surefire.junitcore.JUnitCore.run(JUnitCore.java:55)
	at org.apache.maven.surefire.junitcore.JUnitCoreWrapper.createRequestAndRun(JUnitCoreWrapper.java:137)
	at org.apache.maven.surefire.junitcore.JUnitCoreWrapper.executeEager(JUnitCoreWrapper.java:107)
	at org.apache.maven.surefire.junitcore.JUnitCoreWrapper.execute(JUnitCoreWrapper.java:83)
	at org.apache.maven.surefire.junitcore.JUnitCoreWrapper.execute(JUnitCoreWrapper.java:75)
	at org.apache.maven.surefire.junitcore.JUnitCoreProvider.invoke(JUnitCoreProvider.java:157)
	at org.apache.maven.surefire.booter.ForkedBooter.invokeProviderInSameClassLoader(ForkedBooter.java:386)
	at org.apache.maven.surefire.booter.ForkedBooter.runSuitesInProcess(ForkedBooter.java:323)
	at org.apache.maven.surefire.booter.ForkedBooter.main(ForkedBooter.java:143)
15:51:16,703 DEBUG [main] AxisConfiguration:486 - Adding service to allServices map: [GazelleProxyWebServiceName1564753876655_2] 
15:51:16,704 DEBUG [main] AxisOperation:567 - AxisOperation::getSoapAction urn:anonRobustOp
15:51:16,704 DEBUG [main] AxisOperation:567 - AxisOperation::getSoapAction urn:anonOutonlyOp
15:51:16,704 DEBUG [main] AxisOperation:567 - AxisOperation::getSoapAction urn:getListOIDBySystemByRequirementAsCSV
15:51:16,704 DEBUG [main] AxisOperation:567 - AxisOperation::getSoapAction urn:anonOutInOp
15:51:16,704 DEBUG [main] AxisOperation:567 - AxisOperation::getSoapAction urn:listAllConfigurationsForAnActorAnInstitutionAndATypeAsCSV
15:51:16,704 DEBUG [main] AxisOperation:567 - AxisOperation::getSoapAction urn:listConfigurationsBySystemBySessionByTypeAsCSV
15:51:16,705 DEBUG [main] AxisOperation:567 - AxisOperation::getSoapAction urn:listAllConfigurationsForAnActorAndTypeAsCSV
15:51:16,705 DEBUG [main] AxisOperation:567 - AxisOperation::getSoapAction urn:listAllConfigurationsForAnInstitutionAndATypeAsCSV
15:51:16,705 DEBUG [main] AxisOperation:567 - AxisOperation::getSoapAction urn:getOIDBySystemByRequirement
15:51:16,705 DEBUG [main] AxisOperation:567 - AxisOperation::getSoapAction urn:listAllConfigurationsForATypeAsCSV
15:51:16,705 DEBUG [main] AxisOperation:567 - AxisOperation::getSoapAction urn:anonRobustOp
15:51:16,705 DEBUG [main] AxisOperation:567 - AxisOperation::getSoapAction urn:anonOutonlyOp
15:51:16,705 DEBUG [main] AxisOperation:567 - AxisOperation::getSoapAction urn:getListOIDBySystemByRequirementAsCSV
15:51:16,705 DEBUG [main] AxisOperation:567 - AxisOperation::getSoapAction urn:anonOutInOp
15:51:16,705 DEBUG [main] AxisOperation:567 - AxisOperation::getSoapAction urn:listAllConfigurationsForAnActorAnInstitutionAndATypeAsCSV
15:51:16,705 DEBUG [main] AxisOperation:567 - AxisOperation::getSoapAction urn:listConfigurationsBySystemBySessionByTypeAsCSV
15:51:16,706 DEBUG [main] AxisOperation:567 - AxisOperation::getSoapAction urn:listAllConfigurationsForAnActorAndTypeAsCSV
15:51:16,706 DEBUG [main] AxisOperation:567 - AxisOperation::getSoapAction urn:listAllConfigurationsForAnInstitutionAndATypeAsCSV
15:51:16,706 DEBUG [main] AxisOperation:567 - AxisOperation::getSoapAction urn:getOIDBySystemByRequirement
15:51:16,706 DEBUG [main] AxisOperation:567 - AxisOperation::getSoapAction urn:listAllConfigurationsForATypeAsCSV
15:51:16,706 DEBUG [main] AxisConfiguration:396 - Adding service to allEndpoints map: (GazelleProxyWebServiceName1564753876655_2,GazelleProxyWebServiceName1564753876655_2HttpSoap12Endpoint) 
15:51:16,706 DEBUG [main] AxisConfiguration:396 - Adding service to allEndpoints map: (GazelleProxyWebServiceName1564753876655_2,GazelleProxyWebServiceName1564753876655_2HttpSoap11Endpoint) 
15:51:16,706 DEBUG [main] AxisConfiguration:396 - Adding service to allEndpoints map: (GazelleProxyWebServiceName1564753876655_2,GazelleProxyWebServiceName1564753876655_2HttpEndpoint) 
15:51:16,706 DEBUG [main] AxisConfiguration:403 - After adding to allEndpoints map, size is 3
15:51:16,706 DEBUG [main] AxisService:1971 - Get operation for {http://ws.configurations.tm.gazelle.ihe.net/}listConfigurationsBySystemBySessionByTypeAsCSV
15:51:16,706 DEBUG [main] AxisService:2014 - Found axis operation:  org.apache.axis2.description.OutInAxisOperation@74cd539
15:51:16,707 DEBUG [main] Options:589 - setAction Old action is (null)
15:51:16,707 DEBUG [main] Options:590 - setAction New action is (http://ws.configurations.tm.gazelle.ihe.net/GazelleProxyWebService/listConfigurationsBySystemBySessionByTypeAsCSV)
15:51:16,707 DEBUG [main] ConfigurationContext:85 - registerOperationContext (false): org.apache.axis2.context.OperationContext@225153c8 with key: urn:uuid:a4cc99b2-0912-4b87-bf7d-b5ea52459ed6
15:51:16,707 DEBUG [main] OutInAxisOperationClient:164 - Entry: OutInAxisOperationClient::execute, true
15:51:16,707 DEBUG [main] Options:246 - getAction (null) from org.apache.axis2.client.Options@2e69499e
15:51:16,707 DEBUG [main] MessageContext:1119 - SoapAction is (null)
15:51:16,707 DEBUG [main] Options:246 - getAction (http://ws.configurations.tm.gazelle.ihe.net/GazelleProxyWebService/listConfigurationsBySystemBySessionByTypeAsCSV) from org.apache.axis2.client.Options@3fdc1310
15:51:16,707 DEBUG [main] Options:246 - getAction (null) from org.apache.axis2.client.Options@2e69499e
15:51:16,708 DEBUG [main] MessageContext:1524 - Old SoapAction is (null)
15:51:16,708 DEBUG [main] MessageContext:1525 - New SoapAction is (http://ws.configurations.tm.gazelle.ihe.net/GazelleProxyWebService/listConfigurationsBySystemBySessionByTypeAsCSV)
15:51:16,708 DEBUG [main] Options:589 - setAction Old action is (null)
15:51:16,708 DEBUG [main] Options:590 - setAction New action is (http://ws.configurations.tm.gazelle.ihe.net/GazelleProxyWebService/listConfigurationsBySystemBySessionByTypeAsCSV)
15:51:16,708 DEBUG [main] OutInAxisOperationClient:194 - OutInAxisOperationClient: useAsyncOption null
15:51:16,708 DEBUG [main] ConfigurationContext:85 - registerOperationContext (false): org.apache.axis2.context.OperationContext@225153c8 with key: urn:uuid:a4cc99b2-0912-4b87-bf7d-b5ea52459ed6
15:51:16,708 DEBUG [main] Options:246 - getAction (http://ws.configurations.tm.gazelle.ihe.net/GazelleProxyWebService/listConfigurationsBySystemBySessionByTypeAsCSV) from org.apache.axis2.client.Options@2e69499e
15:51:16,708 DEBUG [main] MessageContext:1154 - WASAction is (http://ws.configurations.tm.gazelle.ihe.net/GazelleProxyWebService/listConfigurationsBySystemBySessionByTypeAsCSV)
15:51:16,708 DEBUG [main] ConfigurationContext:85 - msgContext: [MessageContext: logID=8e4f3eeff992d84e46a47c68e4a8da74e166ea4bd08845d1] action: http://ws.configurations.tm.gazelle.ihe.net/GazelleProxyWebService/listConfigurationsBySystemBySessionByTypeAsCSV
15:51:16,708 DEBUG [main] Phase:289 - [MessageContext: logID=8e4f3eeff992d84e46a47c68e4a8da74e166ea4bd08845d1] Checking pre-condition for Phase "RMPhase"
15:51:16,708 DEBUG [main] Phase:300 - [MessageContext: logID=8e4f3eeff992d84e46a47c68e4a8da74e166ea4bd08845d1] Invoking phase "RMPhase"
15:51:16,708 DEBUG [main] Phase:319 - [MessageContext: logID=8e4f3eeff992d84e46a47c68e4a8da74e166ea4bd08845d1] Checking post-conditions for phase "RMPhase"
15:51:16,709 DEBUG [main] Phase:289 - [MessageContext: logID=8e4f3eeff992d84e46a47c68e4a8da74e166ea4bd08845d1] Checking pre-condition for Phase "OpPhase"
15:51:16,709 DEBUG [main] Phase:300 - [MessageContext: logID=8e4f3eeff992d84e46a47c68e4a8da74e166ea4bd08845d1] Invoking phase "OpPhase"
15:51:16,709 DEBUG [main] Phase:319 - [MessageContext: logID=8e4f3eeff992d84e46a47c68e4a8da74e166ea4bd08845d1] Checking post-conditions for phase "OpPhase"
15:51:16,709 DEBUG [main] Phase:289 - [MessageContext: logID=8e4f3eeff992d84e46a47c68e4a8da74e166ea4bd08845d1] Checking pre-condition for Phase "OperationOutPhase"
15:51:16,709 DEBUG [main] Phase:300 - [MessageContext: logID=8e4f3eeff992d84e46a47c68e4a8da74e166ea4bd08845d1] Invoking phase "OperationOutPhase"
15:51:16,709 DEBUG [main] Phase:319 - [MessageContext: logID=8e4f3eeff992d84e46a47c68e4a8da74e166ea4bd08845d1] Checking post-conditions for phase "OperationOutPhase"
15:51:16,709 DEBUG [main] Phase:289 - [MessageContext: logID=8e4f3eeff992d84e46a47c68e4a8da74e166ea4bd08845d1] Checking pre-condition for Phase "PolicyDetermination"
15:51:16,709 DEBUG [main] Phase:300 - [MessageContext: logID=8e4f3eeff992d84e46a47c68e4a8da74e166ea4bd08845d1] Invoking phase "PolicyDetermination"
15:51:16,709 DEBUG [main] Phase:319 - [MessageContext: logID=8e4f3eeff992d84e46a47c68e4a8da74e166ea4bd08845d1] Checking post-conditions for phase "PolicyDetermination"
15:51:16,709 DEBUG [main] Phase:289 - [MessageContext: logID=8e4f3eeff992d84e46a47c68e4a8da74e166ea4bd08845d1] Checking pre-condition for Phase "MessageOut"
15:51:16,709 DEBUG [main] Phase:300 - [MessageContext: logID=8e4f3eeff992d84e46a47c68e4a8da74e166ea4bd08845d1] Invoking phase "MessageOut"
15:51:16,709 DEBUG [main] Phase:319 - [MessageContext: logID=8e4f3eeff992d84e46a47c68e4a8da74e166ea4bd08845d1] Checking post-conditions for phase "MessageOut"
15:51:16,709 DEBUG [main] Phase:289 - [MessageContext: logID=8e4f3eeff992d84e46a47c68e4a8da74e166ea4bd08845d1] Checking pre-condition for Phase "Security"
15:51:16,709 DEBUG [main] Phase:300 - [MessageContext: logID=8e4f3eeff992d84e46a47c68e4a8da74e166ea4bd08845d1] Invoking phase "Security"
15:51:16,710 DEBUG [main] Phase:319 - [MessageContext: logID=8e4f3eeff992d84e46a47c68e4a8da74e166ea4bd08845d1] Checking post-conditions for phase "Security"
15:51:16,710 DEBUG [main] DefaultHttpParams:151 - Set parameter http.connection-manager.timeout = 30000
15:51:16,710 DEBUG [main] DefaultHttpParams:151 - Set parameter http.connection.timeout = 60000
15:51:16,710 DEBUG [main] DefaultHttpParams:151 - Set parameter http.socket.timeout = 60000
15:51:16,710 DEBUG [main] DefaultHttpParams:151 - Set parameter http.socket.timeout = 60000
15:51:16,710 DEBUG [main] OMOutputFormat:196 - Start getContentType: OMOutputFormat [ mimeBoundary =null rootContentId=null doOptimize=false doingSWA=false isSOAP11=true charSetEncoding=UTF-8 xmlVersion=null contentType=null ignoreXmlDeclaration=false autoCloseWriter=false actionProperty=null optimizedThreshold=0]
15:51:16,710 DEBUG [main] OMOutputFormat:215 - getContentType= {text/xml}   OMOutputFormat [ mimeBoundary =null rootContentId=null doOptimize=false doingSWA=false isSOAP11=true charSetEncoding=UTF-8 xmlVersion=null contentType=text/xml ignoreXmlDeclaration=false autoCloseWriter=false actionProperty=null optimizedThreshold=0]
15:51:16,710 DEBUG [main] SOAPMessageFormatter:123 - contentType from the OMOutputFormat =text/xml
15:51:16,710 DEBUG [main] SOAPMessageFormatter:148 - contentType returned =text/xml; charset=UTF-8
15:51:16,711 DEBUG [main] DefaultHttpParams:151 - Set parameter http.connection.timeout = 60000
15:51:16,711 DEBUG [main] DefaultHttpParams:151 - Set parameter http.socket.timeout = 60000
15:51:16,711 DEBUG [main] MultiThreadedHttpConnectionManager:412 - HttpConnectionManager.getConnection:  config = HostConfiguration[host=https://ehealthsuisse.ihe-europe.net], timeout = 30000
15:51:16,711 DEBUG [main] MultiThreadedHttpConnectionManager:760 - Allocating new connection, hostConfig=HostConfiguration[host=https://ehealthsuisse.ihe-europe.net]
15:51:16,711 DEBUG [main] HttpConnection:692 - Open connection to ehealthsuisse.ihe-europe.net:443
15:51:16,713 DEBUG [main] header:70 - >> "POST /gazelle-tm-ejb/GazelleProxyWebServiceName/GazelleProxyWebService HTTP/1.1[\r][\n]"
15:51:16,713 DEBUG [main] HttpMethodBase:1352 - Adding Host request header
15:51:16,714 DEBUG [main] header:70 - >> "Content-Type: text/xml; charset=UTF-8[\r][\n]"
15:51:16,714 DEBUG [main] header:70 - >> "SOAPAction: ""[\r][\n]"
15:51:16,714 DEBUG [main] header:70 - >> "User-Agent: Axis2[\r][\n]"
15:51:16,714 DEBUG [main] header:70 - >> "Host: ehealthsuisse.ihe-europe.net[\r][\n]"
15:51:16,714 DEBUG [main] header:70 - >> "Transfer-Encoding: chunked[\r][\n]"
15:51:16,714 DEBUG [main] header:70 - >> "[\r][\n]"
15:51:16,714 DEBUG [main] SOAPMessageFormatter:51 - start writeTo()
15:51:16,714 DEBUG [main] SOAPMessageFormatter:52 -   preserve=false
15:51:16,714 DEBUG [main] SOAPMessageFormatter:53 -   isOptimized=false
15:51:16,715 DEBUG [main] SOAPMessageFormatter:54 -   isDoingSWA=false
15:51:16,715 DEBUG [main] MTOMXMLStreamWriter:130 - Creating MTOMXMLStreamWriter
15:51:16,715 DEBUG [main] MTOMXMLStreamWriter:131 - OutputStream =class org.apache.commons.httpclient.ChunkedOutputStream
15:51:16,715 DEBUG [main] MTOMXMLStreamWriter:132 - OMFormat = OMOutputFormat [ mimeBoundary =null rootContentId=null doOptimize=false doingSWA=false isSOAP11=true charSetEncoding=UTF-8 xmlVersion=null contentType=text/xml ignoreXmlDeclaration=false autoCloseWriter=false actionProperty=null optimizedThreshold=0]
15:51:16,715 DEBUG [main] MTOMXMLStreamWriter:133 - preserveAttachments = false
15:51:16,715 DEBUG [main] StAXUtils:344 - XMLStreamWriter is org.apache.axiom.util.stax.dialect.Woodstox4StreamWriterWrapper
15:51:16,715 DEBUG [main] MTOMXMLStreamWriter:230 - Calling MTOMXMLStreamWriter.flush
15:51:16,730 DEBUG [main] SOAPEnvelopeImpl:180 - Could not close builder or parser due to:
15:51:16,730 DEBUG [main] SOAPEnvelopeImpl:182 - builder is null
15:51:16,730 DEBUG [main] MTOMXMLStreamWriter:219 - close
15:51:16,730 DEBUG [main] MTOMXMLStreamWriter:230 - Calling MTOMXMLStreamWriter.flush
15:51:16,731 DEBUG [main] SOAPMessageFormatter:81 - end writeTo()
15:51:16,731 DEBUG [main] content:70 - >> "1ee[\r][\n]"
15:51:16,731 DEBUG [main] content:84 - >> "<?xml version='1.0' encoding='UTF-8'?><soapenv:Envelope xmlns:soapenv="http://schemas.xmlsoap.org/soap/envelope/"><soapenv:Header/><soapenv:Body><ns1:listConfigurationsBySystemBySessionByTypeAsCSV xmlns:ns1="http://ws.configurations.tm.gazelle.ihe.net/"><systemKeyword>Core Community Component_Post_0</systemKeyword><testingSessionId>1</testingSessionId><configurationType>HL7V3Responder</configurationType></ns1:listConfigurationsBySystemBySessionByTypeAsCSV></soapenv:Body></soapenv:Envelope>"
15:51:16,731 DEBUG [main] content:70 - >> "[\r][\n]"
15:51:16,731 DEBUG [main] content:84 - >> "0"
15:51:16,731 DEBUG [main] content:70 - >> "[\r][\n]"
15:51:16,731 DEBUG [main] content:70 - >> "[\r][\n]"
15:51:16,732 DEBUG [main] EntityEnclosingMethod:508 - Request body sent
15:51:16,788 DEBUG [main] header:70 - << "HTTP/1.1 200 OK[\r][\n]"
15:51:16,788 DEBUG [main] header:70 - << "HTTP/1.1 200 OK[\r][\n]"
15:51:16,789 DEBUG [main] header:70 - << "Date: Fri, 02 Aug 2019 13:51:16 GMT[\r][\n]"
15:51:16,789 DEBUG [main] header:70 - << "Server: Apache[\r][\n]"
15:51:16,789 DEBUG [main] header:70 - << "Strict-Transport-Security: max-age=63072000; includeSubdomains;[\r][\n]"
15:51:16,789 DEBUG [main] header:70 - << "Content-Type: text/xml;charset=UTF-8[\r][\n]"
15:51:16,790 DEBUG [main] header:70 - << "Content-Length: 645[\r][\n]"
15:51:16,790 DEBUG [main] header:70 - << "Vary: Accept-Encoding[\r][\n]"
15:51:16,790 DEBUG [main] header:70 - << "[\r][\n]"
15:51:16,791 DEBUG [main] Phase:340 - [MessageContext: logID=8e4f3eeff992d84e46a47c68e4a8da74e166ea4bd08845d1] Invoking flowComplete() in Phase "Security"
15:51:16,791 DEBUG [main] Phase:340 - [MessageContext: logID=8e4f3eeff992d84e46a47c68e4a8da74e166ea4bd08845d1] Invoking flowComplete() in Phase "MessageOut"
15:51:16,791 DEBUG [main] Phase:340 - [MessageContext: logID=8e4f3eeff992d84e46a47c68e4a8da74e166ea4bd08845d1] Invoking flowComplete() in Phase "PolicyDetermination"
15:51:16,791 DEBUG [main] Phase:340 - [MessageContext: logID=8e4f3eeff992d84e46a47c68e4a8da74e166ea4bd08845d1] Invoking flowComplete() in Phase "OperationOutPhase"
15:51:16,791 DEBUG [main] Phase:340 - [MessageContext: logID=8e4f3eeff992d84e46a47c68e4a8da74e166ea4bd08845d1] Invoking flowComplete() in Phase "OpPhase"
15:51:16,791 DEBUG [main] Phase:340 - [MessageContext: logID=8e4f3eeff992d84e46a47c68e4a8da74e166ea4bd08845d1] Invoking flowComplete() in Phase "RMPhase"
15:51:16,792 DEBUG [main] Options:246 - getAction (http://ws.configurations.tm.gazelle.ihe.net/GazelleProxyWebService/listConfigurationsBySystemBySessionByTypeAsCSV) from org.apache.axis2.client.Options@3fdc1310
15:51:16,792 DEBUG [main] MessageContext:1524 - Old SoapAction is (http://ws.configurations.tm.gazelle.ihe.net/GazelleProxyWebService/listConfigurationsBySystemBySessionByTypeAsCSV)
15:51:16,792 DEBUG [main] MessageContext:1525 - New SoapAction is (null)
15:51:16,792 DEBUG [main] Options:589 - setAction Old action is (null)
15:51:16,792 DEBUG [main] Options:590 - setAction New action is (null)
15:51:16,793 DEBUG [main] Options:246 - getAction (http://ws.configurations.tm.gazelle.ihe.net/GazelleProxyWebService/listConfigurationsBySystemBySessionByTypeAsCSV) from org.apache.axis2.client.Options@3fdc1310
15:51:16,793 DEBUG [main] MessageContext:1119 - SoapAction is (http://ws.configurations.tm.gazelle.ihe.net/GazelleProxyWebService/listConfigurationsBySystemBySessionByTypeAsCSV)
15:51:16,793 DEBUG [main] TransportUtils:200 - createSOAPEnvelope using Builder (class org.apache.axis2.builder.SOAPBuilder) selected from type (text/xml)
15:51:16,794 DEBUG [main] content:70 - << "<soap:Envelope xmlns:soap="http://schemas.xmlsoap.org/soap/envelope/"><soap:Body><ns2:listConfigurationsBySystemBySessionByTypeAsCSVResponse xmlns:ns2="http://ws.configurations.tm.gazelle.ihe.net/"><return>Configuration Type,Company,System,Host,Actor,is secured,is approved,comment,assigningAuthority,url,assigningAuthority,ws-type,port,port proxy,port secured&#xD;[\n]"
15:51:16,794 DEBUG [main] content:70 - << "HL7 V3 responder,Post,Core Community Component_Post_0,post1,DOC_REGISTRY,false,true,,POC1,http://post1:8081/SGW/HV3PIX/FEED,POC1,ITI-44:Patient Identity Feed HL7v3,8081,11207,&#xD;[\n]"
15:51:16,794 DEBUG [main] content:84 - << "</return></ns2:listConfigurationsBySystemBySessionByTypeAsCSVResponse></soap:Body></soap:Envelope>"
15:51:16,794 DEBUG [main] StAXUtils:194 - XMLStreamReader is org.apache.axiom.util.stax.dialect.Woodstox4StreamReaderWrapper
15:51:16,795 DEBUG [main] StAXSOAPModelBuilder:210 - Starting to process SOAP 1.1 message
15:51:16,796 DEBUG [main] StAXOMBuilder:696 - Performing look-ahead; START_ELEMENT found
15:51:16,796 DEBUG [main] Phase:289 - [MessageContext: logID=9e4f3eeff992d84e46a47c68e4a8da74e166ea4bd08845d1] Checking pre-condition for Phase "Transport"
15:51:16,796 DEBUG [main] Phase:300 - [MessageContext: logID=9e4f3eeff992d84e46a47c68e4a8da74e166ea4bd08845d1] Invoking phase "Transport"
15:51:16,796 DEBUG [main] Phase:331 - [MessageContext: logID=9e4f3eeff992d84e46a47c68e4a8da74e166ea4bd08845d1] Invoking Handler 'RequestURIBasedDispatcher' in Phase 'Transport'
15:51:16,797 DEBUG [main] Phase:331 - [MessageContext: logID=9e4f3eeff992d84e46a47c68e4a8da74e166ea4bd08845d1] Invoking Handler 'SOAPActionBasedDispatcher' in Phase 'Transport'
15:51:16,797 DEBUG [main] Phase:319 - [MessageContext: logID=9e4f3eeff992d84e46a47c68e4a8da74e166ea4bd08845d1] Checking post-conditions for phase "Transport"
15:51:16,797 DEBUG [main] Phase:289 - [MessageContext: logID=9e4f3eeff992d84e46a47c68e4a8da74e166ea4bd08845d1] Checking pre-condition for Phase "Addressing"
15:51:16,797 DEBUG [main] Phase:300 - [MessageContext: logID=9e4f3eeff992d84e46a47c68e4a8da74e166ea4bd08845d1] Invoking phase "Addressing"
15:51:16,797 DEBUG [main] Phase:331 - [MessageContext: logID=9e4f3eeff992d84e46a47c68e4a8da74e166ea4bd08845d1] Invoking Handler 'AddressingBasedDispatcher' in Phase 'Addressing'
15:51:16,798 DEBUG [main] Phase:319 - [MessageContext: logID=9e4f3eeff992d84e46a47c68e4a8da74e166ea4bd08845d1] Checking post-conditions for phase "Addressing"
15:51:16,798 DEBUG [main] Phase:289 - [MessageContext: logID=9e4f3eeff992d84e46a47c68e4a8da74e166ea4bd08845d1] Checking pre-condition for Phase "Security"
15:51:16,798 DEBUG [main] Phase:300 - [MessageContext: logID=9e4f3eeff992d84e46a47c68e4a8da74e166ea4bd08845d1] Invoking phase "Security"
15:51:16,798 DEBUG [main] Phase:319 - [MessageContext: logID=9e4f3eeff992d84e46a47c68e4a8da74e166ea4bd08845d1] Checking post-conditions for phase "Security"
15:51:16,798 DEBUG [main] Phase:289 - [MessageContext: logID=9e4f3eeff992d84e46a47c68e4a8da74e166ea4bd08845d1] Checking pre-condition for Phase "PreDispatch"
15:51:16,799 DEBUG [main] Phase:300 - [MessageContext: logID=9e4f3eeff992d84e46a47c68e4a8da74e166ea4bd08845d1] Invoking phase "PreDispatch"
15:51:16,799 DEBUG [main] Phase:319 - [MessageContext: logID=9e4f3eeff992d84e46a47c68e4a8da74e166ea4bd08845d1] Checking post-conditions for phase "PreDispatch"
15:51:16,799 DEBUG [main] Phase:289 - [MessageContext: logID=9e4f3eeff992d84e46a47c68e4a8da74e166ea4bd08845d1] Checking pre-condition for Phase "Dispatch"
15:51:16,799 DEBUG [main] Phase:300 - [MessageContext: logID=9e4f3eeff992d84e46a47c68e4a8da74e166ea4bd08845d1] Invoking phase "Dispatch"
15:51:16,800 DEBUG [main] Phase:331 - [MessageContext: logID=9e4f3eeff992d84e46a47c68e4a8da74e166ea4bd08845d1] Invoking Handler 'RequestURIBasedDispatcher' in Phase 'Dispatch'
15:51:16,800 DEBUG [main] Phase:331 - [MessageContext: logID=9e4f3eeff992d84e46a47c68e4a8da74e166ea4bd08845d1] Invoking Handler 'SOAPActionBasedDispatcher' in Phase 'Dispatch'
15:51:16,800 DEBUG [main] Phase:331 - [MessageContext: logID=9e4f3eeff992d84e46a47c68e4a8da74e166ea4bd08845d1] Invoking Handler 'RequestURIOperationDispatcher' in Phase 'Dispatch'
15:51:16,800 DEBUG [main] Phase:331 - [MessageContext: logID=9e4f3eeff992d84e46a47c68e4a8da74e166ea4bd08845d1] Invoking Handler 'SOAPMessageBodyBasedDispatcher' in Phase 'Dispatch'
15:51:16,800 DEBUG [main] Phase:331 - [MessageContext: logID=9e4f3eeff992d84e46a47c68e4a8da74e166ea4bd08845d1] Invoking Handler 'HTTPLocationBasedDispatcher' in Phase 'Dispatch'
15:51:16,801 DEBUG [main] Phase:319 - [MessageContext: logID=9e4f3eeff992d84e46a47c68e4a8da74e166ea4bd08845d1] Checking post-conditions for phase "Dispatch"
15:51:16,801 DEBUG [main] AddressingHelper:102 - [MessageContext: logID=9e4f3eeff992d84e46a47c68e4a8da74e166ea4bd08845d1] isReplyRedirected: ReplyTo is null. Returning false
15:51:16,801 DEBUG [main] Phase:289 - [MessageContext: logID=9e4f3eeff992d84e46a47c68e4a8da74e166ea4bd08845d1] Checking pre-condition for Phase "RMPhase"
15:51:16,801 DEBUG [main] Phase:300 - [MessageContext: logID=9e4f3eeff992d84e46a47c68e4a8da74e166ea4bd08845d1] Invoking phase "RMPhase"
15:51:16,801 DEBUG [main] Phase:319 - [MessageContext: logID=9e4f3eeff992d84e46a47c68e4a8da74e166ea4bd08845d1] Checking post-conditions for phase "RMPhase"
15:51:16,802 DEBUG [main] Phase:289 - [MessageContext: logID=9e4f3eeff992d84e46a47c68e4a8da74e166ea4bd08845d1] Checking pre-condition for Phase "OpPhase"
15:51:16,802 DEBUG [main] Phase:300 - [MessageContext: logID=9e4f3eeff992d84e46a47c68e4a8da74e166ea4bd08845d1] Invoking phase "OpPhase"
15:51:16,802 DEBUG [main] Phase:319 - [MessageContext: logID=9e4f3eeff992d84e46a47c68e4a8da74e166ea4bd08845d1] Checking post-conditions for phase "OpPhase"
15:51:16,802 DEBUG [main] Phase:289 - [MessageContext: logID=9e4f3eeff992d84e46a47c68e4a8da74e166ea4bd08845d1] Checking pre-condition for Phase "OperationInPhase"
15:51:16,802 DEBUG [main] Phase:300 - [MessageContext: logID=9e4f3eeff992d84e46a47c68e4a8da74e166ea4bd08845d1] Invoking phase "OperationInPhase"
15:51:16,802 DEBUG [main] Phase:319 - [MessageContext: logID=9e4f3eeff992d84e46a47c68e4a8da74e166ea4bd08845d1] Checking post-conditions for phase "OperationInPhase"
15:51:16,803 DEBUG [main] Phase:340 - [MessageContext: logID=9e4f3eeff992d84e46a47c68e4a8da74e166ea4bd08845d1] Invoking flowComplete() in Phase "OperationInPhase"
15:51:16,803 DEBUG [main] Phase:340 - [MessageContext: logID=9e4f3eeff992d84e46a47c68e4a8da74e166ea4bd08845d1] Invoking flowComplete() in Phase "OpPhase"
15:51:16,803 DEBUG [main] Phase:340 - [MessageContext: logID=9e4f3eeff992d84e46a47c68e4a8da74e166ea4bd08845d1] Invoking flowComplete() in Phase "RMPhase"
15:51:16,803 DEBUG [main] Phase:340 - [MessageContext: logID=9e4f3eeff992d84e46a47c68e4a8da74e166ea4bd08845d1] Invoking flowComplete() in Phase "Dispatch"
15:51:16,803 DEBUG [main] Phase:359 - [MessageContext: logID=9e4f3eeff992d84e46a47c68e4a8da74e166ea4bd08845d1] Invoking flowComplete() for Handler 'HTTPLocationBasedDispatcher' in Phase 'Dispatch'
15:51:16,804 DEBUG [main] Phase:359 - [MessageContext: logID=9e4f3eeff992d84e46a47c68e4a8da74e166ea4bd08845d1] Invoking flowComplete() for Handler 'SOAPMessageBodyBasedDispatcher' in Phase 'Dispatch'
15:51:16,804 DEBUG [main] Phase:359 - [MessageContext: logID=9e4f3eeff992d84e46a47c68e4a8da74e166ea4bd08845d1] Invoking flowComplete() for Handler 'RequestURIOperationDispatcher' in Phase 'Dispatch'
15:51:16,804 DEBUG [main] Phase:359 - [MessageContext: logID=9e4f3eeff992d84e46a47c68e4a8da74e166ea4bd08845d1] Invoking flowComplete() for Handler 'SOAPActionBasedDispatcher' in Phase 'Dispatch'
15:51:16,804 DEBUG [main] Phase:359 - [MessageContext: logID=9e4f3eeff992d84e46a47c68e4a8da74e166ea4bd08845d1] Invoking flowComplete() for Handler 'RequestURIBasedDispatcher' in Phase 'Dispatch'
15:51:16,804 DEBUG [main] Phase:340 - [MessageContext: logID=9e4f3eeff992d84e46a47c68e4a8da74e166ea4bd08845d1] Invoking flowComplete() in Phase "PreDispatch"
15:51:16,805 DEBUG [main] Phase:340 - [MessageContext: logID=9e4f3eeff992d84e46a47c68e4a8da74e166ea4bd08845d1] Invoking flowComplete() in Phase "Security"
15:51:16,805 DEBUG [main] Phase:340 - [MessageContext: logID=9e4f3eeff992d84e46a47c68e4a8da74e166ea4bd08845d1] Invoking flowComplete() in Phase "Addressing"
15:51:16,805 DEBUG [main] Phase:359 - [MessageContext: logID=9e4f3eeff992d84e46a47c68e4a8da74e166ea4bd08845d1] Invoking flowComplete() for Handler 'AddressingBasedDispatcher' in Phase 'Addressing'
15:51:16,805 DEBUG [main] Phase:340 - [MessageContext: logID=9e4f3eeff992d84e46a47c68e4a8da74e166ea4bd08845d1] Invoking flowComplete() in Phase "Transport"
15:51:16,805 DEBUG [main] Phase:359 - [MessageContext: logID=9e4f3eeff992d84e46a47c68e4a8da74e166ea4bd08845d1] Invoking flowComplete() for Handler 'SOAPActionBasedDispatcher' in Phase 'Transport'
15:51:16,806 DEBUG [main] Phase:359 - [MessageContext: logID=9e4f3eeff992d84e46a47c68e4a8da74e166ea4bd08845d1] Invoking flowComplete() for Handler 'RequestURIBasedDispatcher' in Phase 'Transport'
15:51:16,806 DEBUG [main] StAXOMBuilder:648 - Consuming look-ahead token START_ELEMENT
15:51:16,806 DEBUG [main] PullSerializer:66 - Pull serializer created; initial state is org.apache.axiom.om.impl.common.serializer.pull.Navigator@60451d22[cache=false,document=false]
15:51:16,807 DEBUG [main] StAXBuilder:575 - Caching disabled; current element level is 3
15:51:16,807 DEBUG [main] Navigator:661 - Switching to pull-through mode; first event is START_ELEMENT; depth is 1
15:51:16,807 DEBUG [main] PullSerializer:109 - Switching to state org.apache.axiom.om.impl.common.serializer.pull.PullThroughWrapper@541fbe6e[reader=org.apache.axiom.util.stax.dialect.Woodstox4StreamReaderWrapper@48727d33]
15:51:16,807 DEBUG [main] HttpMethodBase:1024 - Resorting to protocol version default close connection policy
15:51:16,807 DEBUG [main] HttpMethodBase:1028 - Should NOT close connection, using HTTP/1.1
15:51:16,808 DEBUG [main] HttpConnection:1178 - Releasing connection back to connection manager.
15:51:16,808 DEBUG [main] MultiThreadedHttpConnectionManager:979 - Freeing connection, hostConfig=HostConfiguration[host=https://ehealthsuisse.ihe-europe.net]
15:51:16,808 DEBUG [main] IdleConnectionHandler:76 - Adding connection at: 1564753876808
15:51:16,808 DEBUG [main] MultiThreadedHttpConnectionManager:961 - Notifying no-one, there are no waiting threads
[INFO] Tests run: 1, Failures: 0, Errors: 0, Skipped: 0, Time elapsed: 2 s - in net.ihe.gazelle.wstester.action.RunInstanceActionTest2
[INFO] Running net.ihe.gazelle.wstester.action.RunInstanceActionTest
15:51:16,941 INFO  [WsdlProject] Loaded project from [file:/home/jenkins/.hudson/jobs/gazelle-webservice-tester-nbt/workspace/gazelle-webservice-tester-ejb/src/test/resources/soapui_project.xml]
[INFO] Tests run: 3, Failures: 0, Errors: 0, Skipped: 0, Time elapsed: 0.098 s - in net.ihe.gazelle.wstester.action.RunInstanceActionTest
[INFO] Running net.ihe.gazelle.wstester.model.GwtTestStepResultTest
[INFO] Tests run: 3, Failures: 0, Errors: 0, Skipped: 0, Time elapsed: 0 s - in net.ihe.gazelle.wstester.model.GwtTestStepResultTest
[INFO] Running net.ihe.gazelle.wstester.util.DateUtilTest
[INFO] Tests run: 3, Failures: 0, Errors: 0, Skipped: 0, Time elapsed: 0.006 s - in net.ihe.gazelle.wstester.util.DateUtilTest
[INFO] Running net.ihe.gazelle.wstester.xdstools.Ws
15:51:17,170 DEBUG [Finalizer] ConfigurationContext:85 - Invoke modules shutdown.
15:51:17,170 DEBUG [Finalizer] ConfigurationContext:85 - Modules to be shutdown from axisConfiguration: {}
15:51:17,170 DEBUG [Finalizer] ConfigurationContext:85 - Invoke services shutdown.
15:51:17,176 DEBUG [Finalizer] ConfigurationContext:85 - ConfigurationContext is stopped, modules and services not being shut down
15:51:17,185 DEBUG [Finalizer] ConfigurationContext:85 - Invoke modules shutdown.
15:51:17,185 DEBUG [Finalizer] ConfigurationContext:85 - Modules to be shutdown from axisConfiguration: {}
15:51:17,185 DEBUG [Finalizer] ConfigurationContext:85 - Invoke services shutdown.
15:51:17,185 DEBUG [Finalizer] ConfigurationContext:85 - ConfigurationContext is stopped, modules and services not being shut down
15:51:17,458 DEBUG [main] DefaultOMMetaFactoryLocator:77 - Starting class path based discovery
15:51:17,461 DEBUG [main] ImplementationFactory:79 - Loading jar:file:/home/jenkins/.m2/repository/org/apache/ws/commons/axiom/axiom-impl/1.2.19/axiom-impl-1.2.19.jar!/META-INF/axiom.xml
15:51:17,548 DEBUG [main] ImplementationFactory:125 - Discovered implementations: [llom(metaFactory=org.apache.axiom.om.impl.llom.factory.OMLinkedListMetaFactory,features=[default(priority=100)])]
15:51:17,548 DEBUG [main] ImplementationFactory:79 - Loading jar:file:/home/jenkins/.m2/repository/org/apache/ws/commons/axiom/axiom-dom/1.2.19/axiom-dom-1.2.19.jar!/META-INF/axiom.xml
15:51:17,606 DEBUG [main] ImplementationFactory:125 - Discovered implementations: [doom(metaFactory=org.apache.axiom.om.impl.dom.factory.OMDOMMetaFactory,features=[dom(priority=100)])]
15:51:17,608 DEBUG [main] ImplementationFactory:79 - Loading jar:file:/home/jenkins/.m2/repository/org/apache/ws/commons/axiom/axiom-impl/1.2.19/axiom-impl-1.2.19.jar!/META-INF/axiom.xml
15:51:17,610 DEBUG [main] ImplementationFactory:125 - Discovered implementations: [llom(metaFactory=org.apache.axiom.om.impl.llom.factory.OMLinkedListMetaFactory,features=[default(priority=100)])]
15:51:17,610 DEBUG [main] ImplementationFactory:79 - Loading jar:file:/home/jenkins/.m2/repository/org/apache/ws/commons/axiom/axiom-dom/1.2.19/axiom-dom-1.2.19.jar!/META-INF/axiom.xml
15:51:17,612 DEBUG [main] ImplementationFactory:125 - Discovered implementations: [doom(metaFactory=org.apache.axiom.om.impl.dom.factory.OMDOMMetaFactory,features=[dom(priority=100)])]
15:51:17,612 DEBUG [main] PriorityBasedOMMetaFactoryLocator:59 - Meta factories:
  default: org.apache.axiom.om.impl.llom.factory.OMLinkedListMetaFactory
  dom: org.apache.axiom.om.impl.dom.factory.OMDOMMetaFactory
15:51:17,622 DEBUG [main] AxisOperation:485 - Entry: AxisOperation::getInputAction
15:51:17,622 DEBUG [main] AxisOperation:506 - Exit: AxisOperation::getInputAction null
15:51:17,622 DEBUG [main] AxisOperation:467 - Entry: AxisOperation::setSoapAction, previous soapAction: null updated soapAction: urn:anonRobustOp
15:51:17,622 DEBUG [main] AxisOperation:471 - Exit: AxisOperation::setSoapAction
15:51:17,623 DEBUG [main] AxisService:872 - mapActionToOperation: Mapping Action to Operation: action: anonRobustOp; operation: org.apache.axis2.description.RobustOutOnlyAxisOperation@4dce274named: {http://ws.apache.org/namespaces/axis2}anonRobustOp
15:51:17,624 DEBUG [main] AxisService:878 - DEBUG_FRAME = org.apache.axis2.util.JavaUtils.callStackToString(JavaUtils.java:564)
	DEBUG_FRAME = org.apache.axis2.description.AxisService.mapActionToOperation(AxisService.java:878)
	DEBUG_FRAME = org.apache.axis2.description.AxisService.addOperation(AxisService.java:724)
	DEBUG_FRAME = org.apache.axis2.client.Stub.addAnonymousOperations(Stub.java:234)
	DEBUG_FRAME = net.ihe.gazelle.ws.client.GazelleTRMServiceStub.populateAxisService(GazelleTRMServiceStub.java:94)
	DEBUG_FRAME = net.ihe.gazelle.ws.client.GazelleTRMServiceStub.<init>(GazelleTRMServiceStub.java:40)
	DEBUG_FRAME = net.ihe.gazelle.ws.client.GazelleTRMServiceStub.<init>(GazelleTRMServiceStub.java:29)
	DEBUG_FRAME = net.ihe.gazelle.ws.client.GazelleTRMServiceStub.<init>(GazelleTRMServiceStub.java:75)
	DEBUG_FRAME = net.ihe.gazelle.ws.client.GazelleTRMServiceClient.<init>(GazelleTRMServiceClient.java:11)
	DEBUG_FRAME = net.ihe.gazelle.wstester.xdstools.ws.Xdstools.getNonce(Xdstools.java:61)
	DEBUG_FRAME = net.ihe.gazelle.wstester.xdstools.Ws.noNonceReturned(Ws.java:79)
	DEBUG_FRAME = sun.reflect.NativeMethodAccessorImpl.invoke0(Native Method)
	DEBUG_FRAME = sun.reflect.NativeMethodAccessorImpl.invoke(NativeMethodAccessorImpl.java:62)
	DEBUG_FRAME = sun.reflect.DelegatingMethodAccessorImpl.invoke(DelegatingMethodAccessorImpl.java:43)
	DEBUG_FRAME = java.lang.reflect.Method.invoke(Method.java:498)
	DEBUG_FRAME = org.junit.internal.runners.TestMethod.invoke(TestMethod.java:66)
	DEBUG_FRAME = org.powermock.modules.junit4.internal.impl.PowerMockJUnit44RunnerDelegateImpl$PowerMockJUnit44MethodRunner.runTestMethod(PowerMockJUnit44RunnerDelegateImpl.java:310)
	DEBUG_FRAME = org.junit.internal.runners.MethodRoadie$2.run(MethodRoadie.java:86)
	DEBUG_FRAME = org.junit.internal.runners.MethodRoadie.runBeforesThenTestThenAfters(MethodRoadie.java:94)
	DEBUG_FRAME = org.powermock.modules.junit4.internal.impl.PowerMockJUnit44RunnerDelegateImpl$PowerMockJUnit44MethodRunner.executeTest(PowerMockJUnit44RunnerDelegateImpl.java:294)
	DEBUG_FRAME = org.powermock.modules.junit4.internal.impl.PowerMockJUnit47RunnerDelegateImpl$PowerMockJUnit47MethodRunner.executeTestInSuper(PowerMockJUnit47RunnerDelegateImpl.java:127)
	DEBUG_FRAME = org.powermock.modules.junit4.internal.impl.PowerMockJUnit47RunnerDelegateImpl$PowerMockJUnit47MethodRunner.executeTest(PowerMockJUnit47RunnerDelegateImpl.java:82)
	DEBUG_FRAME = org.powermock.modules.junit4.internal.impl.PowerMockJUnit44RunnerDelegateImpl$PowerMockJUnit44MethodRunner.runBeforesThenTestThenAfters(PowerMockJUnit44RunnerDelegateImpl.java:282)
	DEBUG_FRAME = org.junit.internal.runners.MethodRoadie.runTest(MethodRoadie.java:84)
	DEBUG_FRAME = org.junit.internal.runners.MethodRoadie.run(MethodRoadie.java:49)
	DEBUG_FRAME = org.powermock.modules.junit4.internal.impl.PowerMockJUnit44RunnerDelegateImpl.invokeTestMethod(PowerMockJUnit44RunnerDelegateImpl.java:207)
	DEBUG_FRAME = org.powermock.modules.junit4.internal.impl.PowerMockJUnit44RunnerDelegateImpl.runMethods(PowerMockJUnit44RunnerDelegateImpl.java:146)
	DEBUG_FRAME = org.powermock.modules.junit4.internal.impl.PowerMockJUnit44RunnerDelegateImpl$1.run(PowerMockJUnit44RunnerDelegateImpl.java:120)
	DEBUG_FRAME = org.junit.internal.runners.ClassRoadie.runUnprotected(ClassRoadie.java:34)
	DEBUG_FRAME = org.junit.internal.runners.ClassRoadie.runProtected(ClassRoadie.java:44)
	DEBUG_FRAME = org.powermock.modules.junit4.internal.impl.PowerMockJUnit44RunnerDelegateImpl.run(PowerMockJUnit44RunnerDelegateImpl.java:118)
	DEBUG_FRAME = org.powermock.modules.junit4.common.internal.impl.JUnit4TestSuiteChunkerImpl.run(JUnit4TestSuiteChunkerImpl.java:101)
	DEBUG_FRAME = org.powermock.modules.junit4.common.internal.impl.AbstractCommonPowerMockRunner.run(AbstractCommonPowerMockRunner.java:53)
	DEBUG_FRAME = org.powermock.modules.junit4.PowerMockRunner.run(PowerMockRunner.java:53)
	DEBUG_FRAME = org.junit.runners.Suite.runChild(Suite.java:128)
	DEBUG_FRAME = org.junit.runners.Suite.runChild(Suite.java:24)
	DEBUG_FRAME = org.junit.runners.ParentRunner$3.run(ParentRunner.java:193)
	DEBUG_FRAME = org.junit.runners.ParentRunner$1.schedule(ParentRunner.java:52)
	DEBUG_FRAME = org.junit.runners.ParentRunner.runChildren(ParentRunner.java:191)
	DEBUG_FRAME = org.junit.runners.ParentRunner.access$000(ParentRunner.java:42)
	DEBUG_FRAME = org.junit.runners.ParentRunner$2.evaluate(ParentRunner.java:184)
	DEBUG_FRAME = org.junit.runners.ParentRunner.run(ParentRunner.java:236)
	DEBUG_FRAME = org.junit.runners.Suite.runChild(Suite.java:128)
	DEBUG_FRAME = org.junit.runners.Suite.runChild(Suite.java:24)
	DEBUG_FRAME = org.junit.runners.ParentRunner$3.run(ParentRunner.java:193)
	DEBUG_FRAME = org.junit.runners.ParentRunner$1.schedule(ParentRunner.java:52)
	DEBUG_FRAME = org.junit.runners.ParentRunner.runChildren(ParentRunner.java:191)
	DEBUG_FRAME = org.junit.runners.ParentRunner.access$000(ParentRunner.java:42)
	DEBUG_FRAME = org.junit.runners.ParentRunner$2.evaluate(ParentRunner.java:184)
	DEBUG_FRAME = org.junit.runners.ParentRunner.run(ParentRunner.java:236)
	DEBUG_FRAME = org.apache.maven.surefire.junitcore.JUnitCore.run(JUnitCore.java:55)
	DEBUG_FRAME = org.apache.maven.surefire.junitcore.JUnitCoreWrapper.createRequestAndRun(JUnitCoreWrapper.java:137)
	DEBUG_FRAME = org.apache.maven.surefire.junitcore.JUnitCoreWrapper.executeEager(JUnitCoreWrapper.java:107)
	DEBUG_FRAME = org.apache.maven.surefire.junitcore.JUnitCoreWrapper.execute(JUnitCoreWrapper.java:83)
	DEBUG_FRAME = org.apache.maven.surefire.junitcore.JUnitCoreWrapper.execute(JUnitCoreWrapper.java:75)
	DEBUG_FRAME = org.apache.maven.surefire.junitcore.JUnitCoreProvider.invoke(JUnitCoreProvider.java:157)
	DEBUG_FRAME = org.apache.maven.surefire.booter.ForkedBooter.invokeProviderInSameClassLoader(ForkedBooter.java:386)
	DEBUG_FRAME = org.apache.maven.surefire.booter.ForkedBooter.runSuitesInProcess(ForkedBooter.java:323)
	DEBUG_FRAME = org.apache.maven.surefire.booter.ForkedBooter.main(ForkedBooter.java:143)

15:51:17,624 DEBUG [main] AxisOperation:485 - Entry: AxisOperation::getInputAction
15:51:17,624 DEBUG [main] AxisOperation:490 - Debug: AxisOperation::getInputAction - using soapAction
15:51:17,624 DEBUG [main] AxisOperation:506 - Exit: AxisOperation::getInputAction urn:anonRobustOp
15:51:17,624 DEBUG [main] AxisService:872 - mapActionToOperation: Mapping Action to Operation: action: urn:anonRobustOp; operation: org.apache.axis2.description.RobustOutOnlyAxisOperation@4dce274named: {http://ws.apache.org/namespaces/axis2}anonRobustOp
15:51:17,624 DEBUG [main] AxisService:878 - DEBUG_FRAME = org.apache.axis2.util.JavaUtils.callStackToString(JavaUtils.java:564)
	DEBUG_FRAME = org.apache.axis2.description.AxisService.mapActionToOperation(AxisService.java:878)
	DEBUG_FRAME = org.apache.axis2.description.AxisService.addOperation(AxisService.java:728)
	DEBUG_FRAME = org.apache.axis2.client.Stub.addAnonymousOperations(Stub.java:234)
	DEBUG_FRAME = net.ihe.gazelle.ws.client.GazelleTRMServiceStub.populateAxisService(GazelleTRMServiceStub.java:94)
	DEBUG_FRAME = net.ihe.gazelle.ws.client.GazelleTRMServiceStub.<init>(GazelleTRMServiceStub.java:40)
	DEBUG_FRAME = net.ihe.gazelle.ws.client.GazelleTRMServiceStub.<init>(GazelleTRMServiceStub.java:29)
	DEBUG_FRAME = net.ihe.gazelle.ws.client.GazelleTRMServiceStub.<init>(GazelleTRMServiceStub.java:75)
	DEBUG_FRAME = net.ihe.gazelle.ws.client.GazelleTRMServiceClient.<init>(GazelleTRMServiceClient.java:11)
	DEBUG_FRAME = net.ihe.gazelle.wstester.xdstools.ws.Xdstools.getNonce(Xdstools.java:61)
	DEBUG_FRAME = net.ihe.gazelle.wstester.xdstools.Ws.noNonceReturned(Ws.java:79)
	DEBUG_FRAME = sun.reflect.NativeMethodAccessorImpl.invoke0(Native Method)
	DEBUG_FRAME = sun.reflect.NativeMethodAccessorImpl.invoke(NativeMethodAccessorImpl.java:62)
	DEBUG_FRAME = sun.reflect.DelegatingMethodAccessorImpl.invoke(DelegatingMethodAccessorImpl.java:43)
	DEBUG_FRAME = java.lang.reflect.Method.invoke(Method.java:498)
	DEBUG_FRAME = org.junit.internal.runners.TestMethod.invoke(TestMethod.java:66)
	DEBUG_FRAME = org.powermock.modules.junit4.internal.impl.PowerMockJUnit44RunnerDelegateImpl$PowerMockJUnit44MethodRunner.runTestMethod(PowerMockJUnit44RunnerDelegateImpl.java:310)
	DEBUG_FRAME = org.junit.internal.runners.MethodRoadie$2.run(MethodRoadie.java:86)
	DEBUG_FRAME = org.junit.internal.runners.MethodRoadie.runBeforesThenTestThenAfters(MethodRoadie.java:94)
	DEBUG_FRAME = org.powermock.modules.junit4.internal.impl.PowerMockJUnit44RunnerDelegateImpl$PowerMockJUnit44MethodRunner.executeTest(PowerMockJUnit44RunnerDelegateImpl.java:294)
	DEBUG_FRAME = org.powermock.modules.junit4.internal.impl.PowerMockJUnit47RunnerDelegateImpl$PowerMockJUnit47MethodRunner.executeTestInSuper(PowerMockJUnit47RunnerDelegateImpl.java:127)
	DEBUG_FRAME = org.powermock.modules.junit4.internal.impl.PowerMockJUnit47RunnerDelegateImpl$PowerMockJUnit47MethodRunner.executeTest(PowerMockJUnit47RunnerDelegateImpl.java:82)
	DEBUG_FRAME = org.powermock.modules.junit4.internal.impl.PowerMockJUnit44RunnerDelegateImpl$PowerMockJUnit44MethodRunner.runBeforesThenTestThenAfters(PowerMockJUnit44RunnerDelegateImpl.java:282)
	DEBUG_FRAME = org.junit.internal.runners.MethodRoadie.runTest(MethodRoadie.java:84)
	DEBUG_FRAME = org.junit.internal.runners.MethodRoadie.run(MethodRoadie.java:49)
	DEBUG_FRAME = org.powermock.modules.junit4.internal.impl.PowerMockJUnit44RunnerDelegateImpl.invokeTestMethod(PowerMockJUnit44RunnerDelegateImpl.java:207)
	DEBUG_FRAME = org.powermock.modules.junit4.internal.impl.PowerMockJUnit44RunnerDelegateImpl.runMethods(PowerMockJUnit44RunnerDelegateImpl.java:146)
	DEBUG_FRAME = org.powermock.modules.junit4.internal.impl.PowerMockJUnit44RunnerDelegateImpl$1.run(PowerMockJUnit44RunnerDelegateImpl.java:120)
	DEBUG_FRAME = org.junit.internal.runners.ClassRoadie.runUnprotected(ClassRoadie.java:34)
	DEBUG_FRAME = org.junit.internal.runners.ClassRoadie.runProtected(ClassRoadie.java:44)
	DEBUG_FRAME = org.powermock.modules.junit4.internal.impl.PowerMockJUnit44RunnerDelegateImpl.run(PowerMockJUnit44RunnerDelegateImpl.java:118)
	DEBUG_FRAME = org.powermock.modules.junit4.common.internal.impl.JUnit4TestSuiteChunkerImpl.run(JUnit4TestSuiteChunkerImpl.java:101)
	DEBUG_FRAME = org.powermock.modules.junit4.common.internal.impl.AbstractCommonPowerMockRunner.run(AbstractCommonPowerMockRunner.java:53)
	DEBUG_FRAME = org.powermock.modules.junit4.PowerMockRunner.run(PowerMockRunner.java:53)
	DEBUG_FRAME = org.junit.runners.Suite.runChild(Suite.java:128)
	DEBUG_FRAME = org.junit.runners.Suite.runChild(Suite.java:24)
	DEBUG_FRAME = org.junit.runners.ParentRunner$3.run(ParentRunner.java:193)
	DEBUG_FRAME = org.junit.runners.ParentRunner$1.schedule(ParentRunner.java:52)
	DEBUG_FRAME = org.junit.runners.ParentRunner.runChildren(ParentRunner.java:191)
	DEBUG_FRAME = org.junit.runners.ParentRunner.access$000(ParentRunner.java:42)
	DEBUG_FRAME = org.junit.runners.ParentRunner$2.evaluate(ParentRunner.java:184)
	DEBUG_FRAME = org.junit.runners.ParentRunner.run(ParentRunner.java:236)
	DEBUG_FRAME = org.junit.runners.Suite.runChild(Suite.java:128)
	DEBUG_FRAME = org.junit.runners.Suite.runChild(Suite.java:24)
	DEBUG_FRAME = org.junit.runners.ParentRunner$3.run(ParentRunner.java:193)
	DEBUG_FRAME = org.junit.runners.ParentRunner$1.schedule(ParentRunner.java:52)
	DEBUG_FRAME = org.junit.runners.ParentRunner.runChildren(ParentRunner.java:191)
	DEBUG_FRAME = org.junit.runners.ParentRunner.access$000(ParentRunner.java:42)
	DEBUG_FRAME = org.junit.runners.ParentRunner$2.evaluate(ParentRunner.java:184)
	DEBUG_FRAME = org.junit.runners.ParentRunner.run(ParentRunner.java:236)
	DEBUG_FRAME = org.apache.maven.surefire.junitcore.JUnitCore.run(JUnitCore.java:55)
	DEBUG_FRAME = org.apache.maven.surefire.junitcore.JUnitCoreWrapper.createRequestAndRun(JUnitCoreWrapper.java:137)
	DEBUG_FRAME = org.apache.maven.surefire.junitcore.JUnitCoreWrapper.executeEager(JUnitCoreWrapper.java:107)
	DEBUG_FRAME = org.apache.maven.surefire.junitcore.JUnitCoreWrapper.execute(JUnitCoreWrapper.java:83)
	DEBUG_FRAME = org.apache.maven.surefire.junitcore.JUnitCoreWrapper.execute(JUnitCoreWrapper.java:75)
	DEBUG_FRAME = org.apache.maven.surefire.junitcore.JUnitCoreProvider.invoke(JUnitCoreProvider.java:157)
	DEBUG_FRAME = org.apache.maven.surefire.booter.ForkedBooter.invokeProviderInSameClassLoader(ForkedBooter.java:386)
	DEBUG_FRAME = org.apache.maven.surefire.booter.ForkedBooter.runSuitesInProcess(ForkedBooter.java:323)
	DEBUG_FRAME = org.apache.maven.surefire.booter.ForkedBooter.main(ForkedBooter.java:143)

15:51:17,625 DEBUG [main] AxisService:673 - Client-defined operation name matches default operation name. this may cause interoperability issues.  Name is: {http://ws.apache.org/namespaces/axis2}anonOutonlyOp
15:51:17,625 DEBUG [main] AxisOperation:485 - Entry: AxisOperation::getInputAction
15:51:17,626 DEBUG [main] AxisOperation:506 - Exit: AxisOperation::getInputAction null
15:51:17,626 DEBUG [main] AxisOperation:467 - Entry: AxisOperation::setSoapAction, previous soapAction: null updated soapAction: urn:anonOutonlyOp
15:51:17,626 DEBUG [main] AxisOperation:471 - Exit: AxisOperation::setSoapAction
15:51:17,626 DEBUG [main] AxisService:872 - mapActionToOperation: Mapping Action to Operation: action: anonOutonlyOp; operation: org.apache.axis2.description.OutOnlyAxisOperation@600d0771named: {http://ws.apache.org/namespaces/axis2}anonOutonlyOp
15:51:17,626 DEBUG [main] AxisService:878 - DEBUG_FRAME = org.apache.axis2.util.JavaUtils.callStackToString(JavaUtils.java:564)
	DEBUG_FRAME = org.apache.axis2.description.AxisService.mapActionToOperation(AxisService.java:878)
	DEBUG_FRAME = org.apache.axis2.description.AxisService.addOperation(AxisService.java:724)
	DEBUG_FRAME = org.apache.axis2.client.Stub.addAnonymousOperations(Stub.java:237)
	DEBUG_FRAME = net.ihe.gazelle.ws.client.GazelleTRMServiceStub.populateAxisService(GazelleTRMServiceStub.java:94)
	DEBUG_FRAME = net.ihe.gazelle.ws.client.GazelleTRMServiceStub.<init>(GazelleTRMServiceStub.java:40)
	DEBUG_FRAME = net.ihe.gazelle.ws.client.GazelleTRMServiceStub.<init>(GazelleTRMServiceStub.java:29)
	DEBUG_FRAME = net.ihe.gazelle.ws.client.GazelleTRMServiceStub.<init>(GazelleTRMServiceStub.java:75)
	DEBUG_FRAME = net.ihe.gazelle.ws.client.GazelleTRMServiceClient.<init>(GazelleTRMServiceClient.java:11)
	DEBUG_FRAME = net.ihe.gazelle.wstester.xdstools.ws.Xdstools.getNonce(Xdstools.java:61)
	DEBUG_FRAME = net.ihe.gazelle.wstester.xdstools.Ws.noNonceReturned(Ws.java:79)
	DEBUG_FRAME = sun.reflect.NativeMethodAccessorImpl.invoke0(Native Method)
	DEBUG_FRAME = sun.reflect.NativeMethodAccessorImpl.invoke(NativeMethodAccessorImpl.java:62)
	DEBUG_FRAME = sun.reflect.DelegatingMethodAccessorImpl.invoke(DelegatingMethodAccessorImpl.java:43)
	DEBUG_FRAME = java.lang.reflect.Method.invoke(Method.java:498)
	DEBUG_FRAME = org.junit.internal.runners.TestMethod.invoke(TestMethod.java:66)
	DEBUG_FRAME = org.powermock.modules.junit4.internal.impl.PowerMockJUnit44RunnerDelegateImpl$PowerMockJUnit44MethodRunner.runTestMethod(PowerMockJUnit44RunnerDelegateImpl.java:310)
	DEBUG_FRAME = org.junit.internal.runners.MethodRoadie$2.run(MethodRoadie.java:86)
	DEBUG_FRAME = org.junit.internal.runners.MethodRoadie.runBeforesThenTestThenAfters(MethodRoadie.java:94)
	DEBUG_FRAME = org.powermock.modules.junit4.internal.impl.PowerMockJUnit44RunnerDelegateImpl$PowerMockJUnit44MethodRunner.executeTest(PowerMockJUnit44RunnerDelegateImpl.java:294)
	DEBUG_FRAME = org.powermock.modules.junit4.internal.impl.PowerMockJUnit47RunnerDelegateImpl$PowerMockJUnit47MethodRunner.executeTestInSuper(PowerMockJUnit47RunnerDelegateImpl.java:127)
	DEBUG_FRAME = org.powermock.modules.junit4.internal.impl.PowerMockJUnit47RunnerDelegateImpl$PowerMockJUnit47MethodRunner.executeTest(PowerMockJUnit47RunnerDelegateImpl.java:82)
	DEBUG_FRAME = org.powermock.modules.junit4.internal.impl.PowerMockJUnit44RunnerDelegateImpl$PowerMockJUnit44MethodRunner.runBeforesThenTestThenAfters(PowerMockJUnit44RunnerDelegateImpl.java:282)
	DEBUG_FRAME = org.junit.internal.runners.MethodRoadie.runTest(MethodRoadie.java:84)
	DEBUG_FRAME = org.junit.internal.runners.MethodRoadie.run(MethodRoadie.java:49)
	DEBUG_FRAME = org.powermock.modules.junit4.internal.impl.PowerMockJUnit44RunnerDelegateImpl.invokeTestMethod(PowerMockJUnit44RunnerDelegateImpl.java:207)
	DEBUG_FRAME = org.powermock.modules.junit4.internal.impl.PowerMockJUnit44RunnerDelegateImpl.runMethods(PowerMockJUnit44RunnerDelegateImpl.java:146)
	DEBUG_FRAME = org.powermock.modules.junit4.internal.impl.PowerMockJUnit44RunnerDelegateImpl$1.run(PowerMockJUnit44RunnerDelegateImpl.java:120)
	DEBUG_FRAME = org.junit.internal.runners.ClassRoadie.runUnprotected(ClassRoadie.java:34)
	DEBUG_FRAME = org.junit.internal.runners.ClassRoadie.runProtected(ClassRoadie.java:44)
	DEBUG_FRAME = org.powermock.modules.junit4.internal.impl.PowerMockJUnit44RunnerDelegateImpl.run(PowerMockJUnit44RunnerDelegateImpl.java:118)
	DEBUG_FRAME = org.powermock.modules.junit4.common.internal.impl.JUnit4TestSuiteChunkerImpl.run(JUnit4TestSuiteChunkerImpl.java:101)
	DEBUG_FRAME = org.powermock.modules.junit4.common.internal.impl.AbstractCommonPowerMockRunner.run(AbstractCommonPowerMockRunner.java:53)
	DEBUG_FRAME = org.powermock.modules.junit4.PowerMockRunner.run(PowerMockRunner.java:53)
	DEBUG_FRAME = org.junit.runners.Suite.runChild(Suite.java:128)
	DEBUG_FRAME = org.junit.runners.Suite.runChild(Suite.java:24)
	DEBUG_FRAME = org.junit.runners.ParentRunner$3.run(ParentRunner.java:193)
	DEBUG_FRAME = org.junit.runners.ParentRunner$1.schedule(ParentRunner.java:52)
	DEBUG_FRAME = org.junit.runners.ParentRunner.runChildren(ParentRunner.java:191)
	DEBUG_FRAME = org.junit.runners.ParentRunner.access$000(ParentRunner.java:42)
	DEBUG_FRAME = org.junit.runners.ParentRunner$2.evaluate(ParentRunner.java:184)
	DEBUG_FRAME = org.junit.runners.ParentRunner.run(ParentRunner.java:236)
	DEBUG_FRAME = org.junit.runners.Suite.runChild(Suite.java:128)
	DEBUG_FRAME = org.junit.runners.Suite.runChild(Suite.java:24)
	DEBUG_FRAME = org.junit.runners.ParentRunner$3.run(ParentRunner.java:193)
	DEBUG_FRAME = org.junit.runners.ParentRunner$1.schedule(ParentRunner.java:52)
	DEBUG_FRAME = org.junit.runners.ParentRunner.runChildren(ParentRunner.java:191)
	DEBUG_FRAME = org.junit.runners.ParentRunner.access$000(ParentRunner.java:42)
	DEBUG_FRAME = org.junit.runners.ParentRunner$2.evaluate(ParentRunner.java:184)
	DEBUG_FRAME = org.junit.runners.ParentRunner.run(ParentRunner.java:236)
	DEBUG_FRAME = org.apache.maven.surefire.junitcore.JUnitCore.run(JUnitCore.java:55)
	DEBUG_FRAME = org.apache.maven.surefire.junitcore.JUnitCoreWrapper.createRequestAndRun(JUnitCoreWrapper.java:137)
	DEBUG_FRAME = org.apache.maven.surefire.junitcore.JUnitCoreWrapper.executeEager(JUnitCoreWrapper.java:107)
	DEBUG_FRAME = org.apache.maven.surefire.junitcore.JUnitCoreWrapper.execute(JUnitCoreWrapper.java:83)
	DEBUG_FRAME = org.apache.maven.surefire.junitcore.JUnitCoreWrapper.execute(JUnitCoreWrapper.java:75)
	DEBUG_FRAME = org.apache.maven.surefire.junitcore.JUnitCoreProvider.invoke(JUnitCoreProvider.java:157)
	DEBUG_FRAME = org.apache.maven.surefire.booter.ForkedBooter.invokeProviderInSameClassLoader(ForkedBooter.java:386)
	DEBUG_FRAME = org.apache.maven.surefire.booter.ForkedBooter.runSuitesInProcess(ForkedBooter.java:323)
	DEBUG_FRAME = org.apache.maven.surefire.booter.ForkedBooter.main(ForkedBooter.java:143)

15:51:17,626 DEBUG [main] AxisOperation:485 - Entry: AxisOperation::getInputAction
15:51:17,626 DEBUG [main] AxisOperation:490 - Debug: AxisOperation::getInputAction - using soapAction
15:51:17,626 DEBUG [main] AxisOperation:506 - Exit: AxisOperation::getInputAction urn:anonOutonlyOp
15:51:17,626 DEBUG [main] AxisService:872 - mapActionToOperation: Mapping Action to Operation: action: urn:anonOutonlyOp; operation: org.apache.axis2.description.OutOnlyAxisOperation@600d0771named: {http://ws.apache.org/namespaces/axis2}anonOutonlyOp
15:51:17,627 DEBUG [main] AxisService:878 - DEBUG_FRAME = org.apache.axis2.util.JavaUtils.callStackToString(JavaUtils.java:564)
	DEBUG_FRAME = org.apache.axis2.description.AxisService.mapActionToOperation(AxisService.java:878)
	DEBUG_FRAME = org.apache.axis2.description.AxisService.addOperation(AxisService.java:728)
	DEBUG_FRAME = org.apache.axis2.client.Stub.addAnonymousOperations(Stub.java:237)
	DEBUG_FRAME = net.ihe.gazelle.ws.client.GazelleTRMServiceStub.populateAxisService(GazelleTRMServiceStub.java:94)
	DEBUG_FRAME = net.ihe.gazelle.ws.client.GazelleTRMServiceStub.<init>(GazelleTRMServiceStub.java:40)
	DEBUG_FRAME = net.ihe.gazelle.ws.client.GazelleTRMServiceStub.<init>(GazelleTRMServiceStub.java:29)
	DEBUG_FRAME = net.ihe.gazelle.ws.client.GazelleTRMServiceStub.<init>(GazelleTRMServiceStub.java:75)
	DEBUG_FRAME = net.ihe.gazelle.ws.client.GazelleTRMServiceClient.<init>(GazelleTRMServiceClient.java:11)
	DEBUG_FRAME = net.ihe.gazelle.wstester.xdstools.ws.Xdstools.getNonce(Xdstools.java:61)
	DEBUG_FRAME = net.ihe.gazelle.wstester.xdstools.Ws.noNonceReturned(Ws.java:79)
	DEBUG_FRAME = sun.reflect.NativeMethodAccessorImpl.invoke0(Native Method)
	DEBUG_FRAME = sun.reflect.NativeMethodAccessorImpl.invoke(NativeMethodAccessorImpl.java:62)
	DEBUG_FRAME = sun.reflect.DelegatingMethodAccessorImpl.invoke(DelegatingMethodAccessorImpl.java:43)
	DEBUG_FRAME = java.lang.reflect.Method.invoke(Method.java:498)
	DEBUG_FRAME = org.junit.internal.runners.TestMethod.invoke(TestMethod.java:66)
	DEBUG_FRAME = org.powermock.modules.junit4.internal.impl.PowerMockJUnit44RunnerDelegateImpl$PowerMockJUnit44MethodRunner.runTestMethod(PowerMockJUnit44RunnerDelegateImpl.java:310)
	DEBUG_FRAME = org.junit.internal.runners.MethodRoadie$2.run(MethodRoadie.java:86)
	DEBUG_FRAME = org.junit.internal.runners.MethodRoadie.runBeforesThenTestThenAfters(MethodRoadie.java:94)
	DEBUG_FRAME = org.powermock.modules.junit4.internal.impl.PowerMockJUnit44RunnerDelegateImpl$PowerMockJUnit44MethodRunner.executeTest(PowerMockJUnit44RunnerDelegateImpl.java:294)
	DEBUG_FRAME = org.powermock.modules.junit4.internal.impl.PowerMockJUnit47RunnerDelegateImpl$PowerMockJUnit47MethodRunner.executeTestInSuper(PowerMockJUnit47RunnerDelegateImpl.java:127)
	DEBUG_FRAME = org.powermock.modules.junit4.internal.impl.PowerMockJUnit47RunnerDelegateImpl$PowerMockJUnit47MethodRunner.executeTest(PowerMockJUnit47RunnerDelegateImpl.java:82)
	DEBUG_FRAME = org.powermock.modules.junit4.internal.impl.PowerMockJUnit44RunnerDelegateImpl$PowerMockJUnit44MethodRunner.runBeforesThenTestThenAfters(PowerMockJUnit44RunnerDelegateImpl.java:282)
	DEBUG_FRAME = org.junit.internal.runners.MethodRoadie.runTest(MethodRoadie.java:84)
	DEBUG_FRAME = org.junit.internal.runners.MethodRoadie.run(MethodRoadie.java:49)
	DEBUG_FRAME = org.powermock.modules.junit4.internal.impl.PowerMockJUnit44RunnerDelegateImpl.invokeTestMethod(PowerMockJUnit44RunnerDelegateImpl.java:207)
	DEBUG_FRAME = org.powermock.modules.junit4.internal.impl.PowerMockJUnit44RunnerDelegateImpl.runMethods(PowerMockJUnit44RunnerDelegateImpl.java:146)
	DEBUG_FRAME = org.powermock.modules.junit4.internal.impl.PowerMockJUnit44RunnerDelegateImpl$1.run(PowerMockJUnit44RunnerDelegateImpl.java:120)
	DEBUG_FRAME = org.junit.internal.runners.ClassRoadie.runUnprotected(ClassRoadie.java:34)
	DEBUG_FRAME = org.junit.internal.runners.ClassRoadie.runProtected(ClassRoadie.java:44)
	DEBUG_FRAME = org.powermock.modules.junit4.internal.impl.PowerMockJUnit44RunnerDelegateImpl.run(PowerMockJUnit44RunnerDelegateImpl.java:118)
	DEBUG_FRAME = org.powermock.modules.junit4.common.internal.impl.JUnit4TestSuiteChunkerImpl.run(JUnit4TestSuiteChunkerImpl.java:101)
	DEBUG_FRAME = org.powermock.modules.junit4.common.internal.impl.AbstractCommonPowerMockRunner.run(AbstractCommonPowerMockRunner.java:53)
	DEBUG_FRAME = org.powermock.modules.junit4.PowerMockRunner.run(PowerMockRunner.java:53)
	DEBUG_FRAME = org.junit.runners.Suite.runChild(Suite.java:128)
	DEBUG_FRAME = org.junit.runners.Suite.runChild(Suite.java:24)
	DEBUG_FRAME = org.junit.runners.ParentRunner$3.run(ParentRunner.java:193)
	DEBUG_FRAME = org.junit.runners.ParentRunner$1.schedule(ParentRunner.java:52)
	DEBUG_FRAME = org.junit.runners.ParentRunner.runChildren(ParentRunner.java:191)
	DEBUG_FRAME = org.junit.runners.ParentRunner.access$000(ParentRunner.java:42)
	DEBUG_FRAME = org.junit.runners.ParentRunner$2.evaluate(ParentRunner.java:184)
	DEBUG_FRAME = org.junit.runners.ParentRunner.run(ParentRunner.java:236)
	DEBUG_FRAME = org.junit.runners.Suite.runChild(Suite.java:128)
	DEBUG_FRAME = org.junit.runners.Suite.runChild(Suite.java:24)
	DEBUG_FRAME = org.junit.runners.ParentRunner$3.run(ParentRunner.java:193)
	DEBUG_FRAME = org.junit.runners.ParentRunner$1.schedule(ParentRunner.java:52)
	DEBUG_FRAME = org.junit.runners.ParentRunner.runChildren(ParentRunner.java:191)
	DEBUG_FRAME = org.junit.runners.ParentRunner.access$000(ParentRunner.java:42)
	DEBUG_FRAME = org.junit.runners.ParentRunner$2.evaluate(ParentRunner.java:184)
	DEBUG_FRAME = org.junit.runners.ParentRunner.run(ParentRunner.java:236)
	DEBUG_FRAME = org.apache.maven.surefire.junitcore.JUnitCore.run(JUnitCore.java:55)
	DEBUG_FRAME = org.apache.maven.surefire.junitcore.JUnitCoreWrapper.createRequestAndRun(JUnitCoreWrapper.java:137)
	DEBUG_FRAME = org.apache.maven.surefire.junitcore.JUnitCoreWrapper.executeEager(JUnitCoreWrapper.java:107)
	DEBUG_FRAME = org.apache.maven.surefire.junitcore.JUnitCoreWrapper.execute(JUnitCoreWrapper.java:83)
	DEBUG_FRAME = org.apache.maven.surefire.junitcore.JUnitCoreWrapper.execute(JUnitCoreWrapper.java:75)
	DEBUG_FRAME = org.apache.maven.surefire.junitcore.JUnitCoreProvider.invoke(JUnitCoreProvider.java:157)
	DEBUG_FRAME = org.apache.maven.surefire.booter.ForkedBooter.invokeProviderInSameClassLoader(ForkedBooter.java:386)
	DEBUG_FRAME = org.apache.maven.surefire.booter.ForkedBooter.runSuitesInProcess(ForkedBooter.java:323)
	DEBUG_FRAME = org.apache.maven.surefire.booter.ForkedBooter.main(ForkedBooter.java:143)

15:51:17,627 DEBUG [main] AxisOperation:485 - Entry: AxisOperation::getInputAction
15:51:17,627 DEBUG [main] AxisOperation:506 - Exit: AxisOperation::getInputAction null
15:51:17,627 DEBUG [main] AxisOperation:467 - Entry: AxisOperation::setSoapAction, previous soapAction: null updated soapAction: urn:anonOutInOp
15:51:17,627 DEBUG [main] AxisOperation:471 - Exit: AxisOperation::setSoapAction
15:51:17,627 DEBUG [main] AxisService:872 - mapActionToOperation: Mapping Action to Operation: action: anonOutInOp; operation: org.apache.axis2.description.OutInAxisOperation@6d8ee197named: {http://ws.apache.org/namespaces/axis2}anonOutInOp
15:51:17,627 DEBUG [main] AxisService:878 - DEBUG_FRAME = org.apache.axis2.util.JavaUtils.callStackToString(JavaUtils.java:564)
	DEBUG_FRAME = org.apache.axis2.description.AxisService.mapActionToOperation(AxisService.java:878)
	DEBUG_FRAME = org.apache.axis2.description.AxisService.addOperation(AxisService.java:724)
	DEBUG_FRAME = org.apache.axis2.client.Stub.addAnonymousOperations(Stub.java:240)
	DEBUG_FRAME = net.ihe.gazelle.ws.client.GazelleTRMServiceStub.populateAxisService(GazelleTRMServiceStub.java:94)
	DEBUG_FRAME = net.ihe.gazelle.ws.client.GazelleTRMServiceStub.<init>(GazelleTRMServiceStub.java:40)
	DEBUG_FRAME = net.ihe.gazelle.ws.client.GazelleTRMServiceStub.<init>(GazelleTRMServiceStub.java:29)
	DEBUG_FRAME = net.ihe.gazelle.ws.client.GazelleTRMServiceStub.<init>(GazelleTRMServiceStub.java:75)
	DEBUG_FRAME = net.ihe.gazelle.ws.client.GazelleTRMServiceClient.<init>(GazelleTRMServiceClient.java:11)
	DEBUG_FRAME = net.ihe.gazelle.wstester.xdstools.ws.Xdstools.getNonce(Xdstools.java:61)
	DEBUG_FRAME = net.ihe.gazelle.wstester.xdstools.Ws.noNonceReturned(Ws.java:79)
	DEBUG_FRAME = sun.reflect.NativeMethodAccessorImpl.invoke0(Native Method)
	DEBUG_FRAME = sun.reflect.NativeMethodAccessorImpl.invoke(NativeMethodAccessorImpl.java:62)
	DEBUG_FRAME = sun.reflect.DelegatingMethodAccessorImpl.invoke(DelegatingMethodAccessorImpl.java:43)
	DEBUG_FRAME = java.lang.reflect.Method.invoke(Method.java:498)
	DEBUG_FRAME = org.junit.internal.runners.TestMethod.invoke(TestMethod.java:66)
	DEBUG_FRAME = org.powermock.modules.junit4.internal.impl.PowerMockJUnit44RunnerDelegateImpl$PowerMockJUnit44MethodRunner.runTestMethod(PowerMockJUnit44RunnerDelegateImpl.java:310)
	DEBUG_FRAME = org.junit.internal.runners.MethodRoadie$2.run(MethodRoadie.java:86)
	DEBUG_FRAME = org.junit.internal.runners.MethodRoadie.runBeforesThenTestThenAfters(MethodRoadie.java:94)
	DEBUG_FRAME = org.powermock.modules.junit4.internal.impl.PowerMockJUnit44RunnerDelegateImpl$PowerMockJUnit44MethodRunner.executeTest(PowerMockJUnit44RunnerDelegateImpl.java:294)
	DEBUG_FRAME = org.powermock.modules.junit4.internal.impl.PowerMockJUnit47RunnerDelegateImpl$PowerMockJUnit47MethodRunner.executeTestInSuper(PowerMockJUnit47RunnerDelegateImpl.java:127)
	DEBUG_FRAME = org.powermock.modules.junit4.internal.impl.PowerMockJUnit47RunnerDelegateImpl$PowerMockJUnit47MethodRunner.executeTest(PowerMockJUnit47RunnerDelegateImpl.java:82)
	DEBUG_FRAME = org.powermock.modules.junit4.internal.impl.PowerMockJUnit44RunnerDelegateImpl$PowerMockJUnit44MethodRunner.runBeforesThenTestThenAfters(PowerMockJUnit44RunnerDelegateImpl.java:282)
	DEBUG_FRAME = org.junit.internal.runners.MethodRoadie.runTest(MethodRoadie.java:84)
	DEBUG_FRAME = org.junit.internal.runners.MethodRoadie.run(MethodRoadie.java:49)
	DEBUG_FRAME = org.powermock.modules.junit4.internal.impl.PowerMockJUnit44RunnerDelegateImpl.invokeTestMethod(PowerMockJUnit44RunnerDelegateImpl.java:207)
	DEBUG_FRAME = org.powermock.modules.junit4.internal.impl.PowerMockJUnit44RunnerDelegateImpl.runMethods(PowerMockJUnit44RunnerDelegateImpl.java:146)
	DEBUG_FRAME = org.powermock.modules.junit4.internal.impl.PowerMockJUnit44RunnerDelegateImpl$1.run(PowerMockJUnit44RunnerDelegateImpl.java:120)
	DEBUG_FRAME = org.junit.internal.runners.ClassRoadie.runUnprotected(ClassRoadie.java:34)
	DEBUG_FRAME = org.junit.internal.runners.ClassRoadie.runProtected(ClassRoadie.java:44)
	DEBUG_FRAME = org.powermock.modules.junit4.internal.impl.PowerMockJUnit44RunnerDelegateImpl.run(PowerMockJUnit44RunnerDelegateImpl.java:118)
	DEBUG_FRAME = org.powermock.modules.junit4.common.internal.impl.JUnit4TestSuiteChunkerImpl.run(JUnit4TestSuiteChunkerImpl.java:101)
	DEBUG_FRAME = org.powermock.modules.junit4.common.internal.impl.AbstractCommonPowerMockRunner.run(AbstractCommonPowerMockRunner.java:53)
	DEBUG_FRAME = org.powermock.modules.junit4.PowerMockRunner.run(PowerMockRunner.java:53)
	DEBUG_FRAME = org.junit.runners.Suite.runChild(Suite.java:128)
	DEBUG_FRAME = org.junit.runners.Suite.runChild(Suite.java:24)
	DEBUG_FRAME = org.junit.runners.ParentRunner$3.run(ParentRunner.java:193)
	DEBUG_FRAME = org.junit.runners.ParentRunner$1.schedule(ParentRunner.java:52)
	DEBUG_FRAME = org.junit.runners.ParentRunner.runChildren(ParentRunner.java:191)
	DEBUG_FRAME = org.junit.runners.ParentRunner.access$000(ParentRunner.java:42)
	DEBUG_FRAME = org.junit.runners.ParentRunner$2.evaluate(ParentRunner.java:184)
	DEBUG_FRAME = org.junit.runners.ParentRunner.run(ParentRunner.java:236)
	DEBUG_FRAME = org.junit.runners.Suite.runChild(Suite.java:128)
	DEBUG_FRAME = org.junit.runners.Suite.runChild(Suite.java:24)
	DEBUG_FRAME = org.junit.runners.ParentRunner$3.run(ParentRunner.java:193)
	DEBUG_FRAME = org.junit.runners.ParentRunner$1.schedule(ParentRunner.java:52)
	DEBUG_FRAME = org.junit.runners.ParentRunner.runChildren(ParentRunner.java:191)
	DEBUG_FRAME = org.junit.runners.ParentRunner.access$000(ParentRunner.java:42)
	DEBUG_FRAME = org.junit.runners.ParentRunner$2.evaluate(ParentRunner.java:184)
	DEBUG_FRAME = org.junit.runners.ParentRunner.run(ParentRunner.java:236)
	DEBUG_FRAME = org.apache.maven.surefire.junitcore.JUnitCore.run(JUnitCore.java:55)
	DEBUG_FRAME = org.apache.maven.surefire.junitcore.JUnitCoreWrapper.createRequestAndRun(JUnitCoreWrapper.java:137)
	DEBUG_FRAME = org.apache.maven.surefire.junitcore.JUnitCoreWrapper.executeEager(JUnitCoreWrapper.java:107)
	DEBUG_FRAME = org.apache.maven.surefire.junitcore.JUnitCoreWrapper.execute(JUnitCoreWrapper.java:83)
	DEBUG_FRAME = org.apache.maven.surefire.junitcore.JUnitCoreWrapper.execute(JUnitCoreWrapper.java:75)
	DEBUG_FRAME = org.apache.maven.surefire.junitcore.JUnitCoreProvider.invoke(JUnitCoreProvider.java:157)
	DEBUG_FRAME = org.apache.maven.surefire.booter.ForkedBooter.invokeProviderInSameClassLoader(ForkedBooter.java:386)
	DEBUG_FRAME = org.apache.maven.surefire.booter.ForkedBooter.runSuitesInProcess(ForkedBooter.java:323)
	DEBUG_FRAME = org.apache.maven.surefire.booter.ForkedBooter.main(ForkedBooter.java:143)

15:51:17,627 DEBUG [main] AxisOperation:485 - Entry: AxisOperation::getInputAction
15:51:17,627 DEBUG [main] AxisOperation:490 - Debug: AxisOperation::getInputAction - using soapAction
15:51:17,628 DEBUG [main] AxisOperation:506 - Exit: AxisOperation::getInputAction urn:anonOutInOp
15:51:17,628 DEBUG [main] AxisService:872 - mapActionToOperation: Mapping Action to Operation: action: urn:anonOutInOp; operation: org.apache.axis2.description.OutInAxisOperation@6d8ee197named: {http://ws.apache.org/namespaces/axis2}anonOutInOp
15:51:17,628 DEBUG [main] AxisService:878 - DEBUG_FRAME = org.apache.axis2.util.JavaUtils.callStackToString(JavaUtils.java:564)
	DEBUG_FRAME = org.apache.axis2.description.AxisService.mapActionToOperation(AxisService.java:878)
	DEBUG_FRAME = org.apache.axis2.description.AxisService.addOperation(AxisService.java:728)
	DEBUG_FRAME = org.apache.axis2.client.Stub.addAnonymousOperations(Stub.java:240)
	DEBUG_FRAME = net.ihe.gazelle.ws.client.GazelleTRMServiceStub.populateAxisService(GazelleTRMServiceStub.java:94)
	DEBUG_FRAME = net.ihe.gazelle.ws.client.GazelleTRMServiceStub.<init>(GazelleTRMServiceStub.java:40)
	DEBUG_FRAME = net.ihe.gazelle.ws.client.GazelleTRMServiceStub.<init>(GazelleTRMServiceStub.java:29)
	DEBUG_FRAME = net.ihe.gazelle.ws.client.GazelleTRMServiceStub.<init>(GazelleTRMServiceStub.java:75)
	DEBUG_FRAME = net.ihe.gazelle.ws.client.GazelleTRMServiceClient.<init>(GazelleTRMServiceClient.java:11)
	DEBUG_FRAME = net.ihe.gazelle.wstester.xdstools.ws.Xdstools.getNonce(Xdstools.java:61)
	DEBUG_FRAME = net.ihe.gazelle.wstester.xdstools.Ws.noNonceReturned(Ws.java:79)
	DEBUG_FRAME = sun.reflect.NativeMethodAccessorImpl.invoke0(Native Method)
	DEBUG_FRAME = sun.reflect.NativeMethodAccessorImpl.invoke(NativeMethodAccessorImpl.java:62)
	DEBUG_FRAME = sun.reflect.DelegatingMethodAccessorImpl.invoke(DelegatingMethodAccessorImpl.java:43)
	DEBUG_FRAME = java.lang.reflect.Method.invoke(Method.java:498)
	DEBUG_FRAME = org.junit.internal.runners.TestMethod.invoke(TestMethod.java:66)
	DEBUG_FRAME = org.powermock.modules.junit4.internal.impl.PowerMockJUnit44RunnerDelegateImpl$PowerMockJUnit44MethodRunner.runTestMethod(PowerMockJUnit44RunnerDelegateImpl.java:310)
	DEBUG_FRAME = org.junit.internal.runners.MethodRoadie$2.run(MethodRoadie.java:86)
	DEBUG_FRAME = org.junit.internal.runners.MethodRoadie.runBeforesThenTestThenAfters(MethodRoadie.java:94)
	DEBUG_FRAME = org.powermock.modules.junit4.internal.impl.PowerMockJUnit44RunnerDelegateImpl$PowerMockJUnit44MethodRunner.executeTest(PowerMockJUnit44RunnerDelegateImpl.java:294)
	DEBUG_FRAME = org.powermock.modules.junit4.internal.impl.PowerMockJUnit47RunnerDelegateImpl$PowerMockJUnit47MethodRunner.executeTestInSuper(PowerMockJUnit47RunnerDelegateImpl.java:127)
	DEBUG_FRAME = org.powermock.modules.junit4.internal.impl.PowerMockJUnit47RunnerDelegateImpl$PowerMockJUnit47MethodRunner.executeTest(PowerMockJUnit47RunnerDelegateImpl.java:82)
	DEBUG_FRAME = org.powermock.modules.junit4.internal.impl.PowerMockJUnit44RunnerDelegateImpl$PowerMockJUnit44MethodRunner.runBeforesThenTestThenAfters(PowerMockJUnit44RunnerDelegateImpl.java:282)
	DEBUG_FRAME = org.junit.internal.runners.MethodRoadie.runTest(MethodRoadie.java:84)
	DEBUG_FRAME = org.junit.internal.runners.MethodRoadie.run(MethodRoadie.java:49)
	DEBUG_FRAME = org.powermock.modules.junit4.internal.impl.PowerMockJUnit44RunnerDelegateImpl.invokeTestMethod(PowerMockJUnit44RunnerDelegateImpl.java:207)
	DEBUG_FRAME = org.powermock.modules.junit4.internal.impl.PowerMockJUnit44RunnerDelegateImpl.runMethods(PowerMockJUnit44RunnerDelegateImpl.java:146)
	DEBUG_FRAME = org.powermock.modules.junit4.internal.impl.PowerMockJUnit44RunnerDelegateImpl$1.run(PowerMockJUnit44RunnerDelegateImpl.java:120)
	DEBUG_FRAME = org.junit.internal.runners.ClassRoadie.runUnprotected(ClassRoadie.java:34)
	DEBUG_FRAME = org.junit.internal.runners.ClassRoadie.runProtected(ClassRoadie.java:44)
	DEBUG_FRAME = org.powermock.modules.junit4.internal.impl.PowerMockJUnit44RunnerDelegateImpl.run(PowerMockJUnit44RunnerDelegateImpl.java:118)
	DEBUG_FRAME = org.powermock.modules.junit4.common.internal.impl.JUnit4TestSuiteChunkerImpl.run(JUnit4TestSuiteChunkerImpl.java:101)
	DEBUG_FRAME = org.powermock.modules.junit4.common.internal.impl.AbstractCommonPowerMockRunner.run(AbstractCommonPowerMockRunner.java:53)
	DEBUG_FRAME = org.powermock.modules.junit4.PowerMockRunner.run(PowerMockRunner.java:53)
	DEBUG_FRAME = org.junit.runners.Suite.runChild(Suite.java:128)
	DEBUG_FRAME = org.junit.runners.Suite.runChild(Suite.java:24)
	DEBUG_FRAME = org.junit.runners.ParentRunner$3.run(ParentRunner.java:193)
	DEBUG_FRAME = org.junit.runners.ParentRunner$1.schedule(ParentRunner.java:52)
	DEBUG_FRAME = org.junit.runners.ParentRunner.runChildren(ParentRunner.java:191)
	DEBUG_FRAME = org.junit.runners.ParentRunner.access$000(ParentRunner.java:42)
	DEBUG_FRAME = org.junit.runners.ParentRunner$2.evaluate(ParentRunner.java:184)
	DEBUG_FRAME = org.junit.runners.ParentRunner.run(ParentRunner.java:236)
	DEBUG_FRAME = org.junit.runners.Suite.runChild(Suite.java:128)
	DEBUG_FRAME = org.junit.runners.Suite.runChild(Suite.java:24)
	DEBUG_FRAME = org.junit.runners.ParentRunner$3.run(ParentRunner.java:193)
	DEBUG_FRAME = org.junit.runners.ParentRunner$1.schedule(ParentRunner.java:52)
	DEBUG_FRAME = org.junit.runners.ParentRunner.runChildren(ParentRunner.java:191)
	DEBUG_FRAME = org.junit.runners.ParentRunner.access$000(ParentRunner.java:42)
	DEBUG_FRAME = org.junit.runners.ParentRunner$2.evaluate(ParentRunner.java:184)
	DEBUG_FRAME = org.junit.runners.ParentRunner.run(ParentRunner.java:236)
	DEBUG_FRAME = org.apache.maven.surefire.junitcore.JUnitCore.run(JUnitCore.java:55)
	DEBUG_FRAME = org.apache.maven.surefire.junitcore.JUnitCoreWrapper.createRequestAndRun(JUnitCoreWrapper.java:137)
	DEBUG_FRAME = org.apache.maven.surefire.junitcore.JUnitCoreWrapper.executeEager(JUnitCoreWrapper.java:107)
	DEBUG_FRAME = org.apache.maven.surefire.junitcore.JUnitCoreWrapper.execute(JUnitCoreWrapper.java:83)
	DEBUG_FRAME = org.apache.maven.surefire.junitcore.JUnitCoreWrapper.execute(JUnitCoreWrapper.java:75)
	DEBUG_FRAME = org.apache.maven.surefire.junitcore.JUnitCoreProvider.invoke(JUnitCoreProvider.java:157)
	DEBUG_FRAME = org.apache.maven.surefire.booter.ForkedBooter.invokeProviderInSameClassLoader(ForkedBooter.java:386)
	DEBUG_FRAME = org.apache.maven.surefire.booter.ForkedBooter.runSuitesInProcess(ForkedBooter.java:323)
	DEBUG_FRAME = org.apache.maven.surefire.booter.ForkedBooter.main(ForkedBooter.java:143)

15:51:17,628 DEBUG [main] AxisOperation:485 - Entry: AxisOperation::getInputAction
15:51:17,628 DEBUG [main] AxisOperation:506 - Exit: AxisOperation::getInputAction null
15:51:17,628 DEBUG [main] AxisOperation:467 - Entry: AxisOperation::setSoapAction, previous soapAction: null updated soapAction: urn:getSystemIsATool
15:51:17,628 DEBUG [main] AxisOperation:471 - Exit: AxisOperation::setSoapAction
15:51:17,628 DEBUG [main] AxisService:872 - mapActionToOperation: Mapping Action to Operation: action: getSystemIsATool; operation: org.apache.axis2.description.OutInAxisOperation@2fe12475named: {http://trm.ws.gazelletest.tm.gazelle.ihe.net/}getSystemIsATool
15:51:17,629 DEBUG [main] AxisService:878 - DEBUG_FRAME = org.apache.axis2.util.JavaUtils.callStackToString(JavaUtils.java:564)
	DEBUG_FRAME = org.apache.axis2.description.AxisService.mapActionToOperation(AxisService.java:878)
	DEBUG_FRAME = org.apache.axis2.description.AxisService.addOperation(AxisService.java:724)
	DEBUG_FRAME = net.ihe.gazelle.ws.client.GazelleTRMServiceStub.populateAxisService(GazelleTRMServiceStub.java:106)
	DEBUG_FRAME = net.ihe.gazelle.ws.client.GazelleTRMServiceStub.<init>(GazelleTRMServiceStub.java:40)
	DEBUG_FRAME = net.ihe.gazelle.ws.client.GazelleTRMServiceStub.<init>(GazelleTRMServiceStub.java:29)
	DEBUG_FRAME = net.ihe.gazelle.ws.client.GazelleTRMServiceStub.<init>(GazelleTRMServiceStub.java:75)
	DEBUG_FRAME = net.ihe.gazelle.ws.client.GazelleTRMServiceClient.<init>(GazelleTRMServiceClient.java:11)
	DEBUG_FRAME = net.ihe.gazelle.wstester.xdstools.ws.Xdstools.getNonce(Xdstools.java:61)
	DEBUG_FRAME = net.ihe.gazelle.wstester.xdstools.Ws.noNonceReturned(Ws.java:79)
	DEBUG_FRAME = sun.reflect.NativeMethodAccessorImpl.invoke0(Native Method)
	DEBUG_FRAME = sun.reflect.NativeMethodAccessorImpl.invoke(NativeMethodAccessorImpl.java:62)
	DEBUG_FRAME = sun.reflect.DelegatingMethodAccessorImpl.invoke(DelegatingMethodAccessorImpl.java:43)
	DEBUG_FRAME = java.lang.reflect.Method.invoke(Method.java:498)
	DEBUG_FRAME = org.junit.internal.runners.TestMethod.invoke(TestMethod.java:66)
	DEBUG_FRAME = org.powermock.modules.junit4.internal.impl.PowerMockJUnit44RunnerDelegateImpl$PowerMockJUnit44MethodRunner.runTestMethod(PowerMockJUnit44RunnerDelegateImpl.java:310)
	DEBUG_FRAME = org.junit.internal.runners.MethodRoadie$2.run(MethodRoadie.java:86)
	DEBUG_FRAME = org.junit.internal.runners.MethodRoadie.runBeforesThenTestThenAfters(MethodRoadie.java:94)
	DEBUG_FRAME = org.powermock.modules.junit4.internal.impl.PowerMockJUnit44RunnerDelegateImpl$PowerMockJUnit44MethodRunner.executeTest(PowerMockJUnit44RunnerDelegateImpl.java:294)
	DEBUG_FRAME = org.powermock.modules.junit4.internal.impl.PowerMockJUnit47RunnerDelegateImpl$PowerMockJUnit47MethodRunner.executeTestInSuper(PowerMockJUnit47RunnerDelegateImpl.java:127)
	DEBUG_FRAME = org.powermock.modules.junit4.internal.impl.PowerMockJUnit47RunnerDelegateImpl$PowerMockJUnit47MethodRunner.executeTest(PowerMockJUnit47RunnerDelegateImpl.java:82)
	DEBUG_FRAME = org.powermock.modules.junit4.internal.impl.PowerMockJUnit44RunnerDelegateImpl$PowerMockJUnit44MethodRunner.runBeforesThenTestThenAfters(PowerMockJUnit44RunnerDelegateImpl.java:282)
	DEBUG_FRAME = org.junit.internal.runners.MethodRoadie.runTest(MethodRoadie.java:84)
	DEBUG_FRAME = org.junit.internal.runners.MethodRoadie.run(MethodRoadie.java:49)
	DEBUG_FRAME = org.powermock.modules.junit4.internal.impl.PowerMockJUnit44RunnerDelegateImpl.invokeTestMethod(PowerMockJUnit44RunnerDelegateImpl.java:207)
	DEBUG_FRAME = org.powermock.modules.junit4.internal.impl.PowerMockJUnit44RunnerDelegateImpl.runMethods(PowerMockJUnit44RunnerDelegateImpl.java:146)
	DEBUG_FRAME = org.powermock.modules.junit4.internal.impl.PowerMockJUnit44RunnerDelegateImpl$1.run(PowerMockJUnit44RunnerDelegateImpl.java:120)
	DEBUG_FRAME = org.junit.internal.runners.ClassRoadie.runUnprotected(ClassRoadie.java:34)
	DEBUG_FRAME = org.junit.internal.runners.ClassRoadie.runProtected(ClassRoadie.java:44)
	DEBUG_FRAME = org.powermock.modules.junit4.internal.impl.PowerMockJUnit44RunnerDelegateImpl.run(PowerMockJUnit44RunnerDelegateImpl.java:118)
	DEBUG_FRAME = org.powermock.modules.junit4.common.internal.impl.JUnit4TestSuiteChunkerImpl.run(JUnit4TestSuiteChunkerImpl.java:101)
	DEBUG_FRAME = org.powermock.modules.junit4.common.internal.impl.AbstractCommonPowerMockRunner.run(AbstractCommonPowerMockRunner.java:53)
	DEBUG_FRAME = org.powermock.modules.junit4.PowerMockRunner.run(PowerMockRunner.java:53)
	DEBUG_FRAME = org.junit.runners.Suite.runChild(Suite.java:128)
	DEBUG_FRAME = org.junit.runners.Suite.runChild(Suite.java:24)
	DEBUG_FRAME = org.junit.runners.ParentRunner$3.run(ParentRunner.java:193)
	DEBUG_FRAME = org.junit.runners.ParentRunner$1.schedule(ParentRunner.java:52)
	DEBUG_FRAME = org.junit.runners.ParentRunner.runChildren(ParentRunner.java:191)
	DEBUG_FRAME = org.junit.runners.ParentRunner.access$000(ParentRunner.java:42)
	DEBUG_FRAME = org.junit.runners.ParentRunner$2.evaluate(ParentRunner.java:184)
	DEBUG_FRAME = org.junit.runners.ParentRunner.run(ParentRunner.java:236)
	DEBUG_FRAME = org.junit.runners.Suite.runChild(Suite.java:128)
	DEBUG_FRAME = org.junit.runners.Suite.runChild(Suite.java:24)
	DEBUG_FRAME = org.junit.runners.ParentRunner$3.run(ParentRunner.java:193)
	DEBUG_FRAME = org.junit.runners.ParentRunner$1.schedule(ParentRunner.java:52)
	DEBUG_FRAME = org.junit.runners.ParentRunner.runChildren(ParentRunner.java:191)
	DEBUG_FRAME = org.junit.runners.ParentRunner.access$000(ParentRunner.java:42)
	DEBUG_FRAME = org.junit.runners.ParentRunner$2.evaluate(ParentRunner.java:184)
	DEBUG_FRAME = org.junit.runners.ParentRunner.run(ParentRunner.java:236)
	DEBUG_FRAME = org.apache.maven.surefire.junitcore.JUnitCore.run(JUnitCore.java:55)
	DEBUG_FRAME = org.apache.maven.surefire.junitcore.JUnitCoreWrapper.createRequestAndRun(JUnitCoreWrapper.java:137)
	DEBUG_FRAME = org.apache.maven.surefire.junitcore.JUnitCoreWrapper.executeEager(JUnitCoreWrapper.java:107)
	DEBUG_FRAME = org.apache.maven.surefire.junitcore.JUnitCoreWrapper.execute(JUnitCoreWrapper.java:83)
	DEBUG_FRAME = org.apache.maven.surefire.junitcore.JUnitCoreWrapper.execute(JUnitCoreWrapper.java:75)
	DEBUG_FRAME = org.apache.maven.surefire.junitcore.JUnitCoreProvider.invoke(JUnitCoreProvider.java:157)
	DEBUG_FRAME = org.apache.maven.surefire.booter.ForkedBooter.invokeProviderInSameClassLoader(ForkedBooter.java:386)
	DEBUG_FRAME = org.apache.maven.surefire.booter.ForkedBooter.runSuitesInProcess(ForkedBooter.java:323)
	DEBUG_FRAME = org.apache.maven.surefire.booter.ForkedBooter.main(ForkedBooter.java:143)

15:51:17,629 DEBUG [main] AxisOperation:485 - Entry: AxisOperation::getInputAction
15:51:17,629 DEBUG [main] AxisOperation:490 - Debug: AxisOperation::getInputAction - using soapAction
15:51:17,629 DEBUG [main] AxisOperation:506 - Exit: AxisOperation::getInputAction urn:getSystemIsATool
15:51:17,629 DEBUG [main] AxisService:872 - mapActionToOperation: Mapping Action to Operation: action: urn:getSystemIsATool; operation: org.apache.axis2.description.OutInAxisOperation@2fe12475named: {http://trm.ws.gazelletest.tm.gazelle.ihe.net/}getSystemIsATool
15:51:17,629 DEBUG [main] AxisService:878 - DEBUG_FRAME = org.apache.axis2.util.JavaUtils.callStackToString(JavaUtils.java:564)
	DEBUG_FRAME = org.apache.axis2.description.AxisService.mapActionToOperation(AxisService.java:878)
	DEBUG_FRAME = org.apache.axis2.description.AxisService.addOperation(AxisService.java:728)
	DEBUG_FRAME = net.ihe.gazelle.ws.client.GazelleTRMServiceStub.populateAxisService(GazelleTRMServiceStub.java:106)
	DEBUG_FRAME = net.ihe.gazelle.ws.client.GazelleTRMServiceStub.<init>(GazelleTRMServiceStub.java:40)
	DEBUG_FRAME = net.ihe.gazelle.ws.client.GazelleTRMServiceStub.<init>(GazelleTRMServiceStub.java:29)
	DEBUG_FRAME = net.ihe.gazelle.ws.client.GazelleTRMServiceStub.<init>(GazelleTRMServiceStub.java:75)
	DEBUG_FRAME = net.ihe.gazelle.ws.client.GazelleTRMServiceClient.<init>(GazelleTRMServiceClient.java:11)
	DEBUG_FRAME = net.ihe.gazelle.wstester.xdstools.ws.Xdstools.getNonce(Xdstools.java:61)
	DEBUG_FRAME = net.ihe.gazelle.wstester.xdstools.Ws.noNonceReturned(Ws.java:79)
	DEBUG_FRAME = sun.reflect.NativeMethodAccessorImpl.invoke0(Native Method)
	DEBUG_FRAME = sun.reflect.NativeMethodAccessorImpl.invoke(NativeMethodAccessorImpl.java:62)
	DEBUG_FRAME = sun.reflect.DelegatingMethodAccessorImpl.invoke(DelegatingMethodAccessorImpl.java:43)
	DEBUG_FRAME = java.lang.reflect.Method.invoke(Method.java:498)
	DEBUG_FRAME = org.junit.internal.runners.TestMethod.invoke(TestMethod.java:66)
	DEBUG_FRAME = org.powermock.modules.junit4.internal.impl.PowerMockJUnit44RunnerDelegateImpl$PowerMockJUnit44MethodRunner.runTestMethod(PowerMockJUnit44RunnerDelegateImpl.java:310)
	DEBUG_FRAME = org.junit.internal.runners.MethodRoadie$2.run(MethodRoadie.java:86)
	DEBUG_FRAME = org.junit.internal.runners.MethodRoadie.runBeforesThenTestThenAfters(MethodRoadie.java:94)
	DEBUG_FRAME = org.powermock.modules.junit4.internal.impl.PowerMockJUnit44RunnerDelegateImpl$PowerMockJUnit44MethodRunner.executeTest(PowerMockJUnit44RunnerDelegateImpl.java:294)
	DEBUG_FRAME = org.powermock.modules.junit4.internal.impl.PowerMockJUnit47RunnerDelegateImpl$PowerMockJUnit47MethodRunner.executeTestInSuper(PowerMockJUnit47RunnerDelegateImpl.java:127)
	DEBUG_FRAME = org.powermock.modules.junit4.internal.impl.PowerMockJUnit47RunnerDelegateImpl$PowerMockJUnit47MethodRunner.executeTest(PowerMockJUnit47RunnerDelegateImpl.java:82)
	DEBUG_FRAME = org.powermock.modules.junit4.internal.impl.PowerMockJUnit44RunnerDelegateImpl$PowerMockJUnit44MethodRunner.runBeforesThenTestThenAfters(PowerMockJUnit44RunnerDelegateImpl.java:282)
	DEBUG_FRAME = org.junit.internal.runners.MethodRoadie.runTest(MethodRoadie.java:84)
	DEBUG_FRAME = org.junit.internal.runners.MethodRoadie.run(MethodRoadie.java:49)
	DEBUG_FRAME = org.powermock.modules.junit4.internal.impl.PowerMockJUnit44RunnerDelegateImpl.invokeTestMethod(PowerMockJUnit44RunnerDelegateImpl.java:207)
	DEBUG_FRAME = org.powermock.modules.junit4.internal.impl.PowerMockJUnit44RunnerDelegateImpl.runMethods(PowerMockJUnit44RunnerDelegateImpl.java:146)
	DEBUG_FRAME = org.powermock.modules.junit4.internal.impl.PowerMockJUnit44RunnerDelegateImpl$1.run(PowerMockJUnit44RunnerDelegateImpl.java:120)
	DEBUG_FRAME = org.junit.internal.runners.ClassRoadie.runUnprotected(ClassRoadie.java:34)
	DEBUG_FRAME = org.junit.internal.runners.ClassRoadie.runProtected(ClassRoadie.java:44)
	DEBUG_FRAME = org.powermock.modules.junit4.internal.impl.PowerMockJUnit44RunnerDelegateImpl.run(PowerMockJUnit44RunnerDelegateImpl.java:118)
	DEBUG_FRAME = org.powermock.modules.junit4.common.internal.impl.JUnit4TestSuiteChunkerImpl.run(JUnit4TestSuiteChunkerImpl.java:101)
	DEBUG_FRAME = org.powermock.modules.junit4.common.internal.impl.AbstractCommonPowerMockRunner.run(AbstractCommonPowerMockRunner.java:53)
	DEBUG_FRAME = org.powermock.modules.junit4.PowerMockRunner.run(PowerMockRunner.java:53)
	DEBUG_FRAME = org.junit.runners.Suite.runChild(Suite.java:128)
	DEBUG_FRAME = org.junit.runners.Suite.runChild(Suite.java:24)
	DEBUG_FRAME = org.junit.runners.ParentRunner$3.run(ParentRunner.java:193)
	DEBUG_FRAME = org.junit.runners.ParentRunner$1.schedule(ParentRunner.java:52)
	DEBUG_FRAME = org.junit.runners.ParentRunner.runChildren(ParentRunner.java:191)
	DEBUG_FRAME = org.junit.runners.ParentRunner.access$000(ParentRunner.java:42)
	DEBUG_FRAME = org.junit.runners.ParentRunner$2.evaluate(ParentRunner.java:184)
	DEBUG_FRAME = org.junit.runners.ParentRunner.run(ParentRunner.java:236)
	DEBUG_FRAME = org.junit.runners.Suite.runChild(Suite.java:128)
	DEBUG_FRAME = org.junit.runners.Suite.runChild(Suite.java:24)
	DEBUG_FRAME = org.junit.runners.ParentRunner$3.run(ParentRunner.java:193)
	DEBUG_FRAME = org.junit.runners.ParentRunner$1.schedule(ParentRunner.java:52)
	DEBUG_FRAME = org.junit.runners.ParentRunner.runChildren(ParentRunner.java:191)
	DEBUG_FRAME = org.junit.runners.ParentRunner.access$000(ParentRunner.java:42)
	DEBUG_FRAME = org.junit.runners.ParentRunner$2.evaluate(ParentRunner.java:184)
	DEBUG_FRAME = org.junit.runners.ParentRunner.run(ParentRunner.java:236)
	DEBUG_FRAME = org.apache.maven.surefire.junitcore.JUnitCore.run(JUnitCore.java:55)
	DEBUG_FRAME = org.apache.maven.surefire.junitcore.JUnitCoreWrapper.createRequestAndRun(JUnitCoreWrapper.java:137)
	DEBUG_FRAME = org.apache.maven.surefire.junitcore.JUnitCoreWrapper.executeEager(JUnitCoreWrapper.java:107)
	DEBUG_FRAME = org.apache.maven.surefire.junitcore.JUnitCoreWrapper.execute(JUnitCoreWrapper.java:83)
	DEBUG_FRAME = org.apache.maven.surefire.junitcore.JUnitCoreWrapper.execute(JUnitCoreWrapper.java:75)
	DEBUG_FRAME = org.apache.maven.surefire.junitcore.JUnitCoreProvider.invoke(JUnitCoreProvider.java:157)
	DEBUG_FRAME = org.apache.maven.surefire.booter.ForkedBooter.invokeProviderInSameClassLoader(ForkedBooter.java:386)
	DEBUG_FRAME = org.apache.maven.surefire.booter.ForkedBooter.runSuitesInProcess(ForkedBooter.java:323)
	DEBUG_FRAME = org.apache.maven.surefire.booter.ForkedBooter.main(ForkedBooter.java:143)

15:51:17,629 DEBUG [main] AxisOperation:485 - Entry: AxisOperation::getInputAction
15:51:17,630 DEBUG [main] AxisOperation:506 - Exit: AxisOperation::getInputAction null
15:51:17,630 DEBUG [main] AxisOperation:467 - Entry: AxisOperation::setSoapAction, previous soapAction: null updated soapAction: urn:getTestInstancesByTestingSession
15:51:17,630 DEBUG [main] AxisOperation:471 - Exit: AxisOperation::setSoapAction
15:51:17,630 DEBUG [main] AxisService:872 - mapActionToOperation: Mapping Action to Operation: action: getTestInstancesByTestingSession; operation: org.apache.axis2.description.OutInAxisOperation@6194af6fnamed: {http://trm.ws.gazelletest.tm.gazelle.ihe.net/}getTestInstancesByTestingSession
15:51:17,630 DEBUG [main] AxisService:878 - DEBUG_FRAME = org.apache.axis2.util.JavaUtils.callStackToString(JavaUtils.java:564)
	DEBUG_FRAME = org.apache.axis2.description.AxisService.mapActionToOperation(AxisService.java:878)
	DEBUG_FRAME = org.apache.axis2.description.AxisService.addOperation(AxisService.java:724)
	DEBUG_FRAME = net.ihe.gazelle.ws.client.GazelleTRMServiceStub.populateAxisService(GazelleTRMServiceStub.java:115)
	DEBUG_FRAME = net.ihe.gazelle.ws.client.GazelleTRMServiceStub.<init>(GazelleTRMServiceStub.java:40)
	DEBUG_FRAME = net.ihe.gazelle.ws.client.GazelleTRMServiceStub.<init>(GazelleTRMServiceStub.java:29)
	DEBUG_FRAME = net.ihe.gazelle.ws.client.GazelleTRMServiceStub.<init>(GazelleTRMServiceStub.java:75)
	DEBUG_FRAME = net.ihe.gazelle.ws.client.GazelleTRMServiceClient.<init>(GazelleTRMServiceClient.java:11)
	DEBUG_FRAME = net.ihe.gazelle.wstester.xdstools.ws.Xdstools.getNonce(Xdstools.java:61)
	DEBUG_FRAME = net.ihe.gazelle.wstester.xdstools.Ws.noNonceReturned(Ws.java:79)
	DEBUG_FRAME = sun.reflect.NativeMethodAccessorImpl.invoke0(Native Method)
	DEBUG_FRAME = sun.reflect.NativeMethodAccessorImpl.invoke(NativeMethodAccessorImpl.java:62)
	DEBUG_FRAME = sun.reflect.DelegatingMethodAccessorImpl.invoke(DelegatingMethodAccessorImpl.java:43)
	DEBUG_FRAME = java.lang.reflect.Method.invoke(Method.java:498)
	DEBUG_FRAME = org.junit.internal.runners.TestMethod.invoke(TestMethod.java:66)
	DEBUG_FRAME = org.powermock.modules.junit4.internal.impl.PowerMockJUnit44RunnerDelegateImpl$PowerMockJUnit44MethodRunner.runTestMethod(PowerMockJUnit44RunnerDelegateImpl.java:310)
	DEBUG_FRAME = org.junit.internal.runners.MethodRoadie$2.run(MethodRoadie.java:86)
	DEBUG_FRAME = org.junit.internal.runners.MethodRoadie.runBeforesThenTestThenAfters(MethodRoadie.java:94)
	DEBUG_FRAME = org.powermock.modules.junit4.internal.impl.PowerMockJUnit44RunnerDelegateImpl$PowerMockJUnit44MethodRunner.executeTest(PowerMockJUnit44RunnerDelegateImpl.java:294)
	DEBUG_FRAME = org.powermock.modules.junit4.internal.impl.PowerMockJUnit47RunnerDelegateImpl$PowerMockJUnit47MethodRunner.executeTestInSuper(PowerMockJUnit47RunnerDelegateImpl.java:127)
	DEBUG_FRAME = org.powermock.modules.junit4.internal.impl.PowerMockJUnit47RunnerDelegateImpl$PowerMockJUnit47MethodRunner.executeTest(PowerMockJUnit47RunnerDelegateImpl.java:82)
	DEBUG_FRAME = org.powermock.modules.junit4.internal.impl.PowerMockJUnit44RunnerDelegateImpl$PowerMockJUnit44MethodRunner.runBeforesThenTestThenAfters(PowerMockJUnit44RunnerDelegateImpl.java:282)
	DEBUG_FRAME = org.junit.internal.runners.MethodRoadie.runTest(MethodRoadie.java:84)
	DEBUG_FRAME = org.junit.internal.runners.MethodRoadie.run(MethodRoadie.java:49)
	DEBUG_FRAME = org.powermock.modules.junit4.internal.impl.PowerMockJUnit44RunnerDelegateImpl.invokeTestMethod(PowerMockJUnit44RunnerDelegateImpl.java:207)
	DEBUG_FRAME = org.powermock.modules.junit4.internal.impl.PowerMockJUnit44RunnerDelegateImpl.runMethods(PowerMockJUnit44RunnerDelegateImpl.java:146)
	DEBUG_FRAME = org.powermock.modules.junit4.internal.impl.PowerMockJUnit44RunnerDelegateImpl$1.run(PowerMockJUnit44RunnerDelegateImpl.java:120)
	DEBUG_FRAME = org.junit.internal.runners.ClassRoadie.runUnprotected(ClassRoadie.java:34)
	DEBUG_FRAME = org.junit.internal.runners.ClassRoadie.runProtected(ClassRoadie.java:44)
	DEBUG_FRAME = org.powermock.modules.junit4.internal.impl.PowerMockJUnit44RunnerDelegateImpl.run(PowerMockJUnit44RunnerDelegateImpl.java:118)
	DEBUG_FRAME = org.powermock.modules.junit4.common.internal.impl.JUnit4TestSuiteChunkerImpl.run(JUnit4TestSuiteChunkerImpl.java:101)
	DEBUG_FRAME = org.powermock.modules.junit4.common.internal.impl.AbstractCommonPowerMockRunner.run(AbstractCommonPowerMockRunner.java:53)
	DEBUG_FRAME = org.powermock.modules.junit4.PowerMockRunner.run(PowerMockRunner.java:53)
	DEBUG_FRAME = org.junit.runners.Suite.runChild(Suite.java:128)
	DEBUG_FRAME = org.junit.runners.Suite.runChild(Suite.java:24)
	DEBUG_FRAME = org.junit.runners.ParentRunner$3.run(ParentRunner.java:193)
	DEBUG_FRAME = org.junit.runners.ParentRunner$1.schedule(ParentRunner.java:52)
	DEBUG_FRAME = org.junit.runners.ParentRunner.runChildren(ParentRunner.java:191)
	DEBUG_FRAME = org.junit.runners.ParentRunner.access$000(ParentRunner.java:42)
	DEBUG_FRAME = org.junit.runners.ParentRunner$2.evaluate(ParentRunner.java:184)
	DEBUG_FRAME = org.junit.runners.ParentRunner.run(ParentRunner.java:236)
	DEBUG_FRAME = org.junit.runners.Suite.runChild(Suite.java:128)
	DEBUG_FRAME = org.junit.runners.Suite.runChild(Suite.java:24)
	DEBUG_FRAME = org.junit.runners.ParentRunner$3.run(ParentRunner.java:193)
	DEBUG_FRAME = org.junit.runners.ParentRunner$1.schedule(ParentRunner.java:52)
	DEBUG_FRAME = org.junit.runners.ParentRunner.runChildren(ParentRunner.java:191)
	DEBUG_FRAME = org.junit.runners.ParentRunner.access$000(ParentRunner.java:42)
	DEBUG_FRAME = org.junit.runners.ParentRunner$2.evaluate(ParentRunner.java:184)
	DEBUG_FRAME = org.junit.runners.ParentRunner.run(ParentRunner.java:236)
	DEBUG_FRAME = org.apache.maven.surefire.junitcore.JUnitCore.run(JUnitCore.java:55)
	DEBUG_FRAME = org.apache.maven.surefire.junitcore.JUnitCoreWrapper.createRequestAndRun(JUnitCoreWrapper.java:137)
	DEBUG_FRAME = org.apache.maven.surefire.junitcore.JUnitCoreWrapper.executeEager(JUnitCoreWrapper.java:107)
	DEBUG_FRAME = org.apache.maven.surefire.junitcore.JUnitCoreWrapper.execute(JUnitCoreWrapper.java:83)
	DEBUG_FRAME = org.apache.maven.surefire.junitcore.JUnitCoreWrapper.execute(JUnitCoreWrapper.java:75)
	DEBUG_FRAME = org.apache.maven.surefire.junitcore.JUnitCoreProvider.invoke(JUnitCoreProvider.java:157)
	DEBUG_FRAME = org.apache.maven.surefire.booter.ForkedBooter.invokeProviderInSameClassLoader(ForkedBooter.java:386)
	DEBUG_FRAME = org.apache.maven.surefire.booter.ForkedBooter.runSuitesInProcess(ForkedBooter.java:323)
	DEBUG_FRAME = org.apache.maven.surefire.booter.ForkedBooter.main(ForkedBooter.java:143)

15:51:17,630 DEBUG [main] AxisOperation:485 - Entry: AxisOperation::getInputAction
15:51:17,630 DEBUG [main] AxisOperation:490 - Debug: AxisOperation::getInputAction - using soapAction
15:51:17,630 DEBUG [main] AxisOperation:506 - Exit: AxisOperation::getInputAction urn:getTestInstancesByTestingSession
15:51:17,630 DEBUG [main] AxisService:872 - mapActionToOperation: Mapping Action to Operation: action: urn:getTestInstancesByTestingSession; operation: org.apache.axis2.description.OutInAxisOperation@6194af6fnamed: {http://trm.ws.gazelletest.tm.gazelle.ihe.net/}getTestInstancesByTestingSession
15:51:17,631 DEBUG [main] AxisService:878 - DEBUG_FRAME = org.apache.axis2.util.JavaUtils.callStackToString(JavaUtils.java:564)
	DEBUG_FRAME = org.apache.axis2.description.AxisService.mapActionToOperation(AxisService.java:878)
	DEBUG_FRAME = org.apache.axis2.description.AxisService.addOperation(AxisService.java:728)
	DEBUG_FRAME = net.ihe.gazelle.ws.client.GazelleTRMServiceStub.populateAxisService(GazelleTRMServiceStub.java:115)
	DEBUG_FRAME = net.ihe.gazelle.ws.client.GazelleTRMServiceStub.<init>(GazelleTRMServiceStub.java:40)
	DEBUG_FRAME = net.ihe.gazelle.ws.client.GazelleTRMServiceStub.<init>(GazelleTRMServiceStub.java:29)
	DEBUG_FRAME = net.ihe.gazelle.ws.client.GazelleTRMServiceStub.<init>(GazelleTRMServiceStub.java:75)
	DEBUG_FRAME = net.ihe.gazelle.ws.client.GazelleTRMServiceClient.<init>(GazelleTRMServiceClient.java:11)
	DEBUG_FRAME = net.ihe.gazelle.wstester.xdstools.ws.Xdstools.getNonce(Xdstools.java:61)
	DEBUG_FRAME = net.ihe.gazelle.wstester.xdstools.Ws.noNonceReturned(Ws.java:79)
	DEBUG_FRAME = sun.reflect.NativeMethodAccessorImpl.invoke0(Native Method)
	DEBUG_FRAME = sun.reflect.NativeMethodAccessorImpl.invoke(NativeMethodAccessorImpl.java:62)
	DEBUG_FRAME = sun.reflect.DelegatingMethodAccessorImpl.invoke(DelegatingMethodAccessorImpl.java:43)
	DEBUG_FRAME = java.lang.reflect.Method.invoke(Method.java:498)
	DEBUG_FRAME = org.junit.internal.runners.TestMethod.invoke(TestMethod.java:66)
	DEBUG_FRAME = org.powermock.modules.junit4.internal.impl.PowerMockJUnit44RunnerDelegateImpl$PowerMockJUnit44MethodRunner.runTestMethod(PowerMockJUnit44RunnerDelegateImpl.java:310)
	DEBUG_FRAME = org.junit.internal.runners.MethodRoadie$2.run(MethodRoadie.java:86)
	DEBUG_FRAME = org.junit.internal.runners.MethodRoadie.runBeforesThenTestThenAfters(MethodRoadie.java:94)
	DEBUG_FRAME = org.powermock.modules.junit4.internal.impl.PowerMockJUnit44RunnerDelegateImpl$PowerMockJUnit44MethodRunner.executeTest(PowerMockJUnit44RunnerDelegateImpl.java:294)
	DEBUG_FRAME = org.powermock.modules.junit4.internal.impl.PowerMockJUnit47RunnerDelegateImpl$PowerMockJUnit47MethodRunner.executeTestInSuper(PowerMockJUnit47RunnerDelegateImpl.java:127)
	DEBUG_FRAME = org.powermock.modules.junit4.internal.impl.PowerMockJUnit47RunnerDelegateImpl$PowerMockJUnit47MethodRunner.executeTest(PowerMockJUnit47RunnerDelegateImpl.java:82)
	DEBUG_FRAME = org.powermock.modules.junit4.internal.impl.PowerMockJUnit44RunnerDelegateImpl$PowerMockJUnit44MethodRunner.runBeforesThenTestThenAfters(PowerMockJUnit44RunnerDelegateImpl.java:282)
	DEBUG_FRAME = org.junit.internal.runners.MethodRoadie.runTest(MethodRoadie.java:84)
	DEBUG_FRAME = org.junit.internal.runners.MethodRoadie.run(MethodRoadie.java:49)
	DEBUG_FRAME = org.powermock.modules.junit4.internal.impl.PowerMockJUnit44RunnerDelegateImpl.invokeTestMethod(PowerMockJUnit44RunnerDelegateImpl.java:207)
	DEBUG_FRAME = org.powermock.modules.junit4.internal.impl.PowerMockJUnit44RunnerDelegateImpl.runMethods(PowerMockJUnit44RunnerDelegateImpl.java:146)
	DEBUG_FRAME = org.powermock.modules.junit4.internal.impl.PowerMockJUnit44RunnerDelegateImpl$1.run(PowerMockJUnit44RunnerDelegateImpl.java:120)
	DEBUG_FRAME = org.junit.internal.runners.ClassRoadie.runUnprotected(ClassRoadie.java:34)
	DEBUG_FRAME = org.junit.internal.runners.ClassRoadie.runProtected(ClassRoadie.java:44)
	DEBUG_FRAME = org.powermock.modules.junit4.internal.impl.PowerMockJUnit44RunnerDelegateImpl.run(PowerMockJUnit44RunnerDelegateImpl.java:118)
	DEBUG_FRAME = org.powermock.modules.junit4.common.internal.impl.JUnit4TestSuiteChunkerImpl.run(JUnit4TestSuiteChunkerImpl.java:101)
	DEBUG_FRAME = org.powermock.modules.junit4.common.internal.impl.AbstractCommonPowerMockRunner.run(AbstractCommonPowerMockRunner.java:53)
	DEBUG_FRAME = org.powermock.modules.junit4.PowerMockRunner.run(PowerMockRunner.java:53)
	DEBUG_FRAME = org.junit.runners.Suite.runChild(Suite.java:128)
	DEBUG_FRAME = org.junit.runners.Suite.runChild(Suite.java:24)
	DEBUG_FRAME = org.junit.runners.ParentRunner$3.run(ParentRunner.java:193)
	DEBUG_FRAME = org.junit.runners.ParentRunner$1.schedule(ParentRunner.java:52)
	DEBUG_FRAME = org.junit.runners.ParentRunner.runChildren(ParentRunner.java:191)
	DEBUG_FRAME = org.junit.runners.ParentRunner.access$000(ParentRunner.java:42)
	DEBUG_FRAME = org.junit.runners.ParentRunner$2.evaluate(ParentRunner.java:184)
	DEBUG_FRAME = org.junit.runners.ParentRunner.run(ParentRunner.java:236)
	DEBUG_FRAME = org.junit.runners.Suite.runChild(Suite.java:128)
	DEBUG_FRAME = org.junit.runners.Suite.runChild(Suite.java:24)
	DEBUG_FRAME = org.junit.runners.ParentRunner$3.run(ParentRunner.java:193)
	DEBUG_FRAME = org.junit.runners.ParentRunner$1.schedule(ParentRunner.java:52)
	DEBUG_FRAME = org.junit.runners.ParentRunner.runChildren(ParentRunner.java:191)
	DEBUG_FRAME = org.junit.runners.ParentRunner.access$000(ParentRunner.java:42)
	DEBUG_FRAME = org.junit.runners.ParentRunner$2.evaluate(ParentRunner.java:184)
	DEBUG_FRAME = org.junit.runners.ParentRunner.run(ParentRunner.java:236)
	DEBUG_FRAME = org.apache.maven.surefire.junitcore.JUnitCore.run(JUnitCore.java:55)
	DEBUG_FRAME = org.apache.maven.surefire.junitcore.JUnitCoreWrapper.createRequestAndRun(JUnitCoreWrapper.java:137)
	DEBUG_FRAME = org.apache.maven.surefire.junitcore.JUnitCoreWrapper.executeEager(JUnitCoreWrapper.java:107)
	DEBUG_FRAME = org.apache.maven.surefire.junitcore.JUnitCoreWrapper.execute(JUnitCoreWrapper.java:83)
	DEBUG_FRAME = org.apache.maven.surefire.junitcore.JUnitCoreWrapper.execute(JUnitCoreWrapper.java:75)
	DEBUG_FRAME = org.apache.maven.surefire.junitcore.JUnitCoreProvider.invoke(JUnitCoreProvider.java:157)
	DEBUG_FRAME = org.apache.maven.surefire.booter.ForkedBooter.invokeProviderInSameClassLoader(ForkedBooter.java:386)
	DEBUG_FRAME = org.apache.maven.surefire.booter.ForkedBooter.runSuitesInProcess(ForkedBooter.java:323)
	DEBUG_FRAME = org.apache.maven.surefire.booter.ForkedBooter.main(ForkedBooter.java:143)

15:51:17,631 DEBUG [main] AxisOperation:485 - Entry: AxisOperation::getInputAction
15:51:17,631 DEBUG [main] AxisOperation:506 - Exit: AxisOperation::getInputAction null
15:51:17,631 DEBUG [main] AxisOperation:467 - Entry: AxisOperation::setSoapAction, previous soapAction: null updated soapAction: urn:getTestInstanceById
15:51:17,631 DEBUG [main] AxisOperation:471 - Exit: AxisOperation::setSoapAction
15:51:17,631 DEBUG [main] AxisService:872 - mapActionToOperation: Mapping Action to Operation: action: getTestInstanceById; operation: org.apache.axis2.description.OutInAxisOperation@6ccd6981named: {http://trm.ws.gazelletest.tm.gazelle.ihe.net/}getTestInstanceById
15:51:17,631 DEBUG [main] AxisService:878 - DEBUG_FRAME = org.apache.axis2.util.JavaUtils.callStackToString(JavaUtils.java:564)
	DEBUG_FRAME = org.apache.axis2.description.AxisService.mapActionToOperation(AxisService.java:878)
	DEBUG_FRAME = org.apache.axis2.description.AxisService.addOperation(AxisService.java:724)
	DEBUG_FRAME = net.ihe.gazelle.ws.client.GazelleTRMServiceStub.populateAxisService(GazelleTRMServiceStub.java:124)
	DEBUG_FRAME = net.ihe.gazelle.ws.client.GazelleTRMServiceStub.<init>(GazelleTRMServiceStub.java:40)
	DEBUG_FRAME = net.ihe.gazelle.ws.client.GazelleTRMServiceStub.<init>(GazelleTRMServiceStub.java:29)
	DEBUG_FRAME = net.ihe.gazelle.ws.client.GazelleTRMServiceStub.<init>(GazelleTRMServiceStub.java:75)
	DEBUG_FRAME = net.ihe.gazelle.ws.client.GazelleTRMServiceClient.<init>(GazelleTRMServiceClient.java:11)
	DEBUG_FRAME = net.ihe.gazelle.wstester.xdstools.ws.Xdstools.getNonce(Xdstools.java:61)
	DEBUG_FRAME = net.ihe.gazelle.wstester.xdstools.Ws.noNonceReturned(Ws.java:79)
	DEBUG_FRAME = sun.reflect.NativeMethodAccessorImpl.invoke0(Native Method)
	DEBUG_FRAME = sun.reflect.NativeMethodAccessorImpl.invoke(NativeMethodAccessorImpl.java:62)
	DEBUG_FRAME = sun.reflect.DelegatingMethodAccessorImpl.invoke(DelegatingMethodAccessorImpl.java:43)
	DEBUG_FRAME = java.lang.reflect.Method.invoke(Method.java:498)
	DEBUG_FRAME = org.junit.internal.runners.TestMethod.invoke(TestMethod.java:66)
	DEBUG_FRAME = org.powermock.modules.junit4.internal.impl.PowerMockJUnit44RunnerDelegateImpl$PowerMockJUnit44MethodRunner.runTestMethod(PowerMockJUnit44RunnerDelegateImpl.java:310)
	DEBUG_FRAME = org.junit.internal.runners.MethodRoadie$2.run(MethodRoadie.java:86)
	DEBUG_FRAME = org.junit.internal.runners.MethodRoadie.runBeforesThenTestThenAfters(MethodRoadie.java:94)
	DEBUG_FRAME = org.powermock.modules.junit4.internal.impl.PowerMockJUnit44RunnerDelegateImpl$PowerMockJUnit44MethodRunner.executeTest(PowerMockJUnit44RunnerDelegateImpl.java:294)
	DEBUG_FRAME = org.powermock.modules.junit4.internal.impl.PowerMockJUnit47RunnerDelegateImpl$PowerMockJUnit47MethodRunner.executeTestInSuper(PowerMockJUnit47RunnerDelegateImpl.java:127)
	DEBUG_FRAME = org.powermock.modules.junit4.internal.impl.PowerMockJUnit47RunnerDelegateImpl$PowerMockJUnit47MethodRunner.executeTest(PowerMockJUnit47RunnerDelegateImpl.java:82)
	DEBUG_FRAME = org.powermock.modules.junit4.internal.impl.PowerMockJUnit44RunnerDelegateImpl$PowerMockJUnit44MethodRunner.runBeforesThenTestThenAfters(PowerMockJUnit44RunnerDelegateImpl.java:282)
	DEBUG_FRAME = org.junit.internal.runners.MethodRoadie.runTest(MethodRoadie.java:84)
	DEBUG_FRAME = org.junit.internal.runners.MethodRoadie.run(MethodRoadie.java:49)
	DEBUG_FRAME = org.powermock.modules.junit4.internal.impl.PowerMockJUnit44RunnerDelegateImpl.invokeTestMethod(PowerMockJUnit44RunnerDelegateImpl.java:207)
	DEBUG_FRAME = org.powermock.modules.junit4.internal.impl.PowerMockJUnit44RunnerDelegateImpl.runMethods(PowerMockJUnit44RunnerDelegateImpl.java:146)
	DEBUG_FRAME = org.powermock.modules.junit4.internal.impl.PowerMockJUnit44RunnerDelegateImpl$1.run(PowerMockJUnit44RunnerDelegateImpl.java:120)
	DEBUG_FRAME = org.junit.internal.runners.ClassRoadie.runUnprotected(ClassRoadie.java:34)
	DEBUG_FRAME = org.junit.internal.runners.ClassRoadie.runProtected(ClassRoadie.java:44)
	DEBUG_FRAME = org.powermock.modules.junit4.internal.impl.PowerMockJUnit44RunnerDelegateImpl.run(PowerMockJUnit44RunnerDelegateImpl.java:118)
	DEBUG_FRAME = org.powermock.modules.junit4.common.internal.impl.JUnit4TestSuiteChunkerImpl.run(JUnit4TestSuiteChunkerImpl.java:101)
	DEBUG_FRAME = org.powermock.modules.junit4.common.internal.impl.AbstractCommonPowerMockRunner.run(AbstractCommonPowerMockRunner.java:53)
	DEBUG_FRAME = org.powermock.modules.junit4.PowerMockRunner.run(PowerMockRunner.java:53)
	DEBUG_FRAME = org.junit.runners.Suite.runChild(Suite.java:128)
	DEBUG_FRAME = org.junit.runners.Suite.runChild(Suite.java:24)
	DEBUG_FRAME = org.junit.runners.ParentRunner$3.run(ParentRunner.java:193)
	DEBUG_FRAME = org.junit.runners.ParentRunner$1.schedule(ParentRunner.java:52)
	DEBUG_FRAME = org.junit.runners.ParentRunner.runChildren(ParentRunner.java:191)
	DEBUG_FRAME = org.junit.runners.ParentRunner.access$000(ParentRunner.java:42)
	DEBUG_FRAME = org.junit.runners.ParentRunner$2.evaluate(ParentRunner.java:184)
	DEBUG_FRAME = org.junit.runners.ParentRunner.run(ParentRunner.java:236)
	DEBUG_FRAME = org.junit.runners.Suite.runChild(Suite.java:128)
	DEBUG_FRAME = org.junit.runners.Suite.runChild(Suite.java:24)
	DEBUG_FRAME = org.junit.runners.ParentRunner$3.run(ParentRunner.java:193)
	DEBUG_FRAME = org.junit.runners.ParentRunner$1.schedule(ParentRunner.java:52)
	DEBUG_FRAME = org.junit.runners.ParentRunner.runChildren(ParentRunner.java:191)
	DEBUG_FRAME = org.junit.runners.ParentRunner.access$000(ParentRunner.java:42)
	DEBUG_FRAME = org.junit.runners.ParentRunner$2.evaluate(ParentRunner.java:184)
	DEBUG_FRAME = org.junit.runners.ParentRunner.run(ParentRunner.java:236)
	DEBUG_FRAME = org.apache.maven.surefire.junitcore.JUnitCore.run(JUnitCore.java:55)
	DEBUG_FRAME = org.apache.maven.surefire.junitcore.JUnitCoreWrapper.createRequestAndRun(JUnitCoreWrapper.java:137)
	DEBUG_FRAME = org.apache.maven.surefire.junitcore.JUnitCoreWrapper.executeEager(JUnitCoreWrapper.java:107)
	DEBUG_FRAME = org.apache.maven.surefire.junitcore.JUnitCoreWrapper.execute(JUnitCoreWrapper.java:83)
	DEBUG_FRAME = org.apache.maven.surefire.junitcore.JUnitCoreWrapper.execute(JUnitCoreWrapper.java:75)
	DEBUG_FRAME = org.apache.maven.surefire.junitcore.JUnitCoreProvider.invoke(JUnitCoreProvider.java:157)
	DEBUG_FRAME = org.apache.maven.surefire.booter.ForkedBooter.invokeProviderInSameClassLoader(ForkedBooter.java:386)
	DEBUG_FRAME = org.apache.maven.surefire.booter.ForkedBooter.runSuitesInProcess(ForkedBooter.java:323)
	DEBUG_FRAME = org.apache.maven.surefire.booter.ForkedBooter.main(ForkedBooter.java:143)

15:51:17,632 DEBUG [main] AxisOperation:485 - Entry: AxisOperation::getInputAction
15:51:17,632 DEBUG [main] AxisOperation:490 - Debug: AxisOperation::getInputAction - using soapAction
15:51:17,632 DEBUG [main] AxisOperation:506 - Exit: AxisOperation::getInputAction urn:getTestInstanceById
15:51:17,632 DEBUG [main] AxisService:872 - mapActionToOperation: Mapping Action to Operation: action: urn:getTestInstanceById; operation: org.apache.axis2.description.OutInAxisOperation@6ccd6981named: {http://trm.ws.gazelletest.tm.gazelle.ihe.net/}getTestInstanceById
15:51:17,632 DEBUG [main] AxisService:878 - DEBUG_FRAME = org.apache.axis2.util.JavaUtils.callStackToString(JavaUtils.java:564)
	DEBUG_FRAME = org.apache.axis2.description.AxisService.mapActionToOperation(AxisService.java:878)
	DEBUG_FRAME = org.apache.axis2.description.AxisService.addOperation(AxisService.java:728)
	DEBUG_FRAME = net.ihe.gazelle.ws.client.GazelleTRMServiceStub.populateAxisService(GazelleTRMServiceStub.java:124)
	DEBUG_FRAME = net.ihe.gazelle.ws.client.GazelleTRMServiceStub.<init>(GazelleTRMServiceStub.java:40)
	DEBUG_FRAME = net.ihe.gazelle.ws.client.GazelleTRMServiceStub.<init>(GazelleTRMServiceStub.java:29)
	DEBUG_FRAME = net.ihe.gazelle.ws.client.GazelleTRMServiceStub.<init>(GazelleTRMServiceStub.java:75)
	DEBUG_FRAME = net.ihe.gazelle.ws.client.GazelleTRMServiceClient.<init>(GazelleTRMServiceClient.java:11)
	DEBUG_FRAME = net.ihe.gazelle.wstester.xdstools.ws.Xdstools.getNonce(Xdstools.java:61)
	DEBUG_FRAME = net.ihe.gazelle.wstester.xdstools.Ws.noNonceReturned(Ws.java:79)
	DEBUG_FRAME = sun.reflect.NativeMethodAccessorImpl.invoke0(Native Method)
	DEBUG_FRAME = sun.reflect.NativeMethodAccessorImpl.invoke(NativeMethodAccessorImpl.java:62)
	DEBUG_FRAME = sun.reflect.DelegatingMethodAccessorImpl.invoke(DelegatingMethodAccessorImpl.java:43)
	DEBUG_FRAME = java.lang.reflect.Method.invoke(Method.java:498)
	DEBUG_FRAME = org.junit.internal.runners.TestMethod.invoke(TestMethod.java:66)
	DEBUG_FRAME = org.powermock.modules.junit4.internal.impl.PowerMockJUnit44RunnerDelegateImpl$PowerMockJUnit44MethodRunner.runTestMethod(PowerMockJUnit44RunnerDelegateImpl.java:310)
	DEBUG_FRAME = org.junit.internal.runners.MethodRoadie$2.run(MethodRoadie.java:86)
	DEBUG_FRAME = org.junit.internal.runners.MethodRoadie.runBeforesThenTestThenAfters(MethodRoadie.java:94)
	DEBUG_FRAME = org.powermock.modules.junit4.internal.impl.PowerMockJUnit44RunnerDelegateImpl$PowerMockJUnit44MethodRunner.executeTest(PowerMockJUnit44RunnerDelegateImpl.java:294)
	DEBUG_FRAME = org.powermock.modules.junit4.internal.impl.PowerMockJUnit47RunnerDelegateImpl$PowerMockJUnit47MethodRunner.executeTestInSuper(PowerMockJUnit47RunnerDelegateImpl.java:127)
	DEBUG_FRAME = org.powermock.modules.junit4.internal.impl.PowerMockJUnit47RunnerDelegateImpl$PowerMockJUnit47MethodRunner.executeTest(PowerMockJUnit47RunnerDelegateImpl.java:82)
	DEBUG_FRAME = org.powermock.modules.junit4.internal.impl.PowerMockJUnit44RunnerDelegateImpl$PowerMockJUnit44MethodRunner.runBeforesThenTestThenAfters(PowerMockJUnit44RunnerDelegateImpl.java:282)
	DEBUG_FRAME = org.junit.internal.runners.MethodRoadie.runTest(MethodRoadie.java:84)
	DEBUG_FRAME = org.junit.internal.runners.MethodRoadie.run(MethodRoadie.java:49)
	DEBUG_FRAME = org.powermock.modules.junit4.internal.impl.PowerMockJUnit44RunnerDelegateImpl.invokeTestMethod(PowerMockJUnit44RunnerDelegateImpl.java:207)
	DEBUG_FRAME = org.powermock.modules.junit4.internal.impl.PowerMockJUnit44RunnerDelegateImpl.runMethods(PowerMockJUnit44RunnerDelegateImpl.java:146)
	DEBUG_FRAME = org.powermock.modules.junit4.internal.impl.PowerMockJUnit44RunnerDelegateImpl$1.run(PowerMockJUnit44RunnerDelegateImpl.java:120)
	DEBUG_FRAME = org.junit.internal.runners.ClassRoadie.runUnprotected(ClassRoadie.java:34)
	DEBUG_FRAME = org.junit.internal.runners.ClassRoadie.runProtected(ClassRoadie.java:44)
	DEBUG_FRAME = org.powermock.modules.junit4.internal.impl.PowerMockJUnit44RunnerDelegateImpl.run(PowerMockJUnit44RunnerDelegateImpl.java:118)
	DEBUG_FRAME = org.powermock.modules.junit4.common.internal.impl.JUnit4TestSuiteChunkerImpl.run(JUnit4TestSuiteChunkerImpl.java:101)
	DEBUG_FRAME = org.powermock.modules.junit4.common.internal.impl.AbstractCommonPowerMockRunner.run(AbstractCommonPowerMockRunner.java:53)
	DEBUG_FRAME = org.powermock.modules.junit4.PowerMockRunner.run(PowerMockRunner.java:53)
	DEBUG_FRAME = org.junit.runners.Suite.runChild(Suite.java:128)
	DEBUG_FRAME = org.junit.runners.Suite.runChild(Suite.java:24)
	DEBUG_FRAME = org.junit.runners.ParentRunner$3.run(ParentRunner.java:193)
	DEBUG_FRAME = org.junit.runners.ParentRunner$1.schedule(ParentRunner.java:52)
	DEBUG_FRAME = org.junit.runners.ParentRunner.runChildren(ParentRunner.java:191)
	DEBUG_FRAME = org.junit.runners.ParentRunner.access$000(ParentRunner.java:42)
	DEBUG_FRAME = org.junit.runners.ParentRunner$2.evaluate(ParentRunner.java:184)
	DEBUG_FRAME = org.junit.runners.ParentRunner.run(ParentRunner.java:236)
	DEBUG_FRAME = org.junit.runners.Suite.runChild(Suite.java:128)
	DEBUG_FRAME = org.junit.runners.Suite.runChild(Suite.java:24)
	DEBUG_FRAME = org.junit.runners.ParentRunner$3.run(ParentRunner.java:193)
	DEBUG_FRAME = org.junit.runners.ParentRunner$1.schedule(ParentRunner.java:52)
	DEBUG_FRAME = org.junit.runners.ParentRunner.runChildren(ParentRunner.java:191)
	DEBUG_FRAME = org.junit.runners.ParentRunner.access$000(ParentRunner.java:42)
	DEBUG_FRAME = org.junit.runners.ParentRunner$2.evaluate(ParentRunner.java:184)
	DEBUG_FRAME = org.junit.runners.ParentRunner.run(ParentRunner.java:236)
	DEBUG_FRAME = org.apache.maven.surefire.junitcore.JUnitCore.run(JUnitCore.java:55)
	DEBUG_FRAME = org.apache.maven.surefire.junitcore.JUnitCoreWrapper.createRequestAndRun(JUnitCoreWrapper.java:137)
	DEBUG_FRAME = org.apache.maven.surefire.junitcore.JUnitCoreWrapper.executeEager(JUnitCoreWrapper.java:107)
	DEBUG_FRAME = org.apache.maven.surefire.junitcore.JUnitCoreWrapper.execute(JUnitCoreWrapper.java:83)
	DEBUG_FRAME = org.apache.maven.surefire.junitcore.JUnitCoreWrapper.execute(JUnitCoreWrapper.java:75)
	DEBUG_FRAME = org.apache.maven.surefire.junitcore.JUnitCoreProvider.invoke(JUnitCoreProvider.java:157)
	DEBUG_FRAME = org.apache.maven.surefire.booter.ForkedBooter.invokeProviderInSameClassLoader(ForkedBooter.java:386)
	DEBUG_FRAME = org.apache.maven.surefire.booter.ForkedBooter.runSuitesInProcess(ForkedBooter.java:323)
	DEBUG_FRAME = org.apache.maven.surefire.booter.ForkedBooter.main(ForkedBooter.java:143)

15:51:17,642 DEBUG [main] AbstractContext:55 - OnDemandLogger initialized for class org.apache.axis2.context.AbstractContext is:org.apache.commons.logging.impl.Log4JLogger@5c4125a0
15:51:17,649 DEBUG [main] Loader:132 - Trying to find [org/apache/axis2/deployment/axis2_default.xml] using org.powermock.core.classloader.MockClassLoader@5aa62ee7 class loader.
15:51:17,664 DEBUG [main] StAXUtils:489 - About to create XMLInputFactory implementation with classloader=org.powermock.core.classloader.MockClassLoader@5aa62ee7
15:51:17,664 DEBUG [main] StAXUtils:491 - The classloader for javax.xml.stream.XMLInputFactory is: org.powermock.core.classloader.MockClassLoader@5aa62ee7
15:51:17,682 DEBUG [main] StAXDialectDetector:256 - StAX implementation at jar:file:/home/jenkins/.m2/repository/org/codehaus/woodstox/woodstox-core-asl/4.1.1/woodstox-core-asl-4.1.1.jar!/ is:
  Title:         Woodstox XML-processor
  Symbolic name: woodstox-core-asl
  Vendor:        http://woodstox.codehaus.org
  Version:       4.1.1
15:51:17,687 DEBUG [main] StAXDialectDetector:218 - Detected StAX dialect: Woodstox 4.x [WSTX-276]
15:51:17,688 DEBUG [main] StAXUtils:513 - Created XMLInputFactory = class org.apache.axiom.util.stax.wrapper.ImmutableXMLInputFactory with classloader=org.powermock.core.classloader.MockClassLoader@5aa62ee7
15:51:17,688 DEBUG [main] StAXUtils:515 - Configuration = DEFAULT
15:51:17,688 DEBUG [main] StAXUtils:516 - Size of XMLInputFactory map for this configuration = 1
15:51:17,688 DEBUG [main] StAXUtils:517 - Configurations for which factories have been cached = [DEFAULT]
15:51:17,725 DEBUG [main] StAXUtils:210 - XMLStreamReader is org.apache.axiom.util.stax.dialect.Woodstox4StreamReaderWrapper
15:51:17,923 DEBUG [main] AxiomContainerSupport:172 - Builder is already complete.
15:51:17,974 DEBUG [main] Phase:98 - Handler RequestURIBasedDispatcher added to Phase Transport
15:51:17,978 DEBUG [main] Phase:98 - Handler SOAPActionBasedDispatcher added to Phase Transport
15:51:17,980 DEBUG [main] Phase:98 - Handler AddressingBasedDispatcher added to Phase Addressing
15:51:17,983 DEBUG [main] Phase:98 - Handler RequestURIBasedDispatcher added to Phase Dispatch
15:51:17,983 DEBUG [main] Phase:98 - Handler SOAPActionBasedDispatcher added to Phase Dispatch
15:51:17,985 DEBUG [main] Phase:98 - Handler RequestURIOperationDispatcher added to Phase Dispatch
15:51:17,986 DEBUG [main] Phase:98 - Handler SOAPMessageBodyBasedDispatcher added to Phase Dispatch
15:51:17,988 DEBUG [main] Phase:98 - Handler HTTPLocationBasedDispatcher added to Phase Dispatch
15:51:17,989 DEBUG [main] Phase:98 - Handler RequestURIBasedDispatcher added to Phase Transport
15:51:17,989 DEBUG [main] Phase:98 - Handler SOAPActionBasedDispatcher added to Phase Transport
15:51:17,989 DEBUG [main] Phase:98 - Handler AddressingBasedDispatcher added to Phase Addressing
15:51:17,990 DEBUG [main] Phase:98 - Handler RequestURIBasedDispatcher added to Phase Dispatch
15:51:17,990 DEBUG [main] Phase:98 - Handler SOAPActionBasedDispatcher added to Phase Dispatch
15:51:17,990 DEBUG [main] Phase:98 - Handler RequestURIOperationDispatcher added to Phase Dispatch
15:51:17,990 DEBUG [main] Phase:98 - Handler SOAPMessageBodyBasedDispatcher added to Phase Dispatch
15:51:17,990 DEBUG [main] Phase:98 - Handler HTTPLocationBasedDispatcher added to Phase Dispatch
15:51:18,014 DEBUG [main] Loader:256 - java.lang.ClassNotFoundException: org.apache.axis2.jaxws.framework.JAXWSServiceBuilderExtension
15:51:18,015  WARN [main] AxisConfigBuilder:442 - Unable to instantiate deployer org.apache.axis2.deployment.ServiceDeployer; see debug logs for more details
15:51:18,016 DEBUG [main] AxisConfigBuilder:444 - org.apache.axis2.jaxws.framework.JAXWSServiceBuilderExtension
java.lang.ClassNotFoundException: org.apache.axis2.jaxws.framework.JAXWSServiceBuilderExtension
	at java.net.URLClassLoader.findClass(URLClassLoader.java:382)
	at java.lang.ClassLoader.loadClass(ClassLoader.java:424)
	at sun.misc.Launcher$AppClassLoader.loadClass(Launcher.java:349)
	at java.lang.ClassLoader.loadClass(ClassLoader.java:357)
	at org.powermock.core.classloader.MockClassLoader.loadModifiedClass(MockClassLoader.java:145)
	at org.powermock.core.classloader.DeferSupportingClassLoader.loadClass(DeferSupportingClassLoader.java:67)
	at java.lang.ClassLoader.loadClass(ClassLoader.java:357)
	at java.lang.Class.forName0(Native Method)
	at java.lang.Class.forName(Class.java:264)
	at org.apache.axis2.util.Loader.loadClass(Loader.java:261)
	at org.apache.axis2.deployment.AxisConfigBuilder.processDeployers(AxisConfigBuilder.java:434)
	at org.apache.axis2.deployment.AxisConfigBuilder.populateConfig(AxisConfigBuilder.java:275)
	at org.apache.axis2.deployment.DeploymentEngine.populateAxisConfiguration(DeploymentEngine.java:629)
	at org.apache.axis2.deployment.FileSystemConfigurator.getAxisConfiguration(FileSystemConfigurator.java:116)
	at org.apache.axis2.context.ConfigurationContextFactory.createConfigurationContext(ConfigurationContextFactory.java:64)
	at org.apache.axis2.context.ConfigurationContextFactory.createConfigurationContextFromFileSystem(ConfigurationContextFactory.java:210)
	at org.apache.axis2.client.ServiceClient.configureServiceClient(ServiceClient.java:150)
	at org.apache.axis2.client.ServiceClient.<init>(ServiceClient.java:143)
	at net.ihe.gazelle.ws.client.GazelleTRMServiceStub.<init>(GazelleTRMServiceStub.java:43)
	at net.ihe.gazelle.ws.client.GazelleTRMServiceStub.<init>(GazelleTRMServiceStub.java:29)
	at net.ihe.gazelle.ws.client.GazelleTRMServiceStub.<init>(GazelleTRMServiceStub.java:75)
	at net.ihe.gazelle.ws.client.GazelleTRMServiceClient.<init>(GazelleTRMServiceClient.java:11)
	at net.ihe.gazelle.wstester.xdstools.ws.Xdstools.getNonce(Xdstools.java:61)
	at net.ihe.gazelle.wstester.xdstools.Ws.noNonceReturned(Ws.java:79)
	at sun.reflect.NativeMethodAccessorImpl.invoke0(Native Method)
	at sun.reflect.NativeMethodAccessorImpl.invoke(NativeMethodAccessorImpl.java:62)
	at sun.reflect.DelegatingMethodAccessorImpl.invoke(DelegatingMethodAccessorImpl.java:43)
	at java.lang.reflect.Method.invoke(Method.java:498)
	at org.junit.internal.runners.TestMethod.invoke(TestMethod.java:66)
	at org.powermock.modules.junit4.internal.impl.PowerMockJUnit44RunnerDelegateImpl$PowerMockJUnit44MethodRunner.runTestMethod(PowerMockJUnit44RunnerDelegateImpl.java:310)
	at org.junit.internal.runners.MethodRoadie$2.run(MethodRoadie.java:86)
	at org.junit.internal.runners.MethodRoadie.runBeforesThenTestThenAfters(MethodRoadie.java:94)
	at org.powermock.modules.junit4.internal.impl.PowerMockJUnit44RunnerDelegateImpl$PowerMockJUnit44MethodRunner.executeTest(PowerMockJUnit44RunnerDelegateImpl.java:294)
	at org.powermock.modules.junit4.internal.impl.PowerMockJUnit47RunnerDelegateImpl$PowerMockJUnit47MethodRunner.executeTestInSuper(PowerMockJUnit47RunnerDelegateImpl.java:127)
	at org.powermock.modules.junit4.internal.impl.PowerMockJUnit47RunnerDelegateImpl$PowerMockJUnit47MethodRunner.executeTest(PowerMockJUnit47RunnerDelegateImpl.java:82)
	at org.powermock.modules.junit4.internal.impl.PowerMockJUnit44RunnerDelegateImpl$PowerMockJUnit44MethodRunner.runBeforesThenTestThenAfters(PowerMockJUnit44RunnerDelegateImpl.java:282)
	at org.junit.internal.runners.MethodRoadie.runTest(MethodRoadie.java:84)
	at org.junit.internal.runners.MethodRoadie.run(MethodRoadie.java:49)
	at org.powermock.modules.junit4.internal.impl.PowerMockJUnit44RunnerDelegateImpl.invokeTestMethod(PowerMockJUnit44RunnerDelegateImpl.java:207)
	at org.powermock.modules.junit4.internal.impl.PowerMockJUnit44RunnerDelegateImpl.runMethods(PowerMockJUnit44RunnerDelegateImpl.java:146)
	at org.powermock.modules.junit4.internal.impl.PowerMockJUnit44RunnerDelegateImpl$1.run(PowerMockJUnit44RunnerDelegateImpl.java:120)
	at org.junit.internal.runners.ClassRoadie.runUnprotected(ClassRoadie.java:34)
	at org.junit.internal.runners.ClassRoadie.runProtected(ClassRoadie.java:44)
	at org.powermock.modules.junit4.internal.impl.PowerMockJUnit44RunnerDelegateImpl.run(PowerMockJUnit44RunnerDelegateImpl.java:118)
	at org.powermock.modules.junit4.common.internal.impl.JUnit4TestSuiteChunkerImpl.run(JUnit4TestSuiteChunkerImpl.java:101)
	at org.powermock.modules.junit4.common.internal.impl.AbstractCommonPowerMockRunner.run(AbstractCommonPowerMockRunner.java:53)
	at org.powermock.modules.junit4.PowerMockRunner.run(PowerMockRunner.java:53)
	at org.junit.runners.Suite.runChild(Suite.java:128)
	at org.junit.runners.Suite.runChild(Suite.java:24)
	at org.junit.runners.ParentRunner$3.run(ParentRunner.java:193)
	at org.junit.runners.ParentRunner$1.schedule(ParentRunner.java:52)
	at org.junit.runners.ParentRunner.runChildren(ParentRunner.java:191)
	at org.junit.runners.ParentRunner.access$000(ParentRunner.java:42)
	at org.junit.runners.ParentRunner$2.evaluate(ParentRunner.java:184)
	at org.junit.runners.ParentRunner.run(ParentRunner.java:236)
	at org.junit.runners.Suite.runChild(Suite.java:128)
	at org.junit.runners.Suite.runChild(Suite.java:24)
	at org.junit.runners.ParentRunner$3.run(ParentRunner.java:193)
	at org.junit.runners.ParentRunner$1.schedule(ParentRunner.java:52)
	at org.junit.runners.ParentRunner.runChildren(ParentRunner.java:191)
	at org.junit.runners.ParentRunner.access$000(ParentRunner.java:42)
	at org.junit.runners.ParentRunner$2.evaluate(ParentRunner.java:184)
	at org.junit.runners.ParentRunner.run(ParentRunner.java:236)
	at org.apache.maven.surefire.junitcore.JUnitCore.run(JUnitCore.java:55)
	at org.apache.maven.surefire.junitcore.JUnitCoreWrapper.createRequestAndRun(JUnitCoreWrapper.java:137)
	at org.apache.maven.surefire.junitcore.JUnitCoreWrapper.executeEager(JUnitCoreWrapper.java:107)
	at org.apache.maven.surefire.junitcore.JUnitCoreWrapper.execute(JUnitCoreWrapper.java:83)
	at org.apache.maven.surefire.junitcore.JUnitCoreWrapper.execute(JUnitCoreWrapper.java:75)
	at org.apache.maven.surefire.junitcore.JUnitCoreProvider.invoke(JUnitCoreProvider.java:157)
	at org.apache.maven.surefire.booter.ForkedBooter.invokeProviderInSameClassLoader(ForkedBooter.java:386)
	at org.apache.maven.surefire.booter.ForkedBooter.runSuitesInProcess(ForkedBooter.java:323)
	at org.apache.maven.surefire.booter.ForkedBooter.main(ForkedBooter.java:143)
15:51:18,049 DEBUG [main] AxisConfiguration:486 - Adding service to allServices map: [GazelleTRMService1564753877455_1] 
15:51:18,052 DEBUG [main] AxisOperation:567 - AxisOperation::getSoapAction urn:anonRobustOp
15:51:18,053 DEBUG [main] AxisOperation:567 - AxisOperation::getSoapAction urn:anonOutonlyOp
15:51:18,053 DEBUG [main] AxisOperation:567 - AxisOperation::getSoapAction urn:getSystemIsATool
15:51:18,053 DEBUG [main] AxisOperation:567 - AxisOperation::getSoapAction urn:anonOutInOp
15:51:18,054 DEBUG [main] AxisOperation:567 - AxisOperation::getSoapAction urn:getTestInstancesByTestingSession
15:51:18,054 DEBUG [main] AxisOperation:567 - AxisOperation::getSoapAction urn:getTestInstanceById
15:51:18,054 DEBUG [main] AxisOperation:567 - AxisOperation::getSoapAction urn:anonRobustOp
15:51:18,054 DEBUG [main] AxisOperation:567 - AxisOperation::getSoapAction urn:anonOutonlyOp
15:51:18,054 DEBUG [main] AxisOperation:567 - AxisOperation::getSoapAction urn:getSystemIsATool
15:51:18,054 DEBUG [main] AxisOperation:567 - AxisOperation::getSoapAction urn:anonOutInOp
15:51:18,054 DEBUG [main] AxisOperation:567 - AxisOperation::getSoapAction urn:getTestInstancesByTestingSession
15:51:18,054 DEBUG [main] AxisOperation:567 - AxisOperation::getSoapAction urn:getTestInstanceById
15:51:18,055 DEBUG [main] AxisConfiguration:396 - Adding service to allEndpoints map: (GazelleTRMService1564753877455_1,GazelleTRMService1564753877455_1HttpSoap11Endpoint) 
15:51:18,056 DEBUG [main] AxisConfiguration:396 - Adding service to allEndpoints map: (GazelleTRMService1564753877455_1,GazelleTRMService1564753877455_1HttpEndpoint) 
15:51:18,056 DEBUG [main] AxisConfiguration:396 - Adding service to allEndpoints map: (GazelleTRMService1564753877455_1,GazelleTRMService1564753877455_1HttpSoap12Endpoint) 
15:51:18,056 DEBUG [main] AxisConfiguration:403 - After adding to allEndpoints map, size is 3
15:51:18,062 DEBUG [main] AxisService:1971 - Get operation for {http://trm.ws.gazelletest.tm.gazelle.ihe.net/}getTestInstanceById
15:51:18,063 DEBUG [main] AxisService:2014 - Found axis operation:  org.apache.axis2.description.OutInAxisOperation@6ccd6981
15:51:18,064 DEBUG [main] Options:589 - setAction Old action is (null)
15:51:18,064 DEBUG [main] Options:590 - setAction New action is (http://trm.ws.gazelletest.tm.gazelle.ihe.net/gazelleTRM/getTestInstanceById)
15:51:18,077 DEBUG [main] ConfigurationContext:55 - OnDemandLogger initialized for class org.apache.axis2.context.ConfigurationContext is:org.apache.commons.logging.impl.Log4JLogger@b6be66a
15:51:18,078 DEBUG [main] ConfigurationContext:85 - registerOperationContext (false): org.apache.axis2.context.OperationContext@7c4e97bd with key: urn:uuid:1d47e2c3-2c80-4f0b-ada4-6097a5c618ee
15:51:18,078 DEBUG [main] OutInAxisOperationClient:164 - Entry: OutInAxisOperationClient::execute, true
15:51:18,078 DEBUG [main] Options:246 - getAction (null) from org.apache.axis2.client.Options@a946954
15:51:18,078 DEBUG [main] MessageContext:1119 - SoapAction is (null)
15:51:18,079 DEBUG [main] Options:246 - getAction (http://trm.ws.gazelletest.tm.gazelle.ihe.net/gazelleTRM/getTestInstanceById) from org.apache.axis2.client.Options@fb17f1b
15:51:18,079 DEBUG [main] Options:246 - getAction (null) from org.apache.axis2.client.Options@a946954
15:51:18,079 DEBUG [main] MessageContext:1524 - Old SoapAction is (null)
15:51:18,079 DEBUG [main] MessageContext:1525 - New SoapAction is (http://trm.ws.gazelletest.tm.gazelle.ihe.net/gazelleTRM/getTestInstanceById)
15:51:18,079 DEBUG [main] Options:589 - setAction Old action is (null)
15:51:18,079 DEBUG [main] Options:590 - setAction New action is (http://trm.ws.gazelletest.tm.gazelle.ihe.net/gazelleTRM/getTestInstanceById)
15:51:18,085 DEBUG [main] ProjectResourceBundle:236 - getBundle(org.apache.axis2,org.apache.axis2.i18n,resource,null,...)
15:51:18,095 DEBUG [main] ProjectResourceBundle:412 - loadBundle: Ignoring MissingResourceException: Can't find bundle for base name org.apache.axis2.resource, locale en_GB
15:51:18,095 DEBUG [main] ProjectResourceBundle:289 - Created org.apache.axis2.i18n.resource, linked to parent null
15:51:18,097 DEBUG [main] ProjectResourceBundle:236 - getBundle(org.apache.axis2,org.apache.axis2.i18n,resource,null,...)
15:51:18,097 DEBUG [main] ProjectResourceBundle:70 - org.apache.axis2.i18n.resource::handleGetObject(cannotInferTransport)
15:51:18,097 ERROR [main] ClientUtils:80 - The system cannot infer the transport information from the null/gazelle-tm-ejb/GazelleTRMService/gazelleTRM URL.
15:51:18,098 DEBUG [main] ProjectResourceBundle:70 - org.apache.axis2.i18n.resource::handleGetObject(cannotInferTransport)
15:51:18,100 ERROR [main] Xdstools:91 - The system cannot infer the transport information from the null/gazelle-tm-ejb/GazelleTRMService/gazelleTRM URL.
[INFO] Tests run: 2, Failures: 0, Errors: 0, Skipped: 0, Time elapsed: 1.177 s - in net.ihe.gazelle.wstester.xdstools.Ws
[INFO] Running net.ihe.gazelle.wstester.model.GwtTestStepResultTest
[INFO] Tests run: 3, Failures: 0, Errors: 0, Skipped: 0, Time elapsed: 0 s - in net.ihe.gazelle.wstester.model.GwtTestStepResultTest
[INFO] 
[INFO] Results:
[INFO] 
[INFO] Tests run: 21, Failures: 0, Errors: 0, Skipped: 0
[INFO] 
[JENKINS] Recording test results
Aug 02, 2019 3:51:20 PM org.jenkinsci.remoting.util.AnonymousClassWarnings warn
WARNING: Attempt to (de-)serialize anonymous class hudson.maven.reporters.SurefireArchiver$2; see: https://jenkins.io/redirect/serialization-of-anonymous-classes/
[INFO] 
[INFO] --- jacoco-maven-plugin:0.7.9:report (post-unit-test) @ gazelle-webservice-tester-ejb ---
[INFO] Loading execution data file /home/jenkins/.hudson/jobs/gazelle-webservice-tester-nbt/workspace/gazelle-webservice-tester-ejb/target/jacoco.exec
[INFO] Analyzed bundle 'gazelle-webservice-tester - EJB - JAR' with 160 classes
[INFO] 
[INFO] --- jacoco-maven-plugin:0.7.9:report (default-report) @ gazelle-webservice-tester-ejb ---
[INFO] Loading execution data file /home/jenkins/.hudson/jobs/gazelle-webservice-tester-nbt/workspace/gazelle-webservice-tester-ejb/target/jacoco.exec
[INFO] Analyzed bundle 'gazelle-webservice-tester - EJB - JAR' with 160 classes
[INFO] 
[INFO] --- maven-ejb-plugin:2.3:ejb (default-ejb) @ gazelle-webservice-tester-ejb ---
[INFO] Building EJB gazelle-webservice-tester-ejb with EJB version 3.0
[INFO] Building jar: /home/jenkins/.hudson/jobs/gazelle-webservice-tester-nbt/workspace/gazelle-webservice-tester-ejb/target/gazelle-webservice-tester-ejb.jar
[INFO] 
[INFO] --- maven-source-plugin:3.0.1:jar-no-fork (attach-sources) @ gazelle-webservice-tester-ejb ---
[INFO] Building jar: /home/jenkins/.hudson/jobs/gazelle-webservice-tester-nbt/workspace/gazelle-webservice-tester-ejb/target/gazelle-webservice-tester-ejb-sources.jar
[INFO] 
[INFO] --- maven-jar-plugin:2.6:test-jar (default) @ gazelle-webservice-tester-ejb ---
[INFO] Building jar: /home/jenkins/.hudson/jobs/gazelle-webservice-tester-nbt/workspace/gazelle-webservice-tester-ejb/target/gazelle-webservice-tester-ejb-tests.jar