SuccessConsole Output

Started calculate disk usage of build
Finished Calculation of disk usage of build in 0 seconds
Started calculate disk usage of workspace
Finished Calculation of disk usage of workspace in 0 seconds
[INFO] 
[INFO] ------------------------------------------------------------------------
[INFO] Building gazelle-x-validation-core 1.4.0-SNAPSHOT
[INFO] ------------------------------------------------------------------------
[INFO] 
[INFO] --- maven-clean-plugin:3.0.0:clean (default-clean) @ gazelle-x-validation-core ---
[INFO] 
[INFO] --- maven-enforcer-plugin:1.2:enforce (enforce-java-version) @ gazelle-x-validation-core ---
[INFO] 
[INFO] --- maven-enforcer-plugin:1.2:enforce (enforce-maven-version) @ gazelle-x-validation-core ---
[INFO] 
[INFO] --- buildnumber-maven-plugin:1.2:create-timestamp (get-build-timestamp) @ gazelle-x-validation-core ---
[INFO] 
[INFO] --- buildnumber-maven-plugin:1.2:create (get-scm-revision) @ gazelle-x-validation-core ---
[INFO] 
[INFO] --- maven-buildmetadata-plugin:1.1.0.IHE.3:provide-buildmetadata (default) @ gazelle-x-validation-core ---
[INFO] Executing: /bin/sh -c cd /home/jenkins/.hudson/jobs/gazelle-x-validation-nbt/workspace/gazelle-x-validation-core && svn --non-interactive log -v -r '{2019-01-29 12:14:39 +0000}:{2019-03-01 12:14:39 +0000}' svn+ssh://scm.gforge.inria.fr/svn/gazelle/Maven/gazelle-x-validation/trunk/gazelle-x-validation-core
[INFO] Working directory: /home/jenkins/.hudson/jobs/gazelle-x-validation-nbt/workspace/gazelle-x-validation-core
[INFO] Executing: /bin/sh -c cd /home/jenkins/.hudson/jobs/gazelle-x-validation-nbt/workspace/gazelle-x-validation-core && svn --non-interactive status
[INFO] Working directory: /home/jenkins/.hudson/jobs/gazelle-x-validation-nbt/workspace/gazelle-x-validation-core
[INFO] Writing properties '/home/jenkins/.hudson/jobs/gazelle-x-validation-nbt/workspace/gazelle-x-validation-core/target/classes/META-INF/build.properties'...
[INFO] Writing XML report '/home/jenkins/.hudson/jobs/gazelle-x-validation-nbt/workspace/gazelle-x-validation-core/target/buildmetadata.xml'...
[INFO] 
[INFO] --- jacoco-maven-plugin:0.7.9:prepare-agent (default-prepare-agent) @ gazelle-x-validation-core ---
[INFO] argLine set to -javaagent:/home/jenkins/.m2/repository/org/jacoco/org.jacoco.agent/0.7.9/org.jacoco.agent-0.7.9-runtime.jar=destfile=/home/jenkins/.hudson/jobs/gazelle-x-validation-nbt/workspace/gazelle-x-validation-core/target/jacoco.exec,append=true
[INFO] 
[INFO] --- jacoco-maven-plugin:0.7.9:prepare-agent (default) @ gazelle-x-validation-core ---
[INFO] argLine set to -javaagent:/home/jenkins/.m2/repository/org/jacoco/org.jacoco.agent/0.7.9/org.jacoco.agent-0.7.9-runtime.jar=destfile=/home/jenkins/.hudson/jobs/gazelle-x-validation-nbt/workspace/gazelle-x-validation-core/target/jacoco.exec,append=true
[INFO] 
[INFO] --- maven-resources-plugin:3.0.2:resources (default-resources) @ gazelle-x-validation-core ---
[INFO] Using 'UTF-8' encoding to copy filtered resources.
[INFO] Copying 4 resources
[INFO] 
[INFO] --- maven-compiler-plugin:3.6.1:compile (default-compile) @ gazelle-x-validation-core ---
[INFO] Changes detected - recompiling the module!
[INFO] Compiling 72 source files to /home/jenkins/.hudson/jobs/gazelle-x-validation-nbt/workspace/gazelle-x-validation-core/target/classes
[WARNING] bootstrap class path not set in conjunction with -source 1.7
/home/jenkins/.hudson/jobs/gazelle-x-validation-nbt/workspace/gazelle-x-validation-core/src/main/java/net/ihe/gazelle/xvalidation/core/utils/SVSConsumer.java:[10,47] [deprecation] ApacheHttpClientExecutor in org.jboss.resteasy.client.core.executors has been deprecated
[WARNING] /home/jenkins/.hudson/jobs/gazelle-x-validation-nbt/workspace/gazelle-x-validation-core/src/main/java/net/ihe/gazelle/xvalidation/core/utils/SVSConsumer.java:[10,47] [deprecation] ApacheHttpClientExecutor in org.jboss.resteasy.client.core.executors has been deprecated
[WARNING] /home/jenkins/.hudson/jobs/gazelle-x-validation-nbt/workspace/gazelle-x-validation-core/src/main/java/net/ihe/gazelle/xvalidation/core/utils/SVSConsumer.java:[10,47] [deprecation] ApacheHttpClientExecutor in org.jboss.resteasy.client.core.executors has been deprecated
[WARNING] /home/jenkins/.hudson/jobs/gazelle-x-validation-nbt/workspace/gazelle-x-validation-core/src/main/java/net/ihe/gazelle/xvalidation/core/utils/SVSConsumer.java:[10,47] [deprecation] ApacheHttpClientExecutor in org.jboss.resteasy.client.core.executors has been deprecated
[WARNING] /home/jenkins/.hudson/jobs/gazelle-x-validation-nbt/workspace/gazelle-x-validation-core/src/main/java/net/ihe/gazelle/xvalidation/core/utils/SVSConsumer.java:[29,59] [deprecation] ApacheHttpClientExecutor in org.jboss.resteasy.client.core.executors has been deprecated
[WARNING] /home/jenkins/.hudson/jobs/gazelle-x-validation-nbt/workspace/gazelle-x-validation-core/src/main/java/net/ihe/gazelle/xvalidation/core/utils/GazelleCrossValidatorTransformer.java:[53,5] unreachable catch clause
  thrown type FileNotFoundException has already been caught
[WARNING] /home/jenkins/.hudson/jobs/gazelle-x-validation-nbt/workspace/gazelle-x-validation-core/src/main/java/net/ihe/gazelle/xvalidation/core/utils/GazelleCrossValidatorReportTransformer.java:[55,5] unreachable catch clause
  thrown type FileNotFoundException has already been caught
[INFO] 
[INFO] --- maven-resources-plugin:3.0.2:testResources (default-testResources) @ gazelle-x-validation-core ---
[INFO] Using 'UTF-8' encoding to copy filtered resources.
[INFO] Copying 57 resources
[INFO] 
[INFO] --- maven-compiler-plugin:3.6.1:testCompile (default-testCompile) @ gazelle-x-validation-core ---
[INFO] Changes detected - recompiling the module!
[INFO] Compiling 12 source files to /home/jenkins/.hudson/jobs/gazelle-x-validation-nbt/workspace/gazelle-x-validation-core/target/test-classes
[INFO] 
[INFO] --- maven-surefire-plugin:2.20:test (default-test) @ gazelle-x-validation-core ---
[INFO] 
[INFO] -------------------------------------------------------
[INFO]  T E S T S
[INFO] -------------------------------------------------------
[INFO] Running net.ihe.gazelle.xvalidation.external.test.XOMTest
[INFO] Tests run: 5, Failures: 0, Errors: 0, Skipped: 0, Time elapsed: 1.75 s - in net.ihe.gazelle.xvalidation.external.test.XOMTest
[INFO] Running net.ihe.gazelle.xvalidation.external.test.XPathTest
net.sf.saxon.tree.tiny.TinyElementImpl
net.sf.saxon.tree.tiny.TinyElementImpl
net.sf.saxon.tree.tiny.TinyElementImpl
nb of nodes: 3
nb of nodes: 3
[INFO] Tests run: 3, Failures: 0, Errors: 0, Skipped: 0, Time elapsed: 0.057 s - in net.ihe.gazelle.xvalidation.external.test.XPathTest
[INFO] Running net.ihe.gazelle.xvalidation.core.test.FileConverterTest
INFO  2019-02-28 13:14:50,782 [main] ca.uhn.hl7v2.util.Home: hapi.home is set to /home/jenkins/.hudson/jobs/gazelle-x-validation-nbt/workspace/gazelle-x-validation-core/.
INFO  2019-02-28 13:14:50,814 [main] ca.uhn.hl7v2.VersionLogger: HAPI version is: 2.2
INFO  2019-02-28 13:14:50,819 [main] ca.uhn.hl7v2.VersionLogger: Default Structure libraries found for HL7 versions 2.3, 2.3.1, 2.4, 2.5, 2.5.1, 2.6, 
INFO  2019-02-28 13:14:51,104 [main] net.ihe.gazelle.xvalidation.core.utils.FileConverter: <?xml version="1.0" encoding="UTF-8"?>
<RDE_O11 xmlns="urn:hl7-org:v2xml">
   <MSH>
      <MSH.1>|</MSH.1>
      <MSH.2>^~\&amp;</MSH.2>
      <MSH.3>
         <HD.1>IHE</HD.1>
      </MSH.3>
      <MSH.4>
         <HD.1>EU-CAT2011</HD.1>
      </MSH.4>
      <MSH.7>20110307194153</MSH.7>
      <MSH.9>
         <MSG.1>RDE</MSG.1>
         <MSG.2>O11</MSG.2>
      </MSH.9>
      <MSH.10>MSG00003</MSH.10>
      <MSH.11>
         <PT.1>P</PT.1>
      </MSH.11>
      <MSH.12>
         <VID.1>2.6</VID.1>
      </MSH.12>
      <MSH.18>UTF-8</MSH.18>
   </MSH>
   <RDE_O11.PATIENT>
      <PID>
         <PID.3>
            <CX.1>A9283923889</CX.1>
         </PID.3>
         <PID.5>
            <XPN.1>
               <FN.1>Doe</FN.1>
            </XPN.1>
            <XPN.2>John</XPN.2>
         </PID.5>
         <PID.7>19680306</PID.7>
         <PID.8>M</PID.8>
      </PID>
      <RDE_O11.PATIENT_VISIT>
         <PV1>
            <PV1.2>I</PV1.2>
            <PV1.3>
               <PL.1>Cardiology</PL.1>
               <PL.2>4</PL.2>
               <PL.3>01</PL.3>
               <PL.4>
                  <HD.1>CATEUR_WARDS</HD.1>
                  <HD.3>L</HD.3>
               </PL.4>
            </PV1.3>
            <PV1.19>
               <CX.1>V00001</CX.1>
            </PV1.19>
         </PV1>
      </RDE_O11.PATIENT_VISIT>
      <RDE_O11.INSURANCE>
         <IN1>
            <IN1.1>s</IN1.1>
            <IN1.2>
               <CWE.1>ID001</CWE.1>
               <CWE.2>Full Insurance</CWE.2>
            </IN1.2>
            <IN1.3>
               <CX.1>XXXX</CX.1>
            </IN1.3>
            <IN1.4>
               <XON.1>INSURANCE_Ltd.</XON.1>
            </IN1.4>
         </IN1>
      </RDE_O11.INSURANCE>
   </RDE_O11.PATIENT>
   <RDE_O11.ORDER>
      <ORC>
         <ORC.1>NW</ORC.1>
         <ORC.2>
            <EI.1>PL001</EI.1>
         </ORC.2>
         <ORC.4>
            <EI.1>P001</EI.1>
         </ORC.4>
         <ORC.9>20110414153220</ORC.9>
         <ORC.12>
            <XCN.1>00000999</XCN.1>
            <XCN.2>
               <FN.1>Strangelove</FN.1>
            </XCN.2>
            <XCN.3>Peter</XCN.3>
            <XCN.6>Dr.</XCN.6>
         </ORC.12>
         <ORC.19>
            <XCN.1>P0343874</XCN.1>
            <XCN.2>
               <FN.1>Jansen</FN.1>
            </XCN.2>
            <XCN.3>Patricia</XCN.3>
         </ORC.19>
         <ORC.21>
            <XON.1>Connectathon Europe 2011</XON.1>
            <XON.10>CATEUR2011</XON.10>
         </ORC.21>
         <ORC.22>
            <XAD.1>
               <SAD.1>Casa della Città Leopolda, Piazza Guerrazzi, 56125 Pisa</SAD.1>
            </XAD.1>
         </ORC.22>
         <ORC.23>
            <XTN.1>0039 50 48587</XTN.1>
         </ORC.23>
         <ORC.25>
            <CWE.1>P3;V3</CWE.1>
         </ORC.25>
      </ORC>
      <RDE_O11.TIMING>
         <TQ1>
            <TQ1.1>1</TQ1.1>
            <TQ1.2>
               <CQ.1>2</CQ.1>
               <CQ.2>
                  <CWE.1>Tab</CWE.1>
                  <CWE.2>Tablets</CWE.2>
                  <CWE.3>99FCS</CWE.3>
               </CQ.2>
            </TQ1.2>
            <TQ1.3>
               <RPT.1>
                  <CWE.1>TID</CWE.1>
               </RPT.1>
            </TQ1.3>
         </TQ1>
      </RDE_O11.TIMING>
      <RDE_O11.ORDER_DETAIL>
         <RXO>
            <RXO.1>
               <CWE.1>S0002</CWE.1>
               <CWE.2>Paracetamol</CWE.2>
               <CWE.3>99SCS</CWE.3>
            </RXO.1>
            <RXO.2>500</RXO.2>
            <RXO.4>
               <CWE.1>mg</CWE.1>
               <CWE.2>milligram</CWE.2>
               <CWE.3>99UCS</CWE.3>
            </RXO.4>
            <RXO.5>
               <CWE.1>Tab</CWE.1>
               <CWE.2>Tablets</CWE.2>
               <CWE.3>99FCS</CWE.3>
            </RXO.5>
            <RXO.9>G</RXO.9>
            <RXO.20>
               <CWE.1>J00.0</CWE.1>
               <CWE.2>Cold</CWE.2>
               <CWE.3>I10</CWE.3>
            </RXO.20>
         </RXO>
         <NTE>
            <NTE.1>1</NTE.1>
            <NTE.3>TAKE WITH WATER</NTE.3>
         </NTE>
         <RXR>
            <RXR.1>
               <CWE.1>PO</CWE.1>
            </RXR.1>
            <RXR.2>
               <CWE.1>MOUTH</CWE.1>
            </RXR.2>
         </RXR>
         <RDE_O11.COMPONENT>
            <RXC>
               <RXC.1>B</RXC.1>
               <RXC.2>
                  <CWE.1>N02BE01</CWE.1>
                  <CWE.2>Paracetamol</CWE.2>
                  <CWE.3>ATC</CWE.3>
               </RXC.2>
               <RXC.3>500</RXC.3>
               <RXC.4>
                  <CWE.1>mg</CWE.1>
                  <CWE.2>milligram</CWE.2>
                  <CWE.3>ANS+</CWE.3>
               </RXC.4>
            </RXC>
         </RDE_O11.COMPONENT>
      </RDE_O11.ORDER_DETAIL>
      <RXE>
         <RXE.2>
            <CWE.1>054565</CWE.1>
            <CWE.2>Dafalgan 500 mg tablets</CWE.2>
            <CWE.3>99LCN</CWE.3>
         </RXE.2>
         <RXE.3>2</RXE.3>
         <RXE.6>
            <CWE.1>Tab</CWE.1>
            <CWE.2>Tablets</CWE.2>
            <CWE.3>99FCS</CWE.3>
         </RXE.6>
         <RXE.7>
            <CWE.1>01</CWE.1>
            <CWE.2>Take with Water</CWE.2>
         </RXE.7>
         <RXE.14>
            <XCN.1>P0343874</XCN.1>
            <XCN.2>
               <FN.1>Jansen</FN.1>
            </XCN.2>
            <XCN.3>Patricia</XCN.3>
         </RXE.14>
         <RXE.15>P001</RXE.15>
      </RXE>
      <NTE>
         <NTE.1>1</NTE.1>
         <NTE.3>Prescription Item OK</NTE.3>
         <NTE.4>
            <CWE.1>IA</CWE.1>
            <CWE.2>Prescription item Advice notes</CWE.2>
         </NTE.4>
      </NTE>
      <NTE>
         <NTE.1>2</NTE.1>
         <NTE.3>Prescription OK</NTE.3>
         <NTE.4>
            <CWE.1>PA</CWE.1>
            <CWE.2>Prescription-wide Advice notes</CWE.2>
         </NTE.4>
      </NTE>
      <RDE_O11.TIMING_ENCODED>
         <TQ1>
            <TQ1.1>1</TQ1.1>
            <TQ1.2>
               <CQ.1>1</CQ.1>
               <CQ.2>
                  <CWE.1>Tab</CWE.1>
                  <CWE.2>Tablets</CWE.2>
                  <CWE.3>99FCS</CWE.3>
               </CQ.2>
            </TQ1.2>
            <TQ1.4>070000</TQ1.4>
            <TQ1.4>150000</TQ1.4>
            <TQ1.4>230000</TQ1.4>
            <TQ1.7>20110307</TQ1.7>
         </TQ1>
      </RDE_O11.TIMING_ENCODED>
      <RXR>
         <RXR.1>
            <CWE.1>PO</CWE.1>
         </RXR.1>
         <RXR.2>
            <CWE.1>MOUTH</CWE.1>
         </RXR.2>
      </RXR>
   </RDE_O11.ORDER>
</RDE_O11>

INFO  2019-02-28 13:14:51,303 [main] net.ihe.gazelle.xvalidation.core.utils.FileConverter: <?xml version="1.0" encoding="UTF-8"?>
<dicom>
   <attr len="4" tag="00020000" vr="UL">198</attr>
   <attr len="2" tag="00020001" vr="OB">00\01</attr>
   <attr len="26" tag="00020002" vr="UI">1.2.276.0.7230010.3.1.0.1</attr>
   <attr len="54" tag="00020003" vr="UI">1.2.276.0.7230010.3.1.4.8323329.8634.1410768772.545131</attr>
   <attr len="20" tag="00020010" vr="UI">1.2.840.10008.1.2.1</attr>
   <attr len="28" tag="00020012" vr="UI">1.2.276.0.7230010.3.0.3.6.0</attr>
   <attr len="16" tag="00020013" vr="SH">OFFIS_DCMTK_360</attr>
   <attr len="10" tag="00080005" vr="CS">ISO_IR 192</attr>
   <attr len="6" tag="00080050" vr="SH">00005</attr>
   <attr len="20" tag="00080090" vr="PN">ESSELMAN^HENRY^G^^DR</attr>
   <attr len="0" tag="00081110" vr="SQ"/>
   <attr len="0" tag="00081120" vr="SQ"/>
   <attr len="14" tag="00100010" vr="PN">Romero^Ramón</attr>
   <attr len="10" tag="00100020" vr="LO">DDS-37989</attr>
   <attr len="32" tag="00100021" vr="LO">DDS&amp;1.3.6.1.4.1.12559.11.1.4.1.2</attr>
   <attr len="8" tag="00100030" vr="DA">19990409</attr>
   <attr len="4" tag="00100032" vr="TM">1012</attr>
   <attr len="2" tag="00100040" vr="CS">M</attr>
   <attr len="2" tag="00101030" vr="DS">47</attr>
   <attr len="0" tag="00102000" vr="LO"/>
   <attr len="28" tag="0020000D" vr="UI">1.3.6.1.4.1.12559.11.4.1.1.5</attr>
   <attr len="18" tag="00321032" vr="PN">CHAVEZ^JULIO^^^DR</attr>
   <attr len="0" tag="00321060" vr="LO"/>
   <attr len="64" tag="00321064" vr="SQ">
      <item len="56" off="644">
         <attr len="6" tag="00080100" vr="SH">13120</attr>
         <attr len="6" tag="00080102" vr="SH">IHE99</attr>
         <attr len="20" tag="00080104" vr="LO">Scanned Film Import</attr>
      </item>
   </attr>
   <attr len="2" tag="00380010" vr="LO">17</attr>
   <attr len="36" tag="00380011" vr="LO">IHEPAM&amp;1.3.6.1.4.1.12559.11.1.2.2.5</attr>
   <attr len="22" tag="00380300" vr="LO">2E^210^2^EAST_HOSPITAL</attr>
   <attr len="268" tag="00400100" vr="SQ">
      <item len="260" off="804">
         <attr len="2" tag="00080060" vr="CS">SC</attr>
         <attr len="4" tag="00400001" vr="AE">MINE</attr>
         <attr len="8" tag="00400002" vr="DA">20121107</attr>
         <attr len="4" tag="00400003" vr="TM">1200</attr>
         <attr len="18" tag="00400006" vr="PN">CHAVEZ^JULIO^^^DR</attr>
         <attr len="20" tag="00400007" vr="LO">Scanned Film Import</attr>
         <attr len="130" tag="00400008" vr="SQ">
            <item len="60" off="928">
               <attr len="6" tag="00080100" vr="SH">913120</attr>
               <attr len="6" tag="00080102" vr="SH">99IHE</attr>
               <attr len="24" tag="00080104" vr="LO">SC: Scanned Film Import</attr>
            </item>
            <item len="54" off="996">
               <attr len="6" tag="00080100" vr="SH">789456</attr>
               <attr len="6" tag="00080102" vr="SH">99IHE</attr>
               <attr len="18" tag="00080104" vr="LO">Another procedure</attr>
            </item>
         </attr>
         <attr len="6" tag="00400009" vr="SH">OMSPS5</attr>
      </item>
   </attr>
   <attr len="6" tag="00401001" vr="SH">OMRP5</attr>
   <attr len="0" tag="00401002" vr="LO"/>
   <attr len="4" tag="00401003" vr="SH">STAT</attr>
   <attr len="12" tag="00401004" vr="LO">Not Arranged</attr>
   <attr len="18" tag="00402008" vr="PN">CHAVEZ^JULIO^^^DR</attr>
   <attr len="2" tag="00402009" vr="SH">C</attr>
   <attr len="0" tag="00402010" vr="SH"/>
   <attr len="0" tag="00402016" vr="LO"/>
   <attr len="12" tag="00402017" vr="LO">26^IHE_OM_OF</attr>
   <attr len="12" tag="12341234" vr="LO">unknown tag</attr>
</dicom>

java.lang.instrument.IllegalClassFormatException: Error while instrumenting class com/pixelmed/dicom/DicomDictionary.
	at org.jacoco.agent.rt.internal_8ff85ea.CoverageTransformer.transform(CoverageTransformer.java:93)
	at sun.instrument.TransformerManager.transform(TransformerManager.java:188)
	at sun.instrument.InstrumentationImpl.transform(InstrumentationImpl.java:428)
	at java.lang.ClassLoader.defineClass1(Native Method)
	at java.lang.ClassLoader.defineClass(ClassLoader.java:763)
	at java.security.SecureClassLoader.defineClass(SecureClassLoader.java:142)
	at java.net.URLClassLoader.defineClass(URLClassLoader.java:468)
	at java.net.URLClassLoader.access$100(URLClassLoader.java:74)
	at java.net.URLClassLoader$1.run(URLClassLoader.java:369)
	at java.net.URLClassLoader$1.run(URLClassLoader.java:363)
	at java.security.AccessController.doPrivileged(Native Method)
	at java.net.URLClassLoader.findClass(URLClassLoader.java:362)
	at java.lang.ClassLoader.loadClass(ClassLoader.java:424)
	at sun.misc.Launcher$AppClassLoader.loadClass(Launcher.java:349)
	at java.lang.ClassLoader.loadClass(ClassLoader.java:357)
	at com.pixelmed.dicom.AttributeList.createDictionaryifNecessary(AttributeList.java:247)
	at com.pixelmed.dicom.AttributeList.read(AttributeList.java:490)
	at com.pixelmed.dicom.AttributeList.read(AttributeList.java:1304)
	at com.pixelmed.dicom.AttributeList.read(AttributeList.java:1385)
	at com.pixelmed.dicom.AttributeList.read(AttributeList.java:1353)
	at com.pixelmed.dicom.AttributeList.read(AttributeList.java:1506)
	at net.ihe.gazelle.xvalidation.core.utils.FileConverter.dumpDICOMObjectWithPixelmed(FileConverter.java:109)
	at net.ihe.gazelle.xvalidation.core.utils.FileConverter.dumpDICOMObject(FileConverter.java:100)
	at net.ihe.gazelle.xvalidation.core.test.FileConverterTest.dumpDICOMObjectWithPixelMedTest(FileConverterTest.java:25)
	at sun.reflect.NativeMethodAccessorImpl.invoke0(Native Method)
	at sun.reflect.NativeMethodAccessorImpl.invoke(NativeMethodAccessorImpl.java:62)
	at sun.reflect.DelegatingMethodAccessorImpl.invoke(DelegatingMethodAccessorImpl.java:43)
	at java.lang.reflect.Method.invoke(Method.java:498)
	at org.junit.runners.model.FrameworkMethod$1.runReflectiveCall(FrameworkMethod.java:44)
	at org.junit.internal.runners.model.ReflectiveCallable.run(ReflectiveCallable.java:15)
	at org.junit.runners.model.FrameworkMethod.invokeExplosively(FrameworkMethod.java:41)
	at org.junit.internal.runners.statements.InvokeMethod.evaluate(InvokeMethod.java:20)
	at org.junit.runners.BlockJUnit4ClassRunner.runNotIgnored(BlockJUnit4ClassRunner.java:79)
	at org.junit.runners.BlockJUnit4ClassRunner.runChild(BlockJUnit4ClassRunner.java:71)
	at org.junit.runners.BlockJUnit4ClassRunner.runChild(BlockJUnit4ClassRunner.java:49)
	at org.junit.runners.ParentRunner$3.run(ParentRunner.java:193)
	at org.junit.runners.ParentRunner$1.schedule(ParentRunner.java:52)
	at org.junit.runners.ParentRunner.runChildren(ParentRunner.java:191)
	at org.junit.runners.ParentRunner.access$000(ParentRunner.java:42)
	at org.junit.runners.ParentRunner$2.evaluate(ParentRunner.java:184)
	at org.junit.runners.ParentRunner.run(ParentRunner.java:236)
	at org.junit.runners.Suite.runChild(Suite.java:128)
	at org.junit.runners.Suite.runChild(Suite.java:24)
	at org.junit.runners.ParentRunner$3.run(ParentRunner.java:193)
	at org.junit.runners.ParentRunner$1.schedule(ParentRunner.java:52)
	at org.junit.runners.ParentRunner.runChildren(ParentRunner.java:191)
	at org.junit.runners.ParentRunner.access$000(ParentRunner.java:42)
	at org.junit.runners.ParentRunner$2.evaluate(ParentRunner.java:184)
	at org.junit.runners.ParentRunner.run(ParentRunner.java:236)
	at org.apache.maven.surefire.junitcore.JUnitCore.run(JUnitCore.java:55)
	at org.apache.maven.surefire.junitcore.JUnitCoreWrapper.createRequestAndRun(JUnitCoreWrapper.java:137)
	at org.apache.maven.surefire.junitcore.JUnitCoreWrapper.executeEager(JUnitCoreWrapper.java:107)
	at org.apache.maven.surefire.junitcore.JUnitCoreWrapper.execute(JUnitCoreWrapper.java:83)
	at org.apache.maven.surefire.junitcore.JUnitCoreWrapper.execute(JUnitCoreWrapper.java:75)
	at org.apache.maven.surefire.junitcore.JUnitCoreProvider.invoke(JUnitCoreProvider.java:157)
	at org.apache.maven.surefire.booter.ForkedBooter.invokeProviderInSameClassLoader(ForkedBooter.java:386)
	at org.apache.maven.surefire.booter.ForkedBooter.runSuitesInProcess(ForkedBooter.java:323)
	at org.apache.maven.surefire.booter.ForkedBooter.main(ForkedBooter.java:143)
Caused by: java.io.IOException: Error while instrumenting class com/pixelmed/dicom/DicomDictionary.
	at org.jacoco.agent.rt.internal_8ff85ea.core.instr.Instrumenter.instrumentError(Instrumenter.java:166)
	at org.jacoco.agent.rt.internal_8ff85ea.core.instr.Instrumenter.instrument(Instrumenter.java:117)
	at org.jacoco.agent.rt.internal_8ff85ea.CoverageTransformer.transform(CoverageTransformer.java:91)
	... 57 more
Caused by: java.lang.RuntimeException: Method code too large!
	at org.jacoco.agent.rt.internal_8ff85ea.asm.MethodWriter.getSize(MethodWriter.java:2079)
	at org.jacoco.agent.rt.internal_8ff85ea.asm.ClassWriter.toByteArray(ClassWriter.java:838)
	at org.jacoco.agent.rt.internal_8ff85ea.core.instr.Instrumenter.instrument(Instrumenter.java:91)
	at org.jacoco.agent.rt.internal_8ff85ea.core.instr.Instrumenter.instrument(Instrumenter.java:114)
	... 58 more
java.lang.instrument.IllegalClassFormatException: Error while instrumenting class com/pixelmed/dicom/TagFromName.
	at org.jacoco.agent.rt.internal_8ff85ea.CoverageTransformer.transform(CoverageTransformer.java:93)
	at sun.instrument.TransformerManager.transform(TransformerManager.java:188)
	at sun.instrument.InstrumentationImpl.transform(InstrumentationImpl.java:428)
	at java.lang.ClassLoader.defineClass1(Native Method)
	at java.lang.ClassLoader.defineClass(ClassLoader.java:763)
	at java.security.SecureClassLoader.defineClass(SecureClassLoader.java:142)
	at java.net.URLClassLoader.defineClass(URLClassLoader.java:468)
	at java.net.URLClassLoader.access$100(URLClassLoader.java:74)
	at java.net.URLClassLoader$1.run(URLClassLoader.java:369)
	at java.net.URLClassLoader$1.run(URLClassLoader.java:363)
	at java.security.AccessController.doPrivileged(Native Method)
	at java.net.URLClassLoader.findClass(URLClassLoader.java:362)
	at java.lang.ClassLoader.loadClass(ClassLoader.java:424)
	at sun.misc.Launcher$AppClassLoader.loadClass(Launcher.java:349)
	at java.lang.ClassLoader.loadClass(ClassLoader.java:357)
	at com.pixelmed.dicom.DicomDictionary.createTagList(DicomDictionary.java:29)
	at com.pixelmed.dicom.DicomDictionaryBase.<init>(DicomDictionaryBase.java:66)
	at com.pixelmed.dicom.DicomDictionary.<init>(DicomDictionary.java:21)
	at com.pixelmed.dicom.AttributeList.createDictionaryifNecessary(AttributeList.java:247)
	at com.pixelmed.dicom.AttributeList.read(AttributeList.java:490)
	at com.pixelmed.dicom.AttributeList.read(AttributeList.java:1304)
	at com.pixelmed.dicom.AttributeList.read(AttributeList.java:1385)
	at com.pixelmed.dicom.AttributeList.read(AttributeList.java:1353)
	at com.pixelmed.dicom.AttributeList.read(AttributeList.java:1506)
	at net.ihe.gazelle.xvalidation.core.utils.FileConverter.dumpDICOMObjectWithPixelmed(FileConverter.java:109)
	at net.ihe.gazelle.xvalidation.core.utils.FileConverter.dumpDICOMObject(FileConverter.java:100)
	at net.ihe.gazelle.xvalidation.core.test.FileConverterTest.dumpDICOMObjectWithPixelMedTest(FileConverterTest.java:25)
	at sun.reflect.NativeMethodAccessorImpl.invoke0(Native Method)
	at sun.reflect.NativeMethodAccessorImpl.invoke(NativeMethodAccessorImpl.java:62)
	at sun.reflect.DelegatingMethodAccessorImpl.invoke(DelegatingMethodAccessorImpl.java:43)
	at java.lang.reflect.Method.invoke(Method.java:498)
	at org.junit.runners.model.FrameworkMethod$1.runReflectiveCall(FrameworkMethod.java:44)
	at org.junit.internal.runners.model.ReflectiveCallable.run(ReflectiveCallable.java:15)
	at org.junit.runners.model.FrameworkMethod.invokeExplosively(FrameworkMethod.java:41)
	at org.junit.internal.runners.statements.InvokeMethod.evaluate(InvokeMethod.java:20)
	at org.junit.runners.BlockJUnit4ClassRunner.runNotIgnored(BlockJUnit4ClassRunner.java:79)
	at org.junit.runners.BlockJUnit4ClassRunner.runChild(BlockJUnit4ClassRunner.java:71)
	at org.junit.runners.BlockJUnit4ClassRunner.runChild(BlockJUnit4ClassRunner.java:49)
	at org.junit.runners.ParentRunner$3.run(ParentRunner.java:193)
	at org.junit.runners.ParentRunner$1.schedule(ParentRunner.java:52)
	at org.junit.runners.ParentRunner.runChildren(ParentRunner.java:191)
	at org.junit.runners.ParentRunner.access$000(ParentRunner.java:42)
	at org.junit.runners.ParentRunner$2.evaluate(ParentRunner.java:184)
	at org.junit.runners.ParentRunner.run(ParentRunner.java:236)
	at org.junit.runners.Suite.runChild(Suite.java:128)
	at org.junit.runners.Suite.runChild(Suite.java:24)
	at org.junit.runners.ParentRunner$3.run(ParentRunner.java:193)
	at org.junit.runners.ParentRunner$1.schedule(ParentRunner.java:52)
	at org.junit.runners.ParentRunner.runChildren(ParentRunner.java:191)
	at org.junit.runners.ParentRunner.access$000(ParentRunner.java:42)
	at org.junit.runners.ParentRunner$2.evaluate(ParentRunner.java:184)
	at org.junit.runners.ParentRunner.run(ParentRunner.java:236)
	at org.apache.maven.surefire.junitcore.JUnitCore.run(JUnitCore.java:55)
	at org.apache.maven.surefire.junitcore.JUnitCoreWrapper.createRequestAndRun(JUnitCoreWrapper.java:137)
	at org.apache.maven.surefire.junitcore.JUnitCoreWrapper.executeEager(JUnitCoreWrapper.java:107)
	at org.apache.maven.surefire.junitcore.JUnitCoreWrapper.execute(JUnitCoreWrapper.java:83)
	at org.apache.maven.surefire.junitcore.JUnitCoreWrapper.execute(JUnitCoreWrapper.java:75)
	at org.apache.maven.surefire.junitcore.JUnitCoreProvider.invoke(JUnitCoreProvider.java:157)
	at org.apache.maven.surefire.booter.ForkedBooter.invokeProviderInSameClassLoader(ForkedBooter.java:386)
	at org.apache.maven.surefire.booter.ForkedBooter.runSuitesInProcess(ForkedBooter.java:323)
	at org.apache.maven.surefire.booter.ForkedBooter.main(ForkedBooter.java:143)
Caused by: java.io.IOException: Error while instrumenting class com/pixelmed/dicom/TagFromName.
	at org.jacoco.agent.rt.internal_8ff85ea.core.instr.Instrumenter.instrumentError(Instrumenter.java:166)
	at org.jacoco.agent.rt.internal_8ff85ea.core.instr.Instrumenter.instrument(Instrumenter.java:117)
	at org.jacoco.agent.rt.internal_8ff85ea.CoverageTransformer.transform(CoverageTransformer.java:91)
	... 60 more
Caused by: java.lang.RuntimeException: Method code too large!
	at org.jacoco.agent.rt.internal_8ff85ea.asm.MethodWriter.getSize(MethodWriter.java:2079)
	at org.jacoco.agent.rt.internal_8ff85ea.asm.ClassWriter.toByteArray(ClassWriter.java:838)
	at org.jacoco.agent.rt.internal_8ff85ea.core.instr.Instrumenter.instrument(Instrumenter.java:91)
	at org.jacoco.agent.rt.internal_8ff85ea.core.instr.Instrumenter.instrument(Instrumenter.java:114)
	... 61 more
INFO  2019-02-28 13:14:51,942 [main] net.ihe.gazelle.xvalidation.core.utils.FileConverter: <?xml version="1.0" encoding="UTF-8"?>
<DicomObject>
   <FileMetaInformationGroupLength element="0000" group="0002" vr="UL">
      <value number="1">198</value>
   </FileMetaInformationGroupLength>
   <FileMetaInformationVersion element="0001" group="0002" vr="OB"/>
   <MediaStorageSOPClassUID element="0002" group="0002" vr="UI">
      <value number="1">1.2.276.0.7230010.3.1.0.1</value>
   </MediaStorageSOPClassUID>
   <MediaStorageSOPInstanceUID element="0003" group="0002" vr="UI">
      <value number="1">1.2.276.0.7230010.3.1.4.8323329.8634.1410768772.545131</value>
   </MediaStorageSOPInstanceUID>
   <TransferSyntaxUID element="0010" group="0002" vr="UI">
      <value number="1">1.2.840.10008.1.2.1</value>
   </TransferSyntaxUID>
   <ImplementationClassUID element="0012" group="0002" vr="UI">
      <value number="1">1.2.276.0.7230010.3.0.3.6.0</value>
   </ImplementationClassUID>
   <ImplementationVersionName element="0013" group="0002" vr="SH">
      <value number="1">OFFIS_DCMTK_360</value>
   </ImplementationVersionName>
   <SpecificCharacterSet element="0005" group="0008" vr="CS">
      <value number="1">ISO_IR 192</value>
   </SpecificCharacterSet>
   <AccessionNumber element="0050" group="0008" vr="SH">
      <value number="1">00005</value>
   </AccessionNumber>
   <ReferringPhysicianName element="0090" group="0008" vr="PN">
      <value number="1">ESSELMAN^HENRY^G^^DR</value>
   </ReferringPhysicianName>
   <ReferencedStudySequence element="1110" group="0008" vr="SQ"/>
   <ReferencedPatientSequence element="1120" group="0008" vr="SQ"/>
   <PatientName element="0010" group="0010" vr="PN">
      <value number="1">Romero^Ramón</value>
   </PatientName>
   <PatientID element="0020" group="0010" vr="LO">
      <value number="1">DDS-37989</value>
   </PatientID>
   <IssuerOfPatientID element="0021" group="0010" vr="LO">
      <value number="1">DDS&amp;1.3.6.1.4.1.12559.11.1.4.1.2</value>
   </IssuerOfPatientID>
   <PatientBirthDate element="0030" group="0010" vr="DA">
      <value number="1">19990409</value>
   </PatientBirthDate>
   <PatientBirthTime element="0032" group="0010" vr="TM">
      <value number="1">1012</value>
   </PatientBirthTime>
   <PatientSex element="0040" group="0010" vr="CS">
      <value number="1">M</value>
   </PatientSex>
   <PatientWeight element="1030" group="0010" vr="DS">
      <value number="1">47</value>
   </PatientWeight>
   <MedicalAlerts element="2000" group="0010" vr="LO"/>
   <StudyInstanceUID element="000d" group="0020" vr="UI">
      <value number="1">1.3.6.1.4.1.12559.11.4.1.1.5</value>
   </StudyInstanceUID>
   <RequestingPhysician element="1032" group="0032" vr="PN">
      <value number="1">CHAVEZ^JULIO^^^DR</value>
   </RequestingPhysician>
   <RequestedProcedureDescription element="1060" group="0032" vr="LO"/>
   <RequestedProcedureCodeSequence element="1064" group="0032" vr="SQ">
      <Item number="1">
         <CodeValue element="0100" group="0008" vr="SH">
            <value number="1">13120</value>
         </CodeValue>
         <CodingSchemeDesignator element="0102" group="0008" vr="SH">
            <value number="1">IHE99</value>
         </CodingSchemeDesignator>
         <CodeMeaning element="0104" group="0008" vr="LO">
            <value number="1">Scanned Film Import</value>
         </CodeMeaning>
      </Item>
   </RequestedProcedureCodeSequence>
   <AdmissionID element="0010" group="0038" vr="LO">
      <value number="1">17</value>
   </AdmissionID>
   <IssuerOfAdmissionID element="0011" group="0038" vr="LO">
      <value number="1">IHEPAM&amp;1.3.6.1.4.1.12559.11.1.2.2.5</value>
   </IssuerOfAdmissionID>
   <CurrentPatientLocation element="0300" group="0038" vr="LO">
      <value number="1">2E^210^2^EAST_HOSPITAL</value>
   </CurrentPatientLocation>
   <ScheduledProcedureStepSequence element="0100" group="0040" vr="SQ">
      <Item number="1">
         <Modality element="0060" group="0008" vr="CS">
            <value number="1">SC</value>
         </Modality>
         <ScheduledStationAETitle element="0001" group="0040" vr="AE">
            <value number="1">MINE</value>
         </ScheduledStationAETitle>
         <ScheduledProcedureStepStartDate element="0002" group="0040" vr="DA">
            <value number="1">20121107</value>
         </ScheduledProcedureStepStartDate>
         <ScheduledProcedureStepStartTime element="0003" group="0040" vr="TM">
            <value number="1">1200</value>
         </ScheduledProcedureStepStartTime>
         <ScheduledPerformingPhysicianName element="0006" group="0040" vr="PN">
            <value number="1">CHAVEZ^JULIO^^^DR</value>
         </ScheduledPerformingPhysicianName>
         <ScheduledProcedureStepDescription element="0007" group="0040" vr="LO">
            <value number="1">Scanned Film Import</value>
         </ScheduledProcedureStepDescription>
         <ScheduledProtocolCodeSequence element="0008" group="0040" vr="SQ">
            <Item number="1">
               <CodeValue element="0100" group="0008" vr="SH">
                  <value number="1">913120</value>
               </CodeValue>
               <CodingSchemeDesignator element="0102" group="0008" vr="SH">
                  <value number="1">99IHE</value>
               </CodingSchemeDesignator>
               <CodeMeaning element="0104" group="0008" vr="LO">
                  <value number="1">SC: Scanned Film Import</value>
               </CodeMeaning>
            </Item>
            <Item number="2">
               <CodeValue element="0100" group="0008" vr="SH">
                  <value number="1">789456</value>
               </CodeValue>
               <CodingSchemeDesignator element="0102" group="0008" vr="SH">
                  <value number="1">99IHE</value>
               </CodingSchemeDesignator>
               <CodeMeaning element="0104" group="0008" vr="LO">
                  <value number="1">Another procedure</value>
               </CodeMeaning>
            </Item>
         </ScheduledProtocolCodeSequence>
         <ScheduledProcedureStepID element="0009" group="0040" vr="SH">
            <value number="1">OMSPS5</value>
         </ScheduledProcedureStepID>
      </Item>
   </ScheduledProcedureStepSequence>
   <RequestedProcedureID element="1001" group="0040" vr="SH">
      <value number="1">OMRP5</value>
   </RequestedProcedureID>
   <ReasonForTheRequestedProcedure element="1002" group="0040" vr="LO"/>
   <RequestedProcedurePriority element="1003" group="0040" vr="SH">
      <value number="1">STAT</value>
   </RequestedProcedurePriority>
   <PatientTransportArrangements element="1004" group="0040" vr="LO">
      <value number="1">Not Arranged</value>
   </PatientTransportArrangements>
   <OrderEnteredBy element="2008" group="0040" vr="PN">
      <value number="1">CHAVEZ^JULIO^^^DR</value>
   </OrderEnteredBy>
   <OrderEntererLocation element="2009" group="0040" vr="SH">
      <value number="1">C</value>
   </OrderEntererLocation>
   <OrderCallbackPhoneNumber element="2010" group="0040" vr="SH"/>
   <PlacerOrderNumberImagingServiceRequest element="2016" group="0040" vr="LO"/>
   <FillerOrderNumberImagingServiceRequest element="2017" group="0040" vr="LO">
      <value number="1">26^IHE_OM_OF</value>
   </FillerOrderNumberImagingServiceRequest>
   <HEX12341234 element="1234" group="1234" vr="LO">
      <value number="1">unknown tag</value>
   </HEX12341234>
</DicomObject>

[INFO] Tests run: 6, Failures: 0, Errors: 0, Skipped: 0, Time elapsed: 1.209 s - in net.ihe.gazelle.xvalidation.core.test.FileConverterTest
[INFO] Running net.ihe.gazelle.xvalidation.core.test.SVSConsumerTest
WARN  2019-02-28 13:14:52,563 [main] org.apache.commons.httpclient.HttpMethodBase: Cookie rejected: "$Version=0; JSESSIONID=2kwrPcJ7xvJHeeVSBazOGQBG; $Path=/SVSSimulator". Illegal path attribute "/SVSSimulator". Path of origin: "/RetrieveValueSetForSimulator"
[INFO] Tests run: 1, Failures: 0, Errors: 0, Skipped: 0, Time elapsed: 0.635 s - in net.ihe.gazelle.xvalidation.core.test.SVSConsumerTest
[INFO] Running net.ihe.gazelle.xvalidation.core.test.StandaloneValidatorTest
INFO  2019-02-28 13:14:52,591 [main] net.ihe.gazelle.xvalidation.core.engine.StandaloneValidator: validating src/test/resources/dicomManifest1.xml against XValidator.xsd
INFO  2019-02-28 13:14:52,927 [main] net.ihe.gazelle.xvalidation.core.engine.StandaloneValidator: ... OK
INFO  2019-02-28 13:14:53,666 [main] net.ihe.gazelle.xvalidation.core.engine.StandaloneValidator: The report has been saved at /tmp/validateManifestReport20190228131452583.xml
INFO  2019-02-28 13:14:53,667 [main] net.ihe.gazelle.xvalidation.core.engine.StandaloneValidator: validating src/test/resources/integration/X_validator.xml against XValidator.xsd
INFO  2019-02-28 13:14:53,674 [main] net.ihe.gazelle.xvalidation.core.engine.StandaloneValidator: ... OK
INFO  2019-02-28 13:14:54,340 [main] net.ihe.gazelle.xvalidation.core.engine.StandaloneValidator: The report has been saved at /tmp/DispensationReport20190228131453666.xml
INFO  2019-02-28 13:14:54,341 [main] net.ihe.gazelle.xvalidation.core.engine.StandaloneValidator: validating src/test/resources/integration/ker_validator.xml against XValidator.xsd
INFO  2019-02-28 13:14:54,346 [main] net.ihe.gazelle.xvalidation.core.engine.StandaloneValidator: ... OK
INFO  2019-02-28 13:14:54,416 [main] net.ihe.gazelle.xvalidation.core.engine.StandaloneValidator: The report has been saved at /tmp/KerevalReport20190228131454341.xml
INFO  2019-02-28 13:14:54,417 [main] net.ihe.gazelle.xvalidation.core.engine.StandaloneValidator: validating src/test/resources/validateDicomWorklist.xml against XValidator.xsd
INFO  2019-02-28 13:14:54,421 [main] net.ihe.gazelle.xvalidation.core.engine.StandaloneValidator: ... OK
INFO  2019-02-28 13:14:54,500 [main] net.ihe.gazelle.xvalidation.core.engine.StandaloneValidator: The report has been saved at /tmp/validateDicomWorklistReport20190228131454417.xml
[INFO] Tests run: 4, Failures: 0, Errors: 0, Skipped: 0, Time elapsed: 1.929 s - in net.ihe.gazelle.xvalidation.core.test.StandaloneValidatorTest
[INFO] Running net.ihe.gazelle.xvalidation.core.test.MathOperationTest
(doc1::/*[name()='PRPA_IN201305UV02']/*[name()='controlActProcess']/*[name()='queryByParameter']/*[name()='initialQuantity']/@value) + (doc2::/*[name()='PRPA_IN201306UV02']/*[name()='controlActProcess']/*[name()='queryByParameter']/*[name()='initialQuantity']/@value)
doc1::/*[name()='PRPA_IN201305UV02']/*[name()='controlActProcess']/*[name()='queryByParameter']/*[name()='initialQuantity']/@value
(doc1::/*[name()='PRPA_IN201305UV02']/*[name()='controlActProcess']/*[name()='queryByParameter']/*[name()='initialQuantity']/@value) - (doc2::/*[name()='PRPA_IN201306UV02']/*[name()='controlActProcess']/*[name()='queryByParameter']/*[name()='initialQuantity']/@value)
(doc1::/*[name()='PRPA_IN201305UV02']/*[name()='controlActProcess']/*[name()='queryByParameter']/*[name()='initialQuantity']/@value) * (doc2::/*[name()='PRPA_IN201306UV02']/*[name()='controlActProcess']/*[name()='queryByParameter']/*[name()='initialQuantity']/@value)
(doc1::/*[name()='PRPA_IN201305UV02']/*[name()='controlActProcess']/*[name()='queryByParameter']/*[name()='initialQuantity']/@value) / (doc2::/*[name()='PRPA_IN201306UV02']/*[name()='controlActProcess']/*[name()='queryByParameter']/*[name()='initialQuantity']/@value)
(doc1::/*[name()='PRPA_IN201305UV02']/*[name()='controlActProcess']/*[name()='queryByParameter']/*[name()='initialQuantity']/@value) + (10.0)
(doc1::/*[name()='PRPA_IN201305UV02']/*[name()='controlActProcess']/*[name()='queryByParameter']/*[name()='initialQuantity']/@value) ^ (3.0)
[INFO] Tests run: 7, Failures: 0, Errors: 0, Skipped: 0, Time elapsed: 0.107 s - in net.ihe.gazelle.xvalidation.core.test.MathOperationTest
[INFO] Running net.ihe.gazelle.xvalidation.core.test.XpathUtilsTest
value from locator: 10.0
value from locator: 1110.0
[INFO] Tests run: 15, Failures: 0, Errors: 0, Skipped: 0, Time elapsed: 0.072 s - in net.ihe.gazelle.xvalidation.core.test.XpathUtilsTest
[INFO] Running net.ihe.gazelle.xvalidation.core.test.MathComparisonTest
((doc1::/*[name()='PRPA_IN201305UV02']/*[name()='controlActProcess']/*[name()='queryByParameter']/*[name()='initialQuantity']/@value) + (doc2::/*[name()='PRPA_IN201306UV02']/*[name()='controlActProcess']/*[name()='queryByParameter']/*[name()='initialQuantity']/@value)) &eq; ((doc1::/*[name()='PRPA_IN201305UV02']/*[name()='controlActProcess']/*[name()='queryByParameter']/*[name()='initialQuantity']/@value) + (doc2::/*[name()='PRPA_IN201306UV02']/*[name()='controlActProcess']/*[name()='queryByParameter']/*[name()='initialQuantity']/@value)) &plusmn;0.0
((doc1::/*[name()='PRPA_IN201305UV02']/*[name()='controlActProcess']/*[name()='queryByParameter']/*[name()='initialQuantity']/@value) + (doc2::/*[name()='PRPA_IN201306UV02']/*[name()='controlActProcess']/*[name()='queryByParameter']/*[name()='initialQuantity']/@value)) &eq; ((doc1::/*[name()='PRPA_IN201305UV02']/*[name()='controlActProcess']/*[name()='queryByParameter']/*[name()='initialQuantity']/@value) * (doc2::/*[name()='PRPA_IN201306UV02']/*[name()='controlActProcess']/*[name()='queryByParameter']/*[name()='initialQuantity']/@value)) &plusmn;0.0
((doc1::/*[name()='PRPA_IN201305UV02']/*[name()='controlActProcess']/*[name()='queryByParameter']/*[name()='initialQuantity']/@value) + (doc2::/*[name()='PRPA_IN201306UV02']/*[name()='controlActProcess']/*[name()='queryByParameter']/*[name()='initialQuantity']/@value)) &lt; ((doc1::/*[name()='PRPA_IN201305UV02']/*[name()='controlActProcess']/*[name()='queryByParameter']/*[name()='initialQuantity']/@value) * (doc2::/*[name()='PRPA_IN201306UV02']/*[name()='controlActProcess']/*[name()='queryByParameter']/*[name()='initialQuantity']/@value)) &plusmn;0.0
((doc1::/*[name()='PRPA_IN201305UV02']/*[name()='controlActProcess']/*[name()='queryByParameter']/*[name()='initialQuantity']/@value) * (doc2::/*[name()='PRPA_IN201306UV02']/*[name()='controlActProcess']/*[name()='queryByParameter']/*[name()='initialQuantity']/@value)) &lt; ((doc1::/*[name()='PRPA_IN201305UV02']/*[name()='controlActProcess']/*[name()='queryByParameter']/*[name()='initialQuantity']/@value) + (doc2::/*[name()='PRPA_IN201306UV02']/*[name()='controlActProcess']/*[name()='queryByParameter']/*[name()='initialQuantity']/@value)) &plusmn;0.0
((doc1::/*[name()='PRPA_IN201305UV02']/*[name()='controlActProcess']/*[name()='queryByParameter']/*[name()='initialQuantity']/@value) + (doc2::/*[name()='PRPA_IN201306UV02']/*[name()='controlActProcess']/*[name()='queryByParameter']/*[name()='initialQuantity']/@value)) &le; ((doc1::/*[name()='PRPA_IN201305UV02']/*[name()='controlActProcess']/*[name()='queryByParameter']/*[name()='initialQuantity']/@value) + (doc2::/*[name()='PRPA_IN201306UV02']/*[name()='controlActProcess']/*[name()='queryByParameter']/*[name()='initialQuantity']/@value)) &plusmn;0.0
((doc1::/*[name()='PRPA_IN201305UV02']/*[name()='controlActProcess']/*[name()='queryByParameter']/*[name()='initialQuantity']/@value) * (doc2::/*[name()='PRPA_IN201306UV02']/*[name()='controlActProcess']/*[name()='queryByParameter']/*[name()='initialQuantity']/@value)) &le; ((doc1::/*[name()='PRPA_IN201305UV02']/*[name()='controlActProcess']/*[name()='queryByParameter']/*[name()='initialQuantity']/@value) + (doc2::/*[name()='PRPA_IN201306UV02']/*[name()='controlActProcess']/*[name()='queryByParameter']/*[name()='initialQuantity']/@value)) &plusmn;0.0
((doc1::/*[name()='PRPA_IN201305UV02']/*[name()='controlActProcess']/*[name()='queryByParameter']/*[name()='initialQuantity']/@value) * (doc2::/*[name()='PRPA_IN201306UV02']/*[name()='controlActProcess']/*[name()='queryByParameter']/*[name()='initialQuantity']/@value)) &gt; ((doc1::/*[name()='PRPA_IN201305UV02']/*[name()='controlActProcess']/*[name()='queryByParameter']/*[name()='initialQuantity']/@value) + (doc2::/*[name()='PRPA_IN201306UV02']/*[name()='controlActProcess']/*[name()='queryByParameter']/*[name()='initialQuantity']/@value)) &plusmn;0.0
((doc1::/*[name()='PRPA_IN201305UV02']/*[name()='controlActProcess']/*[name()='queryByParameter']/*[name()='initialQuantity']/@value) * (doc2::/*[name()='PRPA_IN201306UV02']/*[name()='controlActProcess']/*[name()='queryByParameter']/*[name()='initialQuantity']/@value)) &gt; ((doc1::/*[name()='PRPA_IN201305UV02']/*[name()='controlActProcess']/*[name()='queryByParameter']/*[name()='initialQuantity']/@value) * (doc2::/*[name()='PRPA_IN201306UV02']/*[name()='controlActProcess']/*[name()='queryByParameter']/*[name()='initialQuantity']/@value)) &plusmn;0.0
((doc1::/*[name()='PRPA_IN201305UV02']/*[name()='controlActProcess']/*[name()='queryByParameter']/*[name()='initialQuantity']/@value) * (doc2::/*[name()='PRPA_IN201306UV02']/*[name()='controlActProcess']/*[name()='queryByParameter']/*[name()='initialQuantity']/@value)) &ge; ((doc1::/*[name()='PRPA_IN201305UV02']/*[name()='controlActProcess']/*[name()='queryByParameter']/*[name()='initialQuantity']/@value) * (doc2::/*[name()='PRPA_IN201306UV02']/*[name()='controlActProcess']/*[name()='queryByParameter']/*[name()='initialQuantity']/@value)) &plusmn;0.0
((doc1::/*[name()='PRPA_IN201305UV02']/*[name()='controlActProcess']/*[name()='queryByParameter']/*[name()='initialQuantity']/@value) + (doc2::/*[name()='PRPA_IN201306UV02']/*[name()='controlActProcess']/*[name()='queryByParameter']/*[name()='initialQuantity']/@value)) &ge; ((doc1::/*[name()='PRPA_IN201305UV02']/*[name()='controlActProcess']/*[name()='queryByParameter']/*[name()='initialQuantity']/@value) * (doc2::/*[name()='PRPA_IN201306UV02']/*[name()='controlActProcess']/*[name()='queryByParameter']/*[name()='initialQuantity']/@value)) &plusmn;0.0
((doc1::/*[name()='PRPA_IN201305UV02']/*[name()='controlActProcess']/*[name()='queryByParameter']/*[name()='initialQuantity']/@value) + (doc2::/*[name()='PRPA_IN201306UV02']/*[name()='controlActProcess']/*[name()='queryByParameter']/*[name()='initialQuantity']/@value)) &eq; ((doc1::/*[name()='PRPA_IN201305UV02']/*[name()='controlActProcess']/*[name()='queryByParameter']/*[name()='initialQuantity']/@value) * (doc2::/*[name()='PRPA_IN201306UV02']/*[name()='controlActProcess']/*[name()='queryByParameter']/*[name()='initialQuantity']/@value)) &plusmn;5.0
t1: 1.456393204852933E9
lat1: 48.1536984443665
long1: -1.58058822154999
lat2: 48.1536984443665
long2: -1.53058648109436
t2: 1.456393206945643E9
lats: 0.0
latsquare: 0.0
longs: -0.050001740455630106
longsSquare: 0.002500174048592196
times: -2.092710018157959
timesSquare: 4.379435220098685
add: 0.002500174048592196
((((AST_A::/*[name()='pdml']/*[name()='packet']/*[name()='proto'][@name='asterix']/*[name()='field'][@name='asterix.message']/*[name()='field'][@name='asterix.062_105']/*[name()='field'][@name='asterix.062_105_LAT']/@show) - (AST_B::/*[name()='pdml']/*[name()='packet']/*[name()='proto'][@name='asterix']/*[name()='field'][@name='asterix.message']/*[name()='field'][@name='asterix.062_105']/*[name()='field'][@name='asterix.062_105_LAT']/@show)) ^ (2.0)) + (((AST_A::/*[name()='pdml']/*[name()='packet']/*[name()='proto'][@name='asterix']/*[name()='field'][@name='asterix.message']/*[name()='field'][@name='asterix.062_105']/*[name()='field'][@name='asterix.062_105_LON']/@show) - (AST_B::/*[name()='pdml']/*[name()='packet']/*[name()='proto'][@name='asterix']/*[name()='field'][@name='asterix.message']/*[name()='field'][@name='asterix.062_105']/*[name()='field'][@name='asterix.062_105_LON']/@show)) ^ (2.0))) / (((AST_A::/*[name()='pdml']/*[name()='packet']/*[name()='proto'][@name='geninfo']/*[name()='field'][@name='timestamp']/@value) - (AST_B::/*[name()='pdml']/*[name()='packet']/*[name()='proto'][@name='geninfo']/*[name()='field'][@name='timestamp']/@value)) ^ (2.0))
5.708896062939956E-4
[INFO] Tests run: 12, Failures: 0, Errors: 0, Skipped: 0, Time elapsed: 0.279 s - in net.ihe.gazelle.xvalidation.core.test.MathComparisonTest
[INFO] Running net.ihe.gazelle.xvalidation.core.test.ValidationEngineTest
INFO  2019-02-28 13:14:55,035 [main] net.ihe.gazelle.xvalidation.core.test.ValidationEngineTest: <?xml version="1.0" encoding="UTF-8" standalone="yes"?>
<GazelleCrossValidationReport>
    <ReportSummary>
        <GazelleCrossValidator engineVersion="1.4.0-SNAPSHOT">
            <CalledValidator name="PDQv3 Query checker" version="1.0.0" affinityDomain="IHE"/>
        </GazelleCrossValidator>
        <ValidationDate>2019-02-28T13:14:55.001+01:00</ValidationDate>
        <ValidationResult>FAILED</ValidationResult>
        <ValidationCounters>
            <nrOfChecks>14</nrOfChecks>
            <NrOfValidationErrors>4</NrOfValidationErrors>
            <NrOfValidationWarnings>0</NrOfValidationWarnings>
            <NrOfValidationInfos>0</NrOfValidationInfos>
            <NrOfValidationReports>10</NrOfValidationReports>
            <NrOfValidationUnknown>0</NrOfValidationUnknown>
            <NrOfValidationAborted>0</NrOfValidationAborted>
        </ValidationCounters>
    </ReportSummary>
    <Notifications>
        <Error>
            <Test>PDQV3-1</Test>
            <ProcessedInput>QUERY</ProcessedInput>
            <ProcessedInput>RESPONSE</ProcessedInput>
            <Description>test Not</Description>
            <Assertion assertionId="Assertion1" idScheme="Assertions"/>
            <Expression> not( QUERY::/v3:PRPA_IN201305UV02/v3:id is present)</Expression>
        </Error>
        <Report>
            <Test>PDQV3-3</Test>
            <ProcessedInput>QUERY</ProcessedInput>
            <ProcessedInput>RESPONSE</ProcessedInput>
            <Description>test Present</Description>
            <Assertion assertionId="Assertion4" idScheme="Assertions"/>
            <Expression> QUERY::/v3:PRPA_IN201305UV02/v3:id is present</Expression>
        </Report>
        <Report>
            <Test>PDQV3-4</Test>
            <ProcessedInput>QUERY</ProcessedInput>
            <ProcessedInput>RESPONSE</ProcessedInput>
            <Description>test In</Description>
            <Assertion assertionId="Assertion5" idScheme="Assertions"/>
            <Assertion assertionId="Assertion6" idScheme="Assertions"/>
            <Assertion assertionId="Assertion7" idScheme="Assertions"/>
            <Expression>QUERY::/v3:PRPA_IN201305UV02/v3:controlActProcess/v3:queryByParameter in RESPONSE::/v3:PRPA_IN201306UV02/v3:controlActProcess/v3:queryByParameter</Expression>
        </Report>
        <Error>
            <Test>PDQV3-5</Test>
            <ProcessedInput>QUERY</ProcessedInput>
            <ProcessedInput>RESPONSE</ProcessedInput>
            <Description>test In (failed)</Description>
            <Assertion assertionId="Assertion8" idScheme="Assertions"/>
            <Expression>RESPONSE::/v3:PRPA_IN201306UV02/v3:controlActProcess/v3:subject in QUERY::/v3:PRPA_IN201305UV02/v3:controlActProcess/v3:queryByParameter</Expression>
        </Error>
        <Report>
            <Test>PDQV3-6</Test>
            <ProcessedInput>QUERY</ProcessedInput>
            <ProcessedInput>RESPONSE</ProcessedInput>
            <Description>test Contain</Description>
            <Assertion assertionId="Assertion10" idScheme="Assertions"/>
            <Expression>QUERY::/v3:PRPA_IN201305UV02/v3:controlActProcess/v3:queryByParameter in RESPONSE::/v3:PRPA_IN201306UV02/v3:controlActProcess/v3:queryByParameter</Expression>
        </Report>
        <Report>
            <Test>PDQV3-7</Test>
            <ProcessedInput>QUERY</ProcessedInput>
            <ProcessedInput>RESPONSE</ProcessedInput>
            <Description>test Eq</Description>
            <Assertion assertionId="Assertion11" idScheme="Assertions"/>
            <Expression>QUERY::/v3:PRPA_IN201305UV02/v3:controlActProcess/v3:queryByParameter = RESPONSE::/v3:PRPA_IN201306UV02/v3:controlActProcess/v3:queryByParameter</Expression>
        </Report>
        <Report>
            <Test>PDQV3-8</Test>
            <ProcessedInput>QUERY</ProcessedInput>
            <ProcessedInput>RESPONSE</ProcessedInput>
            <Description>test size equal</Description>
            <Assertion assertionId="Assertion12" idScheme="Assertions"/>
            <Expression> count(QUERY::/v3:PRPA_IN201305UV02/v3:receiver) = count(RESPONSE::/v3:PRPA_IN201306UV02/v3:sender)</Expression>
        </Report>
        <Report>
            <Test>PDQV3-9</Test>
            <ProcessedInput>QUERY</ProcessedInput>
            <ProcessedInput>RESPONSE</ProcessedInput>
            <Description>test size greater or equal</Description>
            <Assertion assertionId="Assertion13" idScheme="Assertions"/>
            <Expression> count(QUERY::/v3:PRPA_IN201305UV02/v3:controlActProcess/v3:queryByParameter/v3:parameterList/v3:otherIDsScopingOrganization) &gt;= count(RESPONSE::/v3:PRPA_IN201306UV02/v3:sender)</Expression>
        </Report>
        <Report>
            <Test>PDQV3-10</Test>
            <ProcessedInput>QUERY</ProcessedInput>
            <ProcessedInput>RESPONSE</ProcessedInput>
            <Description>test size less or equal</Description>
            <Assertion assertionId="Assertion14" idScheme="Assertions"/>
            <Expression> count(RESPONSE::/v3:PRPA_IN201306UV02/v3:sender) =&lt; count(QUERY::/v3:PRPA_IN201305UV02/v3:controlActProcess/v3:queryByParameter/v3:parameterList/v3:otherIDsScopingOrganization)</Expression>
        </Report>
        <Report>
            <Test>PDQV3-11</Test>
            <ProcessedInput>QUERY</ProcessedInput>
            <ProcessedInput>RESPONSE</ProcessedInput>
            <Description>test And</Description>
            <Assertion assertionId="Assertion15" idScheme="Assertions"/>
            <Expression>( QUERY::/v3:PRPA_IN201305UV02/v3:id is present)
 and 
( RESPONSE::/v3:PRPA_IN201306UV02/v3:id is present)</Expression>
        </Report>
        <Report>
            <Test>PDQV3-12</Test>
            <ProcessedInput>QUERY</ProcessedInput>
            <ProcessedInput>RESPONSE</ProcessedInput>
            <Description>test Or</Description>
            <Assertion assertionId="Assertion16" idScheme="Assertions"/>
            <Expression>( QUERY::/v3:PRPA_IN201305UV02/v3:id is present)
 or 
( RESPONSE::/v3:PRPA_IN201306UV02/v3:id2 is present)</Expression>
        </Report>
        <Error>
            <Test>PDQV3-13</Test>
            <ProcessedInput>QUERY</ProcessedInput>
            <ProcessedInput>RESPONSE</ProcessedInput>
            <Description>test Xor</Description>
            <Assertion assertionId="Assertion17" idScheme="Assertions"/>
            <Expression>( QUERY::/v3:PRPA_IN201305UV02/v3:id is present)
 xor 
( RESPONSE::/v3:PRPA_IN201306UV02/v3:id is present)</Expression>
        </Error>
        <Report>
            <Test>PDQV3-14</Test>
            <ProcessedInput>QUERY</ProcessedInput>
            <ProcessedInput>RESPONSE</ProcessedInput>
            <Description>test True</Description>
            <Assertion assertionId="Assertion18" idScheme="Assertions"/>
            <Expression>(QUERY:://v3:id/@extension = '35423') = true</Expression>
        </Report>
        <Error>
            <Test>PDQV3-15</Test>
            <ProcessedInput>QUERY</ProcessedInput>
            <ProcessedInput>RESPONSE</ProcessedInput>
            <Description>test Foreach</Description>
            <Assertion assertionId="Assertion19" idScheme="Assertions"/>
            <Expression> for each (element in QUERY:://v3:id){
( element::@root is present)
 and 
( element::@extension is present)
}</Expression>
        </Error>
    </Notifications>
</GazelleCrossValidationReport>

initializing Class
[INFO] Tests run: 1, Failures: 0, Errors: 0, Skipped: 0, Time elapsed: 0.064 s - in net.ihe.gazelle.xvalidation.core.test.ValidationEngineTest
[INFO] Running net.ihe.gazelle.xvalidation.core.test.ExpressionTest
[INFO] Tests run: 19, Failures: 0, Errors: 0, Skipped: 0, Time elapsed: 0.025 s - in net.ihe.gazelle.xvalidation.core.test.ExpressionTest
[INFO] Running net.ihe.gazelle.xvalidation.core.test.XMLValidationTest
[WARNING] Tests run: 6, Failures: 0, Errors: 0, Skipped: 1, Time elapsed: 0.043 s - in net.ihe.gazelle.xvalidation.core.test.XMLValidationTest
[INFO] 
[INFO] Results:
[INFO] 
[WARNING] Tests run: 79, Failures: 0, Errors: 0, Skipped: 1
[INFO] 
[JENKINS] Recording test results
Feb 28, 2019 1:14:57 PM org.jenkinsci.remoting.util.AnonymousClassWarnings warn
WARNING: Attempt to (de-)serialize anonymous class hudson.maven.reporters.SurefireArchiver$2; see: https://jenkins.io/redirect/serialization-of-anonymous-classes/
[INFO] 
[INFO] --- jacoco-maven-plugin:0.7.9:report (post-unit-test) @ gazelle-x-validation-core ---
[INFO] Loading execution data file /home/jenkins/.hudson/jobs/gazelle-x-validation-nbt/workspace/gazelle-x-validation-core/target/jacoco.exec
[INFO] Analyzed bundle 'gazelle-x-validation-core' with 148 classes
[INFO] 
[INFO] --- jacoco-maven-plugin:0.7.9:report (default-report) @ gazelle-x-validation-core ---
[INFO] Loading execution data file /home/jenkins/.hudson/jobs/gazelle-x-validation-nbt/workspace/gazelle-x-validation-core/target/jacoco.exec
[INFO] Analyzed bundle 'gazelle-x-validation-core' with 148 classes
[INFO] 
[INFO] --- maven-ejb-plugin:2.3:ejb (default-ejb) @ gazelle-x-validation-core ---
[INFO] Building EJB gazelle-x-validation-core with EJB version 3.0
[INFO] Building jar: /home/jenkins/.hudson/jobs/gazelle-x-validation-nbt/workspace/gazelle-x-validation-core/target/gazelle-x-validation-core.jar
[INFO] 
[INFO] --- maven-source-plugin:3.0.1:jar-no-fork (attach-sources) @ gazelle-x-validation-core ---
[INFO] Building jar: /home/jenkins/.hudson/jobs/gazelle-x-validation-nbt/workspace/gazelle-x-validation-core/target/gazelle-x-validation-core-sources.jar
[INFO] 
[INFO] --- maven-jar-plugin:2.6:test-jar (default) @ gazelle-x-validation-core ---
[INFO] Building jar: /home/jenkins/.hudson/jobs/gazelle-x-validation-nbt/workspace/gazelle-x-validation-core/target/gazelle-x-validation-core-tests.jar
[INFO] 
[INFO] --- appassembler-maven-plugin:1.10:assemble (assemble) @ gazelle-x-validation-core ---
[INFO] Installing artifact /home/jenkins/.m2/repository/org/jboss/seam/jboss-seam/2.3.1.Final/jboss-seam-2.3.1.Final.jar to /home/jenkins/.hudson/jobs/gazelle-x-validation-nbt/workspace/gazelle-x-validation-core/target/appassembler/repo/org/jboss/seam/jboss-seam/2.3.1.Final/jboss-seam-2.3.1.Final.jar
[INFO] Installing artifact /home/jenkins/.m2/repository/org/jboss/el/jboss-el/1.0_02.CR6/jboss-el-1.0_02.CR6.jar to /home/jenkins/.hudson/jobs/gazelle-x-validation-nbt/workspace/gazelle-x-validation-core/target/appassembler/repo/org/jboss/el/jboss-el/1.0_02.CR6/jboss-el-1.0_02.CR6.jar
[INFO] Installing artifact /home/jenkins/.m2/repository/junit/junit/4.8.2/junit-4.8.2.jar to /home/jenkins/.hudson/jobs/gazelle-x-validation-nbt/workspace/gazelle-x-validation-core/target/appassembler/repo/junit/junit/4.8.2/junit-4.8.2.jar
[INFO] Installing artifact /home/jenkins/.m2/repository/org/slf4j/slf4j-api/1.7.21/slf4j-api-1.7.21.jar to /home/jenkins/.hudson/jobs/gazelle-x-validation-nbt/workspace/gazelle-x-validation-core/target/appassembler/repo/org/slf4j/slf4j-api/1.7.21/slf4j-api-1.7.21.jar
[INFO] Installing artifact /home/jenkins/.m2/repository/net/sf/saxon/Saxon-HE/9.8.0-12/Saxon-HE-9.8.0-12.jar to /home/jenkins/.hudson/jobs/gazelle-x-validation-nbt/workspace/gazelle-x-validation-core/target/appassembler/repo/net/sf/saxon/Saxon-HE/9.8.0-12/Saxon-HE-9.8.0-12.jar
[INFO] Installing artifact /home/jenkins/.m2/repository/com/io7m/xom/xom/1.2.10/xom-1.2.10.jar to /home/jenkins/.hudson/jobs/gazelle-x-validation-nbt/workspace/gazelle-x-validation-core/target/appassembler/repo/com/io7m/xom/xom/1.2.10/xom-1.2.10.jar
[INFO] Installing artifact /home/jenkins/.m2/repository/xerces/xercesImpl/2.9.1/xercesImpl-2.9.1.jar to /home/jenkins/.hudson/jobs/gazelle-x-validation-nbt/workspace/gazelle-x-validation-core/target/appassembler/repo/xerces/xercesImpl/2.9.1/xercesImpl-2.9.1.jar
[INFO] Installing artifact /home/jenkins/.m2/repository/org/jboss/resteasy/resteasy-jaxrs/2.3.5.Final/resteasy-jaxrs-2.3.5.Final.jar to /home/jenkins/.hudson/jobs/gazelle-x-validation-nbt/workspace/gazelle-x-validation-core/target/appassembler/repo/org/jboss/resteasy/resteasy-jaxrs/2.3.5.Final/resteasy-jaxrs-2.3.5.Final.jar
[INFO] Installing artifact /home/jenkins/.m2/repository/commons-io/commons-io/2.1/commons-io-2.1.jar to /home/jenkins/.hudson/jobs/gazelle-x-validation-nbt/workspace/gazelle-x-validation-core/target/appassembler/repo/commons-io/commons-io/2.1/commons-io-2.1.jar
[INFO] Installing artifact /home/jenkins/.m2/repository/commons-httpclient/commons-httpclient/3.1/commons-httpclient-3.1.jar to /home/jenkins/.hudson/jobs/gazelle-x-validation-nbt/workspace/gazelle-x-validation-core/target/appassembler/repo/commons-httpclient/commons-httpclient/3.1/commons-httpclient-3.1.jar
[INFO] Installing artifact /home/jenkins/.m2/repository/commons-logging/commons-logging/1.1.1/commons-logging-1.1.1.jar to /home/jenkins/.hudson/jobs/gazelle-x-validation-nbt/workspace/gazelle-x-validation-core/target/appassembler/repo/commons-logging/commons-logging/1.1.1/commons-logging-1.1.1.jar
[INFO] Installing artifact /home/jenkins/.m2/repository/commons-codec/commons-codec/1.4/commons-codec-1.4.jar to /home/jenkins/.hudson/jobs/gazelle-x-validation-nbt/workspace/gazelle-x-validation-core/target/appassembler/repo/commons-codec/commons-codec/1.4/commons-codec-1.4.jar
[INFO] Installing artifact /home/jenkins/.m2/repository/org/jboss/resteasy/resteasy-jaxb-provider/2.3.5.Final/resteasy-jaxb-provider-2.3.5.Final.jar to /home/jenkins/.hudson/jobs/gazelle-x-validation-nbt/workspace/gazelle-x-validation-core/target/appassembler/repo/org/jboss/resteasy/resteasy-jaxb-provider/2.3.5.Final/resteasy-jaxb-provider-2.3.5.Final.jar
[INFO] Installing artifact /home/jenkins/.m2/repository/com/sun/xml/bind/jaxb-impl/2.2.5.jboss-1/jaxb-impl-2.2.5.jboss-1.jar to /home/jenkins/.hudson/jobs/gazelle-x-validation-nbt/workspace/gazelle-x-validation-core/target/appassembler/repo/com/sun/xml/bind/jaxb-impl/2.2.5.jboss-1/jaxb-impl-2.2.5.jboss-1.jar
[INFO] Installing artifact /home/jenkins/.m2/repository/com/sun/istack/istack-commons-runtime/2.6.1/istack-commons-runtime-2.6.1.jar to /home/jenkins/.hudson/jobs/gazelle-x-validation-nbt/workspace/gazelle-x-validation-core/target/appassembler/repo/com/sun/istack/istack-commons-runtime/2.6.1/istack-commons-runtime-2.6.1.jar
[INFO] Installing artifact /home/jenkins/.m2/repository/com/sun/xml/txw2/txw2/20110809/txw2-20110809.jar to /home/jenkins/.hudson/jobs/gazelle-x-validation-nbt/workspace/gazelle-x-validation-core/target/appassembler/repo/com/sun/xml/txw2/txw2/20110809/txw2-20110809.jar
[INFO] Installing artifact /home/jenkins/.m2/repository/org/codehaus/mojo/appassembler/appassembler-booter/1.10/appassembler-booter-1.10.jar to /home/jenkins/.hudson/jobs/gazelle-x-validation-nbt/workspace/gazelle-x-validation-core/target/appassembler/repo/org/codehaus/mojo/appassembler/appassembler-booter/1.10/appassembler-booter-1.10.jar
[INFO] Installing artifact /home/jenkins/.m2/repository/org/codehaus/mojo/appassembler/appassembler-model/1.10/appassembler-model-1.10.jar to /home/jenkins/.hudson/jobs/gazelle-x-validation-nbt/workspace/gazelle-x-validation-core/target/appassembler/repo/org/codehaus/mojo/appassembler/appassembler-model/1.10/appassembler-model-1.10.jar
[INFO] Installing artifact /home/jenkins/.m2/repository/org/codehaus/plexus/plexus-utils/3.0.9/plexus-utils-3.0.9.jar to /home/jenkins/.hudson/jobs/gazelle-x-validation-nbt/workspace/gazelle-x-validation-core/target/appassembler/repo/org/codehaus/plexus/plexus-utils/3.0.9/plexus-utils-3.0.9.jar
[INFO] Installing artifact /home/jenkins/.m2/repository/net/java/dev/stax-utils/stax-utils/20060502/stax-utils-20060502.jar to /home/jenkins/.hudson/jobs/gazelle-x-validation-nbt/workspace/gazelle-x-validation-core/target/appassembler/repo/net/java/dev/stax-utils/stax-utils/20060502/stax-utils-20060502.jar
[INFO] Installing artifact /home/jenkins/.m2/repository/stax/stax/1.1.1-dev/stax-1.1.1-dev.jar to /home/jenkins/.hudson/jobs/gazelle-x-validation-nbt/workspace/gazelle-x-validation-core/target/appassembler/repo/stax/stax/1.1.1-dev/stax-1.1.1-dev.jar
[INFO] Installing artifact /home/jenkins/.m2/repository/commons-cli/commons-cli/1.2/commons-cli-1.2.jar to /home/jenkins/.hudson/jobs/gazelle-x-validation-nbt/workspace/gazelle-x-validation-core/target/appassembler/repo/commons-cli/commons-cli/1.2/commons-cli-1.2.jar
[INFO] Installing artifact /home/jenkins/.m2/repository/org/jboss/spec/javax/ws/rs/jboss-jaxrs-api_1.1_spec/1.0.0.Final/jboss-jaxrs-api_1.1_spec-1.0.0.Final.jar to /home/jenkins/.hudson/jobs/gazelle-x-validation-nbt/workspace/gazelle-x-validation-core/target/appassembler/repo/org/jboss/spec/javax/ws/rs/jboss-jaxrs-api_1.1_spec/1.0.0.Final/jboss-jaxrs-api_1.1_spec-1.0.0.Final.jar
[INFO] Installing artifact /home/jenkins/.m2/repository/log4j/log4j/1.2.14/log4j-1.2.14.jar to /home/jenkins/.hudson/jobs/gazelle-x-validation-nbt/workspace/gazelle-x-validation-core/target/appassembler/repo/log4j/log4j/1.2.14/log4j-1.2.14.jar
[INFO] Installing artifact /home/jenkins/.m2/repository/stax/stax-api/1.0/stax-api-1.0.jar to /home/jenkins/.hudson/jobs/gazelle-x-validation-nbt/workspace/gazelle-x-validation-core/target/appassembler/repo/stax/stax-api/1.0/stax-api-1.0.jar
[INFO] Installing artifact /home/jenkins/.m2/repository/com/pixelmed/dicom/20140816/dicom-20140816.jar to /home/jenkins/.hudson/jobs/gazelle-x-validation-nbt/workspace/gazelle-x-validation-core/target/appassembler/repo/com/pixelmed/dicom/20140816/dicom-20140816.jar
[INFO] Installing artifact /home/jenkins/.m2/repository/dcm4che/tool/dcm4che-tool-dcm2xml/2.0.28/dcm4che-tool-dcm2xml-2.0.28.jar to /home/jenkins/.hudson/jobs/gazelle-x-validation-nbt/workspace/gazelle-x-validation-core/target/appassembler/repo/dcm4che/tool/dcm4che-tool-dcm2xml/2.0.28/dcm4che-tool-dcm2xml-2.0.28.jar
[INFO] Installing artifact /home/jenkins/.m2/repository/dcm4che/dcm4che-core/2.0.28/dcm4che-core-2.0.28.jar to /home/jenkins/.hudson/jobs/gazelle-x-validation-nbt/workspace/gazelle-x-validation-core/target/appassembler/repo/dcm4che/dcm4che-core/2.0.28/dcm4che-core-2.0.28.jar
[INFO] Installing artifact /home/jenkins/.m2/repository/org/slf4j/slf4j-log4j12/1.6.1/slf4j-log4j12-1.6.1.jar to /home/jenkins/.hudson/jobs/gazelle-x-validation-nbt/workspace/gazelle-x-validation-core/target/appassembler/repo/org/slf4j/slf4j-log4j12/1.6.1/slf4j-log4j12-1.6.1.jar
[INFO] Installing artifact /home/jenkins/.m2/repository/ca/uhn/hapi/hapi-base/2.2/hapi-base-2.2.jar to /home/jenkins/.hudson/jobs/gazelle-x-validation-nbt/workspace/gazelle-x-validation-core/target/appassembler/repo/ca/uhn/hapi/hapi-base/2.2/hapi-base-2.2.jar
[INFO] Installing artifact /home/jenkins/.m2/repository/ca/uhn/hapi/hapi-structures-v23/2.2/hapi-structures-v23-2.2.jar to /home/jenkins/.hudson/jobs/gazelle-x-validation-nbt/workspace/gazelle-x-validation-core/target/appassembler/repo/ca/uhn/hapi/hapi-structures-v23/2.2/hapi-structures-v23-2.2.jar
[INFO] Installing artifact /home/jenkins/.m2/repository/ca/uhn/hapi/hapi-structures-v231/2.2/hapi-structures-v231-2.2.jar to /home/jenkins/.hudson/jobs/gazelle-x-validation-nbt/workspace/gazelle-x-validation-core/target/appassembler/repo/ca/uhn/hapi/hapi-structures-v231/2.2/hapi-structures-v231-2.2.jar
[INFO] Installing artifact /home/jenkins/.m2/repository/ca/uhn/hapi/hapi-structures-v24/2.2/hapi-structures-v24-2.2.jar to /home/jenkins/.hudson/jobs/gazelle-x-validation-nbt/workspace/gazelle-x-validation-core/target/appassembler/repo/ca/uhn/hapi/hapi-structures-v24/2.2/hapi-structures-v24-2.2.jar
[INFO] Installing artifact /home/jenkins/.m2/repository/ca/uhn/hapi/hapi-structures-v251/2.2/hapi-structures-v251-2.2.jar to /home/jenkins/.hudson/jobs/gazelle-x-validation-nbt/workspace/gazelle-x-validation-core/target/appassembler/repo/ca/uhn/hapi/hapi-structures-v251/2.2/hapi-structures-v251-2.2.jar
[INFO] Installing artifact /home/jenkins/.m2/repository/ca/uhn/hapi/hapi-structures-v26/2.2/hapi-structures-v26-2.2.jar to /home/jenkins/.hudson/jobs/gazelle-x-validation-nbt/workspace/gazelle-x-validation-core/target/appassembler/repo/ca/uhn/hapi/hapi-structures-v26/2.2/hapi-structures-v26-2.2.jar
[INFO] Installing artifact /home/jenkins/.m2/repository/ca/uhn/hapi/hapi-structures-v25/2.2/hapi-structures-v25-2.2.jar to /home/jenkins/.hudson/jobs/gazelle-x-validation-nbt/workspace/gazelle-x-validation-core/target/appassembler/repo/ca/uhn/hapi/hapi-structures-v25/2.2/hapi-structures-v25-2.2.jar
[INFO] Installing artifact /home/jenkins/.m2/repository/net/ihe/gazelle/ihe-xmltools-jar/1.0.2/ihe-xmltools-jar-1.0.2.jar to /home/jenkins/.hudson/jobs/gazelle-x-validation-nbt/workspace/gazelle-x-validation-core/target/appassembler/repo/net/ihe/gazelle/ihe-xmltools-jar/1.0.2/ihe-xmltools-jar-1.0.2.jar
[INFO] Installing artifact /home/jenkins/.m2/repository/commons-lang/commons-lang/2.6/commons-lang-2.6.jar to /home/jenkins/.hudson/jobs/gazelle-x-validation-nbt/workspace/gazelle-x-validation-core/target/appassembler/repo/commons-lang/commons-lang/2.6/commons-lang-2.6.jar
[INFO] Installing artifact /home/jenkins/.hudson/jobs/gazelle-x-validation-nbt/workspace/gazelle-x-validation-core/target/gazelle-x-validation-core.jar to /home/jenkins/.hudson/jobs/gazelle-x-validation-nbt/workspace/gazelle-x-validation-core/target/appassembler/repo/net/ihe/gazelle/gazelle-x-validation-core/1.4.0-SNAPSHOT/gazelle-x-validation-core-1.4.0-SNAPSHOT.jar
[INFO] 
[INFO] --- maven-assembly-plugin:2.2.1:single (default) @ gazelle-x-validation-core ---
[INFO] Building zip: /home/jenkins/.hudson/jobs/gazelle-x-validation-nbt/workspace/gazelle-x-validation-core/target/gazelle-x-validation-core-bin.zip
[INFO] 
[INFO] --- maven-install-plugin:2.4:install (default-install) @ gazelle-x-validation-core ---
[INFO] Installing /home/jenkins/.hudson/jobs/gazelle-x-validation-nbt/workspace/gazelle-x-validation-core/target/gazelle-x-validation-core.jar to /home/jenkins/.m2/repository/net/ihe/gazelle/gazelle-x-validation-core/1.4.0-SNAPSHOT/gazelle-x-validation-core-1.4.0-SNAPSHOT.jar
[INFO] Installing /home/jenkins/.hudson/jobs/gazelle-x-validation-nbt/workspace/gazelle-x-validation-core/pom.xml to /home/jenkins/.m2/repository/net/ihe/gazelle/gazelle-x-validation-core/1.4.0-SNAPSHOT/gazelle-x-validation-core-1.4.0-SNAPSHOT.pom
[INFO] Installing /home/jenkins/.hudson/jobs/gazelle-x-validation-nbt/workspace/gazelle-x-validation-core/target/gazelle-x-validation-core-sources.jar to /home/jenkins/.m2/repository/net/ihe/gazelle/gazelle-x-validation-core/1.4.0-SNAPSHOT/gazelle-x-validation-core-1.4.0-SNAPSHOT-sources.jar
[INFO] Installing /home/jenkins/.hudson/jobs/gazelle-x-validation-nbt/workspace/gazelle-x-validation-core/target/gazelle-x-validation-core-tests.jar to /home/jenkins/.m2/repository/net/ihe/gazelle/gazelle-x-validation-core/1.4.0-SNAPSHOT/gazelle-x-validation-core-1.4.0-SNAPSHOT-tests.jar
[INFO] Installing /home/jenkins/.hudson/jobs/gazelle-x-validation-nbt/workspace/gazelle-x-validation-core/target/gazelle-x-validation-core-bin.zip to /home/jenkins/.m2/repository/net/ihe/gazelle/gazelle-x-validation-core/1.4.0-SNAPSHOT/gazelle-x-validation-core-1.4.0-SNAPSHOT-bin.zip