FailedConsole Output

Started by timer
Running as SYSTEM
[EnvInject] - Loading node environment variables.
Building on master in workspace /home/jenkins/.hudson/jobs/gocmodel-jar/workspace
[WS-CLEANUP] Deleting project workspace...
[WS-CLEANUP] Deferred wipeout is used...
[WS-CLEANUP] Done
Cleaning local Directory gocmodel-jar
Checking out svn+ssh://scm.gforge.inria.fr/svn/gazelle/validators/hl7templates/gocmodel-jar/trunk at revision '2021-01-23T02:23:00.696 +0100'
Using sole credentials gazelle-jenkins in realm ‘svn+ssh://scm.gforge.inria.fr’
Using sole credentials gazelle-jenkins in realm ‘svn+ssh://scm.gforge.inria.fr’
A         src
A         src/main
A         src/main/java
A         src/main/java/net
A         src/main/java/net/ihe
A         src/main/java/net/ihe/gazelle
A         src/main/java/net/ihe/gazelle/goc
A         src/main/java/net/ihe/gazelle/goc/template
A         src/main/java/net/ihe/gazelle/goc/template/definer
A         src/main/java/net/ihe/gazelle/goc/template/definer/model
AU        src/main/java/net/ihe/gazelle/goc/template/definer/model/package-info.java
AU        src/main/java/net/ihe/gazelle/goc/template/definer/model/ConstraintType.java
AU        src/main/java/net/ihe/gazelle/goc/template/definer/model/TemplateSpec.java
AU        src/main/java/net/ihe/gazelle/goc/template/definer/model/ConstraintDoc.java
AU        src/main/java/net/ihe/gazelle/goc/template/definer/model/ConstraintKind.java
AU        src/main/java/net/ihe/gazelle/goc/template/definer/model/Taml.java
AU        src/main/java/net/ihe/gazelle/goc/template/definer/model/ObjectFactory.java
AU        src/main/java/net/ihe/gazelle/goc/template/definer/model/AdvancedTemplate.java
AU        src/main/java/net/ihe/gazelle/goc/template/definer/model/ConstraintsSpec.java
A         src/main/java/net/ihe/gazelle/goc/ecore
AU        src/main/java/net/ihe/gazelle/goc/ecore/ObjectFactory.java
AU        src/main/java/net/ihe/gazelle/goc/ecore/EPackage.java
AU        src/main/java/net/ihe/gazelle/goc/ecore/package-info.java
A         src/main/java/net/ihe/gazelle/goc/uml
AU        src/main/java/net/ihe/gazelle/goc/uml/package-info.java
AU        src/main/java/net/ihe/gazelle/goc/uml/ObjectFactory.java
AU        src/main/java/net/ihe/gazelle/goc/uml/Model.java
A         src/main/java/net/ihe/gazelle/goc/uml/utils
AU        src/main/java/net/ihe/gazelle/goc/uml/utils/PathWithDT.java
AU        src/main/java/net/ihe/gazelle/goc/uml/utils/UmlServices.java
AU        src/main/java/net/ihe/gazelle/goc/uml/utils/ElementImportUtil.java
AU        src/main/java/net/ihe/gazelle/goc/uml/utils/OwnedRuleUtil.java
AU        src/main/java/net/ihe/gazelle/goc/uml/utils/CDAClassesMap.java
AU        src/main/java/net/ihe/gazelle/goc/uml/utils/GOCModelMarshaller.java
AU        src/main/java/net/ihe/gazelle/goc/uml/utils/TemplateSpecUtil.java
AU        src/main/java/net/ihe/gazelle/goc/uml/utils/UMLLoader.java
AU        src/main/java/net/ihe/gazelle/goc/uml/utils/ModelDescriberInitializer.java
AU        src/main/java/net/ihe/gazelle/goc/uml/utils/PackagedElementUtil.java
AU        src/main/java/net/ihe/gazelle/goc/uml/utils/UMLPrimitiveType.java
AU        src/main/java/net/ihe/gazelle/goc/uml/utils/TAMLUtil.java
AU        src/main/java/net/ihe/gazelle/goc/uml/utils/XMIUtil.java
AU        src/main/java/net/ihe/gazelle/goc/uml/utils/PathWithDTUtil.java
A         src/main/java/net/ihe/gazelle/goc/xmi
AU        src/main/java/net/ihe/gazelle/goc/xmi/package-info.java
AU        src/main/java/net/ihe/gazelle/goc/xmi/XMIMarshaller.java
AU        src/main/java/net/ihe/gazelle/goc/xmi/XMI.java
AU        src/main/java/net/ihe/gazelle/goc/xmi/ObjectFactory.java
A         src/main/java/net/ihe/gazelle/goc/umlmodel
A         src/main/java/net/ihe/gazelle/goc/umlmodel/util
AU        src/main/java/net/ihe/gazelle/goc/umlmodel/util/ModelsDefinitionUtil.java
AU        src/main/java/net/ihe/gazelle/goc/umlmodel/util/ModelDescriberUtil.java
A         src/main/java/net/ihe/gazelle/goc/umlmodel/model
AU        src/main/java/net/ihe/gazelle/goc/umlmodel/model/ModelDescriber.java
AU        src/main/java/net/ihe/gazelle/goc/umlmodel/model/UMLModelsDescription.java
AU        src/main/java/net/ihe/gazelle/goc/umlmodel/model/ModelsDefinition.java
AU        src/main/java/net/ihe/gazelle/goc/umlmodel/model/ModelUMLDesc.java
AU        src/main/java/net/ihe/gazelle/goc/umlmodel/model/ObjectFactory.java
A         src/main/java/net/ihe/gazelle/goc/xmm
AU        src/main/java/net/ihe/gazelle/goc/xmm/ElementImport.java
AU        src/main/java/net/ihe/gazelle/goc/xmm/ProfileApplication.java
AU        src/main/java/net/ihe/gazelle/goc/xmm/package-info.java
AU        src/main/java/net/ihe/gazelle/goc/xmm/PackageImport.java
AU        src/main/java/net/ihe/gazelle/goc/xmm/ImportedElement.java
AU        src/main/java/net/ihe/gazelle/goc/xmm/ObjectFactory.java
AU        src/main/java/net/ihe/gazelle/goc/xmm/AppliedProfile.java
AU        src/main/java/net/ihe/gazelle/goc/xmm/ImportedPackage.java
AU        src/main/java/net/ihe/gazelle/goc/xmm/OwnedComment.java
AU        src/main/java/net/ihe/gazelle/goc/xmm/EAnnotations.java
AU        src/main/java/net/ihe/gazelle/goc/xmm/OwnedRule.java
AU        src/main/java/net/ihe/gazelle/goc/xmm/OwnedRuleType.java
AU        src/main/java/net/ihe/gazelle/goc/xmm/PackagedElement.java
AU        src/main/java/net/ihe/gazelle/goc/xmm/OwnedRuleKind.java
AU        src/main/java/net/ihe/gazelle/goc/xmm/Generalization.java
AU        src/main/java/net/ihe/gazelle/goc/xmm/General.java
AU        src/main/java/net/ihe/gazelle/goc/xmm/Specification.java
AU        src/main/java/net/ihe/gazelle/goc/xmm/References.java
A         src/main/java/net/ihe/gazelle/goc/scripts
AU        src/main/java/net/ihe/gazelle/goc/scripts/AssertionGeneratorHPD.java
AU        src/main/java/net/ihe/gazelle/goc/scripts/AssertionGenerator.java
A         src/main/resources
AU        src/main/resources/assertionshpd.properties
AU        src/main/resources/assertions.properties
AU        src/main/resources/log4j.properties
A         src/test
A         src/test/resources
AU        src/test/resources/test.xmi
A         src/test/resources/testModels1-jenkins.xml
AU        src/test/resources/testModels1.xml
AU        src/test/resources/testModels2.xml
A         src/test/java
A         src/test/java/net
A         src/test/java/net/ihe
A         src/test/java/net/ihe/gazelle
A         src/test/java/net/ihe/gazelle/goc
A         src/test/java/net/ihe/gazelle/goc/model
A         src/test/java/net/ihe/gazelle/goc/model/test
AU        src/test/java/net/ihe/gazelle/goc/model/test/ModelsDefinitionUtilTest.java
AU        src/test/java/net/ihe/gazelle/goc/model/test/TAMLUtilTest.java
AU        src/test/java/net/ihe/gazelle/goc/model/test/XMIUtilTest.java
AU        src/test/java/net/ihe/gazelle/goc/model/test/UmlServicesTest.java
AU        src/test/java/net/ihe/gazelle/goc/model/test/OwnedRuleUtilTest.java
AU        src/test/java/net/ihe/gazelle/goc/model/test/CDAClassesMapTest.java
AU        src/test/java/net/ihe/gazelle/goc/model/test/GOCModelMarshallerTest.java
AU        src/test/java/net/ihe/gazelle/goc/model/test/PackagedElementUtilTest.java
AU        src/test/java/net/ihe/gazelle/goc/model/test/XMIMarshallerTest.java
AU        src/test/java/net/ihe/gazelle/goc/model/test/PathWithDTUtilTest.java
AU        src/test/java/net/ihe/gazelle/goc/model/test/PathWithDTTest.java
AU        src/test/java/net/ihe/gazelle/goc/model/test/ModelDescriberUtilTest.java
AU        src/test/java/net/ihe/gazelle/goc/model/test/ElementImportUtilTest.java
AU        src/test/java/net/ihe/gazelle/goc/model/test/ModelDescriberTest.java
AU        src/test/java/net/ihe/gazelle/goc/model/test/TemplateSpecUtilTest.java
AU        src/test/java/net/ihe/gazelle/goc/model/test/UMLLoaderTest.java
AU        src/test/java/net/ihe/gazelle/goc/model/test/ModelDescriberInitializerTest.java
AU        src/test/java/net/ihe/gazelle/goc/model/test/UMLPrimitiveTypeTest.java
A         src/test/java/net/ihe/gazelle/goc/scoring
A         src/test/java/net/ihe/gazelle/goc/scoring/actiontest
AU        src/test/java/net/ihe/gazelle/goc/scoring/actiontest/CalculMath.java
AU        src/test/java/net/ihe/gazelle/goc/scoring/actiontest/CalculMath2.java
AU        src/test/java/net/ihe/gazelle/goc/scoring/actiontest/CalculMath3.java
AU        src/test/java/net/ihe/gazelle/goc/scoring/actiontest/MatrixViewer.java
A         src/test/java/net/ihe/gazelle/goc/scripts
AU        src/test/java/net/ihe/gazelle/goc/scripts/ExtractChildDT.java
AU        src/test/java/net/ihe/gazelle/goc/scripts/GenerateDefaultDT.java
AU        pom.xml
 U        .
At revision 69046

Cleaning local Directory cda-model
Checking out svn+ssh://scm.gforge.inria.fr/svn/gazelle/validators/models/cda-model/trunk at revision '2021-01-23T02:23:00.696 +0100'
Using sole credentials gazelle-jenkins in realm ‘svn+ssh://scm.gforge.inria.fr’
Using sole credentials gazelle-jenkins in realm ‘svn+ssh://scm.gforge.inria.fr’
A         resources
A         resources/xsd
A         resources/xsd/cda-modif
A         resources/xsd/cda-modif/infrastructure
A         resources/xsd/cda-modif/infrastructure/cda
AU        resources/xsd/cda-modif/infrastructure/cda/CDA.xsd
AU        resources/xsd/cda-modif/infrastructure/cda/POCD_MT000040.xsd
A         resources/xsd/cda-modif/processable
A         resources/xsd/cda-modif/processable/coreschemas
AU        resources/xsd/cda-modif/processable/coreschemas/datatypes.xsd
AU        resources/xsd/cda-modif/processable/coreschemas/NarrativeBlock.xsd
AU        resources/xsd/cda-modif/processable/coreschemas/datatypes-base.xsd
AU        resources/xsd/cda-modif/processable/coreschemas/voc.xsd
A         tmp
A         chain
A         chain/cda-editor-war.chain
A         chain/cda-validator-jar.chain
A         chain/cda-editor-jar.chain
A         chain/cda-code-jar.chain
A         chain/cda-constraint.chain
A         chain/constraint-gen.chain
AU        chain/default.properties
A         chain/cda-doc-war.chain
A         models
A         models/cda.umldi
AU        models/cda.uml
AU        .project
At revision 69046

Cleaning local Directory datatypes-model
Checking out svn+ssh://scm.gforge.inria.fr/svn/gazelle/validators/models/datatypes-model/trunk at revision '2021-01-23T02:23:00.696 +0100'
Using sole credentials gazelle-jenkins in realm ‘svn+ssh://scm.gforge.inria.fr’
Using sole credentials gazelle-jenkins in realm ‘svn+ssh://scm.gforge.inria.fr’
A         resources
A         tmp
A         chain
A         chain/datatypes-code-jar.chain
A         chain/datatypes-constraint.chain
A         chain/datatypes-editor-war.chain
A         chain/constraint-gen.chain
A         chain/datatypes-validator-jar.chain
A         chain/datatypes-editor-jar.chain
AU        chain/default.properties
A         models
A         models/datatypes.umldi
AU        models/datatypes.uml
AU        .project
At revision 69046

Cleaning local Directory common-models
Checking out svn+ssh://scm.gforge.inria.fr/svn/gazelle/validators/models/common-models/trunk at revision '2021-01-23T02:23:00.696 +0100'
Using sole credentials gazelle-jenkins in realm ‘svn+ssh://scm.gforge.inria.fr’
Using sole credentials gazelle-jenkins in realm ‘svn+ssh://scm.gforge.inria.fr’
A         img
AU        img/contentsJR.gif
A         .settings
AU        .settings/org.eclipse.jdt.core.prefs
AU        .classpath
A         models
A         models/common-profile.umldi
A         models/cda-profiles.umldi
A         models/common.umldi
AU        models/common-profile.uml
AU        models/cda-profiles.uml
AU        models/common.uml
AU        .project
A         src
At revision 69046

Cleaning local Directory nblock-model
Checking out svn+ssh://scm.gforge.inria.fr/svn/gazelle/validators/models/nblock-model/trunk at revision '2021-01-23T02:23:00.696 +0100'
Using sole credentials gazelle-jenkins in realm ‘svn+ssh://scm.gforge.inria.fr’
Using sole credentials gazelle-jenkins in realm ‘svn+ssh://scm.gforge.inria.fr’
A         tmp
A         chain
A         chain/nblock-code-jar.chain
A         chain/nblock-constraint.chain
AU        chain/default.properties
A         chain/nblock-editor-war.chain
A         chain/nblock-validator-jar.chain
A         chain/nblock-editor-jar.chain
A         models
AU        models/nblock.uml
A         models/nblock.umldi
AU        .project
At revision 69046

Cleaning local Directory voc-model
Checking out svn+ssh://scm.gforge.inria.fr/svn/gazelle/validators/models/voc-model/trunk at revision '2021-01-23T02:23:00.696 +0100'
Using sole credentials gazelle-jenkins in realm ‘svn+ssh://scm.gforge.inria.fr’
Using sole credentials gazelle-jenkins in realm ‘svn+ssh://scm.gforge.inria.fr’
A         tmp
A         chain
AU        chain/default.properties
A         chain/voc-code-jar.chain
A         models
A         models/voc.umldi
AU        models/voc.uml
AU        .project
A         resources
At revision 69046

Cleaning local Directory hl7templates-resources
Checking out svn+ssh://scm.gforge.inria.fr/svn/gazelle/validators/hl7templates/hl7templates-resources/trunk at revision '2021-01-23T02:23:00.696 +0100'
Using sole credentials gazelle-jenkins in realm ‘svn+ssh://scm.gforge.inria.fr’
Using sole credentials gazelle-jenkins in realm ‘svn+ssh://scm.gforge.inria.fr’
A         cdabasic
AU        cdabasic/choicesDefault.xml
AU        cdabasic/distinguishers.xml
AU        cdabasic/attrDTs.xml
AU        cdabasic/modelsDefinition.xml
AU        cdabasic/templatesTypeMapping.xml
AU        cdabasic/datatypes.xml
AU        modelsDefinition.xsd
AU        templatesTypeMapping.xsd
A         uml
A         uml/profiles
AU        uml/profiles/UML2.profile.properties
AU        uml/profiles/Standard.profile.properties
A         uml/profiles/UML2.profile.uml
A         uml/profiles/Standard.profile.uml
AU        uml/profiles/Ecore.profile.properties
A         uml/profiles/Ecore.profile.uml
A         cdapharm
AU        cdapharm/distinguishers.xml
AU        cdapharm/attrDTs.xml
AU        cdapharm/modelsDefinition.xml
AU        cdapharm/templatesTypeMapping.xml
AU        cdapharm/datatypes.xml
AU        cdapharm/choicesDefault.xml
A         cdaepsos
AU        cdaepsos/choicesDefault.xml
AU        cdaepsos/distinguishers.xml
AU        cdaepsos/attrDTs.xml
AU        cdaepsos/modelsDefinition.xml
AU        cdaepsos/templatesTypeMapping.xml
AU        cdaepsos/datatypes.xml
 U        .
At revision 69046

Cleaning local Directory cdaepsos-model
Checking out svn+ssh://scm.gforge.inria.fr/svn/gazelle/validators/models/cdaepsos-model/trunk at revision '2021-01-23T02:23:00.696 +0100'
Using sole credentials gazelle-jenkins in realm ‘svn+ssh://scm.gforge.inria.fr’
Using sole credentials gazelle-jenkins in realm ‘svn+ssh://scm.gforge.inria.fr’
A         modelsad
AU        modelsad/cdaepsos.uml
A         modelsad/cda.umldi
AU        modelsad/cda.uml
AU        modelsad/medication.uml
A         modelsad/cdaepsos.umldi
A         chain
AU        chain/default.properties
A         chain/cdaepsos-code-jar.chain
A         models
A         models/medication.umldi
AU        models/medication.uml
A         models/cdaepsos.umldi
AU        models/cdaepsos.uml
A         modelad2
A         modelad2/cda.umldi
AU        modelad2/cda.uml
A         modelad2/medication.umldi
AU        modelad2/medication.uml
 U        .
At revision 69046

No changes for svn+ssh://scm.gforge.inria.fr/svn/gazelle/validators/hl7templates/gocmodel-jar/trunk since the previous build
No changes for svn+ssh://scm.gforge.inria.fr/svn/gazelle/validators/models/cda-model/trunk since the previous build
No changes for svn+ssh://scm.gforge.inria.fr/svn/gazelle/validators/models/datatypes-model/trunk since the previous build
No changes for svn+ssh://scm.gforge.inria.fr/svn/gazelle/validators/models/common-models/trunk since the previous build
No changes for svn+ssh://scm.gforge.inria.fr/svn/gazelle/validators/models/nblock-model/trunk since the previous build
No changes for svn+ssh://scm.gforge.inria.fr/svn/gazelle/validators/models/voc-model/trunk since the previous build
No changes for svn+ssh://scm.gforge.inria.fr/svn/gazelle/validators/hl7templates/hl7templates-resources/trunk since the previous build
No changes for svn+ssh://scm.gforge.inria.fr/svn/gazelle/validators/models/cdaepsos-model/trunk since the previous build
Injecting SonarQube environment variables using the configuration: Sonar
[workspace] $ /bin/bash -xe /tmp/jenkins1721945506963869856.sh
+ sed -i -e 's#/home\/aboufahj\/workspaceTopcased#/home\/jenkins\/.hudson\/jobs\/gocmodel-jar\/workspace#g' gocmodel-jar/src/test/resources/testModels1.xml
+ sed -i -e 's#/home\/aboufahj\/workspaceTopcased#/home\/jenkins\/.hudson\/jobs\/gocmodel-jar\/workspace#g' gocmodel-jar/src/test/resources/testModels2.xml
+ sed -i -e 's#/home\/aboufahj\/workspaceTopcased#/home\/jenkins\/.hudson\/jobs\/gocmodel-jar\/workspace#g' hl7templates-resources/cdabasic/modelsDefinition.xml
Parsing POMs
Established TCP socket on 33677
[gocmodel-jar] $ /usr/lib/jvm/java-8-oracle//bin/java -Djava.net.preferIPv4Stack=true -Dfile.encoding=UTF8 -Xmx4096m -XX:MaxPermSize=1024m -cp /home/jenkins/.hudson/plugins/maven-plugin/WEB-INF/lib/maven35-agent-1.13.jar:/home/jenkins/.hudson/tools/hudson.tasks.Maven_MavenInstallation/Maven3/boot/plexus-classworlds-2.5.2.jar:/home/jenkins/.hudson/tools/hudson.tasks.Maven_MavenInstallation/Maven3/conf/logging jenkins.maven3.agent.Maven35Main /home/jenkins/.hudson/tools/hudson.tasks.Maven_MavenInstallation/Maven3 /home/jenkins/.hudson/war/WEB-INF/lib/remoting-4.6.jar /home/jenkins/.hudson/plugins/maven-plugin/WEB-INF/lib/maven35-interceptor-1.13.jar /home/jenkins/.hudson/plugins/maven-plugin/WEB-INF/lib/maven3-interceptor-commons-1.13.jar 33677
Java HotSpot(TM) 64-Bit Server VM warning: ignoring option MaxPermSize=1024m; support was removed in 8.0
<===[JENKINS REMOTING CAPACITY]===>channel started
Executing Maven:  -B -f /home/jenkins/.hudson/jobs/gocmodel-jar/workspace/gocmodel-jar/pom.xml clean install site org.sonarsource.scanner.maven:sonar-maven-plugin:sonar -Djavax.net.ssl.trustStore=/opt/gazelle/cert/truststore.jks -Djavax.net.ssl.trustStorePassword=password
[INFO] Scanning for projects...
[INFO] 
[INFO] ------------------------------------------------------------------------
[INFO] Building gocmodel-jar 1.1.1-SNAPSHOT
[INFO] ------------------------------------------------------------------------
[WARNING] The POM for net.ihe.gazelle:AssertionManagerGui-model:jar:4.1.0 is invalid, transitive dependencies (if any) will not be available, enable debug logging for more details
[INFO] 
[INFO] --- maven-clean-plugin:2.5:clean (default-clean) @ gocmodel-jar ---
[INFO] 
[INFO] --- jacoco-maven-plugin:0.7.9:prepare-agent (default-prepare-agent) @ gocmodel-jar ---
[INFO] argLine set to -javaagent:/home/jenkins/.m2/repository/org/jacoco/org.jacoco.agent/0.7.9/org.jacoco.agent-0.7.9-runtime.jar=destfile=/home/jenkins/.hudson/jobs/gocmodel-jar/workspace/gocmodel-jar/target/jacoco.exec
[INFO] 
[INFO] --- maven-resources-plugin:2.6:resources (default-resources) @ gocmodel-jar ---
[INFO] Using 'UTF-8' encoding to copy filtered resources.
[INFO] Copying 3 resources
[INFO] 
[INFO] --- maven-compiler-plugin:3.6.1:compile (default-compile) @ gocmodel-jar ---
[INFO] Changes detected - recompiling the module!
[INFO] Compiling 60 source files to /home/jenkins/.hudson/jobs/gocmodel-jar/workspace/gocmodel-jar/target/classes
[INFO] 
[INFO] --- maven-resources-plugin:2.6:testResources (default-testResources) @ gocmodel-jar ---
[INFO] Using 'UTF-8' encoding to copy filtered resources.
[INFO] Copying 4 resources
[INFO] 
[INFO] --- maven-compiler-plugin:3.6.1:testCompile (default-testCompile) @ gocmodel-jar ---
[INFO] Changes detected - recompiling the module!
[INFO] Compiling 24 source files to /home/jenkins/.hudson/jobs/gocmodel-jar/workspace/gocmodel-jar/target/test-classes
[INFO] 
[INFO] --- maven-surefire-plugin:2.20:test (default-test) @ gocmodel-jar ---
[INFO] 
[INFO] -------------------------------------------------------
[INFO]  T E S T S
[INFO] -------------------------------------------------------
[INFO] Running net.ihe.gazelle.goc.model.test.ModelsDefinitionUtilTest
[INFO] Tests run: 1, Failures: 0, Errors: 0, Skipped: 0, Time elapsed: 0.201 s - in net.ihe.gazelle.goc.model.test.ModelsDefinitionUtilTest
[INFO] Running net.ihe.gazelle.goc.model.test.XMIMarshallerTest
<?xml version="1.0" encoding="UTF-8" standalone="yes"?>
<xmi:XMI xmlns:uml="http://www.eclipse.org/uml2/3.0.0/UML" xmlns:ecore="http://www.eclipse.org/emf/2002/Ecore" xmlns:TemplateDefiner="http:///schemas/TemplateDefiner/_L1F1MLk9EeadT_oVto_uPg/43" xmlns:xmi="http://schema.omg.org/spec/XMI/2.1" xmlns:Ecore="http://www.eclipse.org/uml2/schemas/Ecore/5">
    <uml:Model>
        <packagedElement xmi:id="test"/>
    </uml:Model>
    <TemplateDefiner:TemplateSpec id="_lofNYF0ZEeurNvW9x4X5qw"/>
</xmi:XMI>

[INFO] Tests run: 5, Failures: 0, Errors: 0, Skipped: 0, Time elapsed: 0.209 s - in net.ihe.gazelle.goc.model.test.XMIMarshallerTest
[INFO] Running net.ihe.gazelle.goc.model.test.OwnedRuleUtilTest
aaaa026
[INFO] Tests run: 5, Failures: 0, Errors: 0, Skipped: 0, Time elapsed: 0.001 s - in net.ihe.gazelle.goc.model.test.OwnedRuleUtilTest
[INFO] Running net.ihe.gazelle.goc.model.test.TemplateSpecUtilTest
[INFO] Tests run: 2, Failures: 0, Errors: 0, Skipped: 0, Time elapsed: 0.001 s - in net.ihe.gazelle.goc.model.test.TemplateSpecUtilTest
[INFO] Running net.ihe.gazelle.goc.model.test.UMLPrimitiveTypeTest
[INFO] Tests run: 2, Failures: 0, Errors: 0, Skipped: 0, Time elapsed: 0.001 s - in net.ihe.gazelle.goc.model.test.UMLPrimitiveTypeTest
[INFO] Running net.ihe.gazelle.goc.model.test.PackagedElementUtilTest
21/01/23 02:23:24 INFO utils.ModelDescriberInitializer: modelDefinition path = ../hl7templates-resources/cdabasic/modelsDefinition.xml
21/01/23 02:23:24 INFO utils.UMLLoader: ../hl7templates-resources
21/01/23 02:23:26 INFO utils.UMLLoader: Model: load complete
21/01/23 02:23:26 INFO utils.UMLLoader: model name = datatypes
21/01/23 02:23:26 INFO utils.UMLLoader: ../hl7templates-resources
21/01/23 02:23:28 INFO utils.UMLLoader: Model: load complete
21/01/23 02:23:28 INFO utils.UMLLoader: model name = cda
21/01/23 02:23:28 INFO utils.UMLLoader: ../hl7templates-resources
21/01/23 02:23:28 INFO utils.UMLLoader: Model: load complete
21/01/23 02:23:28 INFO utils.UMLLoader: model name = nblock
21/01/23 02:23:28 INFO utils.UMLLoader: ../hl7templates-resources
21/01/23 02:23:28 INFO utils.UMLLoader: Model: load complete
21/01/23 02:23:28 INFO utils.UMLLoader: model name = voc
21/01/23 02:23:28 INFO utils.UMLLoader: ../hl7templates-resources
21/01/23 02:23:29 INFO utils.UMLLoader: Model: load complete
21/01/23 02:23:29 INFO utils.UMLLoader: model name = CommonClasses
[INFO] Tests run: 4, Failures: 0, Errors: 0, Skipped: 0, Time elapsed: 4.581 s - in net.ihe.gazelle.goc.model.test.PackagedElementUtilTest
[INFO] Running net.ihe.gazelle.goc.model.test.PathWithDTTest
[INFO] Tests run: 6, Failures: 0, Errors: 0, Skipped: 0, Time elapsed: 0.001 s - in net.ihe.gazelle.goc.model.test.PathWithDTTest
[INFO] Running net.ihe.gazelle.goc.model.test.ElementImportUtilTest
[INFO] Tests run: 2, Failures: 0, Errors: 0, Skipped: 0, Time elapsed: 0 s - in net.ihe.gazelle.goc.model.test.ElementImportUtilTest
[INFO] Running net.ihe.gazelle.goc.model.test.ModelDescriberTest
[INFO] Tests run: 8, Failures: 0, Errors: 0, Skipped: 0, Time elapsed: 0 s - in net.ihe.gazelle.goc.model.test.ModelDescriberTest
[INFO] Running net.ihe.gazelle.goc.model.test.TAMLUtilTest
[INFO] Tests run: 1, Failures: 0, Errors: 0, Skipped: 0, Time elapsed: 0 s - in net.ihe.gazelle.goc.model.test.TAMLUtilTest
[INFO] Running net.ihe.gazelle.goc.model.test.ModelDescriberInitializerTest
21/01/23 02:23:29 INFO utils.UMLLoader: ../hl7templates-resources
21/01/23 02:23:29 INFO utils.UMLLoader: Model: load complete
21/01/23 02:23:29 INFO utils.UMLLoader: model name = datatypes
21/01/23 02:23:29 INFO utils.UMLLoader: ../hl7templates-resources
21/01/23 02:23:31 INFO utils.UMLLoader: Model: load complete
21/01/23 02:23:31 INFO utils.UMLLoader: model name = cda
21/01/23 02:23:31 INFO utils.UMLLoader: ../hl7templates-resources
21/01/23 02:23:31 INFO utils.UMLLoader: Model: load complete
21/01/23 02:23:31 INFO utils.UMLLoader: model name = nblock
21/01/23 02:23:31 INFO utils.UMLLoader: ../hl7templates-resources
21/01/23 02:23:31 INFO utils.UMLLoader: Model: load complete
21/01/23 02:23:31 INFO utils.UMLLoader: model name = voc
21/01/23 02:23:31 INFO utils.UMLLoader: ../hl7templates-resources
21/01/23 02:23:31 INFO utils.UMLLoader: Model: load complete
21/01/23 02:23:31 INFO utils.UMLLoader: model name = CommonClasses
21/01/23 02:23:31 INFO utils.UMLLoader: ../hl7templates-resources
21/01/23 02:23:32 INFO utils.UMLLoader: Model: load complete
21/01/23 02:23:32 INFO utils.UMLLoader: model name = medication
[INFO] Tests run: 2, Failures: 0, Errors: 0, Skipped: 0, Time elapsed: 3.618 s - in net.ihe.gazelle.goc.model.test.ModelDescriberInitializerTest
[INFO] Running net.ihe.gazelle.goc.model.test.GOCModelMarshallerTest
<?xml version="1.0" encoding="UTF-8" standalone="yes"?>
<packagedElement xmlns:uml="http://www.eclipse.org/uml2/3.0.0/UML" xmlns:ecore="http://www.eclipse.org/emf/2002/Ecore" xmlns:TemplateDefiner="http:///schemas/TemplateDefiner/_L1F1MLk9EeadT_oVto_uPg/43" xmlns:xmi="http://schema.omg.org/spec/XMI/2.1" xmlns:Ecore="http://www.eclipse.org/uml2/schemas/Ecore/5" xmlns:ns7="xmm" name="test"/>

[INFO] Tests run: 3, Failures: 0, Errors: 0, Skipped: 0, Time elapsed: 0.37 s - in net.ihe.gazelle.goc.model.test.GOCModelMarshallerTest
[INFO] Running net.ihe.gazelle.goc.model.test.ModelDescriberUtilTest
21/01/23 02:23:33 INFO utils.UMLLoader: ../hl7templates-resources
21/01/23 02:23:33 INFO utils.UMLLoader: Model: load complete
21/01/23 02:23:33 INFO utils.UMLLoader: model name = datatypes
21/01/23 02:23:33 INFO utils.UMLLoader: ../hl7templates-resources
21/01/23 02:23:35 INFO utils.UMLLoader: Model: load complete
21/01/23 02:23:35 INFO utils.UMLLoader: model name = cda
21/01/23 02:23:35 INFO utils.UMLLoader: ../hl7templates-resources
21/01/23 02:23:35 INFO utils.UMLLoader: Model: load complete
21/01/23 02:23:35 INFO utils.UMLLoader: model name = nblock
21/01/23 02:23:35 INFO utils.UMLLoader: ../hl7templates-resources
21/01/23 02:23:35 INFO utils.UMLLoader: Model: load complete
21/01/23 02:23:35 INFO utils.UMLLoader: model name = voc
21/01/23 02:23:35 INFO utils.UMLLoader: ../hl7templates-resources
21/01/23 02:23:35 INFO utils.UMLLoader: Model: load complete
21/01/23 02:23:35 INFO utils.UMLLoader: model name = CommonClasses
[INFO] Tests run: 1, Failures: 0, Errors: 0, Skipped: 0, Time elapsed: 2.38 s - in net.ihe.gazelle.goc.model.test.ModelDescriberUtilTest
[INFO] Running net.ihe.gazelle.goc.model.test.UMLLoaderTest
prop = POCDMT000040Section
prop = POCDMT000040Observation
prop = Double
[INFO] Tests run: 22, Failures: 0, Errors: 0, Skipped: 0, Time elapsed: 0.31 s - in net.ihe.gazelle.goc.model.test.UMLLoaderTest
[INFO] Running net.ihe.gazelle.goc.model.test.UmlServicesTest
[INFO] Tests run: 1, Failures: 0, Errors: 0, Skipped: 0, Time elapsed: 0 s - in net.ihe.gazelle.goc.model.test.UmlServicesTest
[INFO] Running net.ihe.gazelle.goc.model.test.XMIUtilTest
[INFO] Tests run: 3, Failures: 0, Errors: 0, Skipped: 0, Time elapsed: 0 s - in net.ihe.gazelle.goc.model.test.XMIUtilTest
[INFO] Running net.ihe.gazelle.goc.model.test.PathWithDTUtilTest
act.id
[INFO] Tests run: 6, Failures: 0, Errors: 0, Skipped: 0, Time elapsed: 0.004 s - in net.ihe.gazelle.goc.model.test.PathWithDTUtilTest
[INFO] Running net.ihe.gazelle.goc.model.test.CDAClassesMapTest
[INFO] Tests run: 8, Failures: 0, Errors: 0, Skipped: 0, Time elapsed: 0.002 s - in net.ihe.gazelle.goc.model.test.CDAClassesMapTest
[INFO] 
[INFO] Results:
[INFO] 
[INFO] Tests run: 82, Failures: 0, Errors: 0, Skipped: 0
[INFO] 
[JENKINS] Recording test results
[INFO] 
[INFO] --- jacoco-maven-plugin:0.7.9:report (default-report) @ gocmodel-jar ---
[INFO] Loading execution data file /home/jenkins/.hudson/jobs/gocmodel-jar/workspace/gocmodel-jar/target/jacoco.exec
[INFO] Analyzed bundle 'gocmodel-jar' with 55 classes
[INFO] 
[INFO] --- maven-jar-plugin:3.0.2:jar (default-jar) @ gocmodel-jar ---
[INFO] Building jar: /home/jenkins/.hudson/jobs/gocmodel-jar/workspace/gocmodel-jar/target/gocmodel-jar-1.1.1-SNAPSHOT.jar
[INFO] 
[INFO] --- maven-install-plugin:2.4:install (default-install) @ gocmodel-jar ---
[INFO] Installing /home/jenkins/.hudson/jobs/gocmodel-jar/workspace/gocmodel-jar/target/gocmodel-jar-1.1.1-SNAPSHOT.jar to /home/jenkins/.m2/repository/net/ihe/gazelle/gocmodel-jar/1.1.1-SNAPSHOT/gocmodel-jar-1.1.1-SNAPSHOT.jar
[INFO] Installing /home/jenkins/.hudson/jobs/gocmodel-jar/workspace/gocmodel-jar/pom.xml to /home/jenkins/.m2/repository/net/ihe/gazelle/gocmodel-jar/1.1.1-SNAPSHOT/gocmodel-jar-1.1.1-SNAPSHOT.pom
[INFO] 
[INFO] --- maven-site-plugin:3.3:site (default-site) @ gocmodel-jar ---
[INFO] configuring report plugin org.apache.maven.plugins:maven-checkstyle-plugin:2.17
[INFO] configuring report plugin org.apache.maven.plugins:maven-javadoc-plugin:2.10.4
[INFO] 
[INFO] >>> maven-javadoc-plugin:2.10.4:aggregate (report:aggregate) > generate-sources @ gocmodel-jar >>>
[INFO] 
[INFO] --- jacoco-maven-plugin:0.7.9:prepare-agent (default-prepare-agent) @ gocmodel-jar ---
[INFO] argLine set to -javaagent:/home/jenkins/.m2/repository/org/jacoco/org.jacoco.agent/0.7.9/org.jacoco.agent-0.7.9-runtime.jar=destfile=/home/jenkins/.hudson/jobs/gocmodel-jar/workspace/gocmodel-jar/target/jacoco.exec
[INFO] 
[INFO] <<< maven-javadoc-plugin:2.10.4:aggregate (report:aggregate) < generate-sources @ gocmodel-jar <<<
[INFO] 
[INFO] 
[INFO] >>> maven-javadoc-plugin:2.10.4:javadoc (report:javadoc) > generate-sources @ gocmodel-jar >>>
[INFO] 
[INFO] --- jacoco-maven-plugin:0.7.9:prepare-agent (default-prepare-agent) @ gocmodel-jar ---
[INFO] argLine set to -javaagent:/home/jenkins/.m2/repository/org/jacoco/org.jacoco.agent/0.7.9/org.jacoco.agent-0.7.9-runtime.jar=destfile=/home/jenkins/.hudson/jobs/gocmodel-jar/workspace/gocmodel-jar/target/jacoco.exec
[INFO] 
[INFO] <<< maven-javadoc-plugin:2.10.4:javadoc (report:javadoc) < generate-sources @ gocmodel-jar <<<
[INFO] 
[INFO] 
[INFO] >>> maven-javadoc-plugin:2.10.4:test-aggregate (report:test-aggregate) > generate-test-sources @ gocmodel-jar >>>
[INFO] 
[INFO] --- jacoco-maven-plugin:0.7.9:prepare-agent (default-prepare-agent) @ gocmodel-jar ---
[INFO] argLine set to -javaagent:/home/jenkins/.m2/repository/org/jacoco/org.jacoco.agent/0.7.9/org.jacoco.agent-0.7.9-runtime.jar=destfile=/home/jenkins/.hudson/jobs/gocmodel-jar/workspace/gocmodel-jar/target/jacoco.exec
[INFO] 
[INFO] --- maven-resources-plugin:2.6:resources (default-resources) @ gocmodel-jar ---
[INFO] Using 'UTF-8' encoding to copy filtered resources.
[INFO] Copying 3 resources
[INFO] 
[INFO] --- maven-compiler-plugin:3.6.1:compile (default-compile) @ gocmodel-jar ---
[INFO] Nothing to compile - all classes are up to date
[INFO] 
[INFO] <<< maven-javadoc-plugin:2.10.4:test-aggregate (report:test-aggregate) < generate-test-sources @ gocmodel-jar <<<
[INFO] 
[INFO] 
[INFO] >>> maven-javadoc-plugin:2.10.4:test-javadoc (report:test-javadoc) > generate-test-sources @ gocmodel-jar >>>
[INFO] 
[INFO] --- jacoco-maven-plugin:0.7.9:prepare-agent (default-prepare-agent) @ gocmodel-jar ---
[INFO] argLine set to -javaagent:/home/jenkins/.m2/repository/org/jacoco/org.jacoco.agent/0.7.9/org.jacoco.agent-0.7.9-runtime.jar=destfile=/home/jenkins/.hudson/jobs/gocmodel-jar/workspace/gocmodel-jar/target/jacoco.exec
[INFO] 
[INFO] --- maven-resources-plugin:2.6:resources (default-resources) @ gocmodel-jar ---
[INFO] Using 'UTF-8' encoding to copy filtered resources.
[INFO] Copying 3 resources
[INFO] 
[INFO] --- maven-compiler-plugin:3.6.1:compile (default-compile) @ gocmodel-jar ---
[INFO] Nothing to compile - all classes are up to date
[INFO] 
[INFO] <<< maven-javadoc-plugin:2.10.4:test-javadoc (report:test-javadoc) < generate-test-sources @ gocmodel-jar <<<
[INFO] 
[INFO] configuring report plugin org.codehaus.mojo:gazelle-plugins:1.60
[INFO] configuring report plugin org.apache.maven.plugins:maven-project-info-reports-plugin:2.9
[WARNING] No project URL defined - decoration links will not be relativized!
[INFO] Rendering site with org.apache.maven.skins:maven-default-skin:jar:1.0 skin.
[INFO] Skipped "JavaDocs" report, file "apidocs/index.html" already exists for the English version.
[INFO] Skipped "JavaDocs" report, file "apidocs/index.html" already exists for the English version.
[INFO] Skipped "Test JavaDocs" report, file "testapidocs/index.html" already exists for the English version.
[INFO] Skipped "Test JavaDocs" report, file "testapidocs/index.html" already exists for the English version.
[INFO] Generating "Checkstyle" report    --- maven-checkstyle-plugin:2.17
[INFO] There are 1545 errors reported by Checkstyle 6.11.2 with sun_checks.xml ruleset.
[WARNING] Unable to locate Source XRef to link to - DISABLED
[INFO] Generating "JavaDocs" report    --- maven-javadoc-plugin:2.10.4
[INFO] 
Loading source files for package net.ihe.gazelle.goc.uml...
Loading source files for package net.ihe.gazelle.goc.uml.utils...
Loading source files for package net.ihe.gazelle.goc.template.definer.model...
Loading source files for package net.ihe.gazelle.goc.umlmodel.util...
Loading source files for package net.ihe.gazelle.goc.umlmodel.model...
Loading source files for package net.ihe.gazelle.goc.scripts...
Loading source files for package net.ihe.gazelle.goc.xmi...
Loading source files for package net.ihe.gazelle.goc.xmm...
Loading source files for package net.ihe.gazelle.goc.ecore...
Constructing Javadoc information...
Standard Doclet version 1.8.0_191
Building tree for all the packages and classes...
Generating /home/jenkins/.hudson/jobs/gocmodel-jar/workspace/gocmodel-jar/target/site/apidocs/net/ihe/gazelle/goc/uml/Model.html...
Generating /home/jenkins/.hudson/jobs/gocmodel-jar/workspace/gocmodel-jar/target/site/apidocs/net/ihe/gazelle/goc/uml/ObjectFactory.html...
Generating /home/jenkins/.hudson/jobs/gocmodel-jar/workspace/gocmodel-jar/target/site/apidocs/net/ihe/gazelle/goc/uml/utils/CDAClassesMap.html...
Generating /home/jenkins/.hudson/jobs/gocmodel-jar/workspace/gocmodel-jar/target/site/apidocs/net/ihe/gazelle/goc/uml/utils/ElementImportUtil.html...
Generating /home/jenkins/.hudson/jobs/gocmodel-jar/workspace/gocmodel-jar/target/site/apidocs/net/ihe/gazelle/goc/uml/utils/GOCModelMarshaller.html...
Generating /home/jenkins/.hudson/jobs/gocmodel-jar/workspace/gocmodel-jar/target/site/apidocs/net/ihe/gazelle/goc/uml/utils/ModelDescriberInitializer.html...
Generating /home/jenkins/.hudson/jobs/gocmodel-jar/workspace/gocmodel-jar/target/site/apidocs/net/ihe/gazelle/goc/uml/utils/OwnedRuleUtil.html...
Generating /home/jenkins/.hudson/jobs/gocmodel-jar/workspace/gocmodel-jar/target/site/apidocs/net/ihe/gazelle/goc/uml/utils/PackagedElementUtil.html...
Generating /home/jenkins/.hudson/jobs/gocmodel-jar/workspace/gocmodel-jar/target/site/apidocs/net/ihe/gazelle/goc/uml/utils/PathWithDT.html...
Generating /home/jenkins/.hudson/jobs/gocmodel-jar/workspace/gocmodel-jar/target/site/apidocs/net/ihe/gazelle/goc/uml/utils/PathWithDTUtil.html...
Generating /home/jenkins/.hudson/jobs/gocmodel-jar/workspace/gocmodel-jar/target/site/apidocs/net/ihe/gazelle/goc/uml/utils/TAMLUtil.html...
Generating /home/jenkins/.hudson/jobs/gocmodel-jar/workspace/gocmodel-jar/target/site/apidocs/net/ihe/gazelle/goc/uml/utils/TemplateSpecUtil.html...
Generating /home/jenkins/.hudson/jobs/gocmodel-jar/workspace/gocmodel-jar/target/site/apidocs/net/ihe/gazelle/goc/uml/utils/UMLLoader.html...
Generating /home/jenkins/.hudson/jobs/gocmodel-jar/workspace/gocmodel-jar/target/site/apidocs/net/ihe/gazelle/goc/uml/utils/UMLPrimitiveType.html...
Generating /home/jenkins/.hudson/jobs/gocmodel-jar/workspace/gocmodel-jar/target/site/apidocs/net/ihe/gazelle/goc/uml/utils/XMIUtil.html...
Generating /home/jenkins/.hudson/jobs/gocmodel-jar/workspace/gocmodel-jar/target/site/apidocs/net/ihe/gazelle/goc/template/definer/model/AdvancedTemplate.html...
Generating /home/jenkins/.hudson/jobs/gocmodel-jar/workspace/gocmodel-jar/target/site/apidocs/net/ihe/gazelle/goc/template/definer/model/ConstraintDoc.html...
Generating /home/jenkins/.hudson/jobs/gocmodel-jar/workspace/gocmodel-jar/target/site/apidocs/net/ihe/gazelle/goc/template/definer/model/ConstraintKind.html...
Generating /home/jenkins/.hudson/jobs/gocmodel-jar/workspace/gocmodel-jar/target/site/apidocs/net/ihe/gazelle/goc/template/definer/model/ConstraintsSpec.html...
Generating /home/jenkins/.hudson/jobs/gocmodel-jar/workspace/gocmodel-jar/target/site/apidocs/net/ihe/gazelle/goc/template/definer/model/ConstraintType.html...
Generating /home/jenkins/.hudson/jobs/gocmodel-jar/workspace/gocmodel-jar/target/site/apidocs/net/ihe/gazelle/goc/template/definer/model/ObjectFactory.html...
Generating /home/jenkins/.hudson/jobs/gocmodel-jar/workspace/gocmodel-jar/target/site/apidocs/net/ihe/gazelle/goc/template/definer/model/Taml.html...
Generating /home/jenkins/.hudson/jobs/gocmodel-jar/workspace/gocmodel-jar/target/site/apidocs/net/ihe/gazelle/goc/template/definer/model/TemplateSpec.html...
Generating /home/jenkins/.hudson/jobs/gocmodel-jar/workspace/gocmodel-jar/target/site/apidocs/net/ihe/gazelle/goc/umlmodel/util/ModelDescriberUtil.html...
Generating /home/jenkins/.hudson/jobs/gocmodel-jar/workspace/gocmodel-jar/target/site/apidocs/net/ihe/gazelle/goc/umlmodel/util/ModelsDefinitionUtil.html...
Generating /home/jenkins/.hudson/jobs/gocmodel-jar/workspace/gocmodel-jar/target/site/apidocs/net/ihe/gazelle/goc/umlmodel/model/ModelDescriber.html...
Generating /home/jenkins/.hudson/jobs/gocmodel-jar/workspace/gocmodel-jar/target/site/apidocs/net/ihe/gazelle/goc/umlmodel/model/ModelsDefinition.html...
Generating /home/jenkins/.hudson/jobs/gocmodel-jar/workspace/gocmodel-jar/target/site/apidocs/net/ihe/gazelle/goc/umlmodel/model/ModelUMLDesc.html...
Generating /home/jenkins/.hudson/jobs/gocmodel-jar/workspace/gocmodel-jar/target/site/apidocs/net/ihe/gazelle/goc/umlmodel/model/ObjectFactory.html...
Generating /home/jenkins/.hudson/jobs/gocmodel-jar/workspace/gocmodel-jar/target/site/apidocs/net/ihe/gazelle/goc/umlmodel/model/UMLModelsDescription.html...
Generating /home/jenkins/.hudson/jobs/gocmodel-jar/workspace/gocmodel-jar/target/site/apidocs/net/ihe/gazelle/goc/scripts/AssertionGenerator.html...
Generating /home/jenkins/.hudson/jobs/gocmodel-jar/workspace/gocmodel-jar/target/site/apidocs/net/ihe/gazelle/goc/scripts/AssertionGeneratorHPD.html...
Generating /home/jenkins/.hudson/jobs/gocmodel-jar/workspace/gocmodel-jar/target/site/apidocs/net/ihe/gazelle/goc/xmi/ObjectFactory.html...
Generating /home/jenkins/.hudson/jobs/gocmodel-jar/workspace/gocmodel-jar/target/site/apidocs/net/ihe/gazelle/goc/xmi/XMI.html...
Generating /home/jenkins/.hudson/jobs/gocmodel-jar/workspace/gocmodel-jar/target/site/apidocs/net/ihe/gazelle/goc/xmi/XMIMarshaller.html...
Generating /home/jenkins/.hudson/jobs/gocmodel-jar/workspace/gocmodel-jar/target/site/apidocs/net/ihe/gazelle/goc/xmm/AppliedProfile.html...
Generating /home/jenkins/.hudson/jobs/gocmodel-jar/workspace/gocmodel-jar/target/site/apidocs/net/ihe/gazelle/goc/xmm/EAnnotations.html...
Generating /home/jenkins/.hudson/jobs/gocmodel-jar/workspace/gocmodel-jar/target/site/apidocs/net/ihe/gazelle/goc/xmm/ElementImport.html...
Generating /home/jenkins/.hudson/jobs/gocmodel-jar/workspace/gocmodel-jar/target/site/apidocs/net/ihe/gazelle/goc/xmm/General.html...
Generating /home/jenkins/.hudson/jobs/gocmodel-jar/workspace/gocmodel-jar/target/site/apidocs/net/ihe/gazelle/goc/xmm/Generalization.html...
Generating /home/jenkins/.hudson/jobs/gocmodel-jar/workspace/gocmodel-jar/target/site/apidocs/net/ihe/gazelle/goc/xmm/ImportedElement.html...
Generating /home/jenkins/.hudson/jobs/gocmodel-jar/workspace/gocmodel-jar/target/site/apidocs/net/ihe/gazelle/goc/xmm/ImportedPackage.html...
Generating /home/jenkins/.hudson/jobs/gocmodel-jar/workspace/gocmodel-jar/target/site/apidocs/net/ihe/gazelle/goc/xmm/ObjectFactory.html...
Generating /home/jenkins/.hudson/jobs/gocmodel-jar/workspace/gocmodel-jar/target/site/apidocs/net/ihe/gazelle/goc/xmm/OwnedComment.html...
Generating /home/jenkins/.hudson/jobs/gocmodel-jar/workspace/gocmodel-jar/target/site/apidocs/net/ihe/gazelle/goc/xmm/OwnedRule.html...
Generating /home/jenkins/.hudson/jobs/gocmodel-jar/workspace/gocmodel-jar/target/site/apidocs/net/ihe/gazelle/goc/xmm/OwnedRuleKind.html...
Generating /home/jenkins/.hudson/jobs/gocmodel-jar/workspace/gocmodel-jar/target/site/apidocs/net/ihe/gazelle/goc/xmm/OwnedRuleType.html...
Generating /home/jenkins/.hudson/jobs/gocmodel-jar/workspace/gocmodel-jar/target/site/apidocs/net/ihe/gazelle/goc/xmm/PackagedElement.html...
Generating /home/jenkins/.hudson/jobs/gocmodel-jar/workspace/gocmodel-jar/target/site/apidocs/net/ihe/gazelle/goc/xmm/PackageImport.html...
Generating /home/jenkins/.hudson/jobs/gocmodel-jar/workspace/gocmodel-jar/target/site/apidocs/net/ihe/gazelle/goc/xmm/ProfileApplication.html...
Generating /home/jenkins/.hudson/jobs/gocmodel-jar/workspace/gocmodel-jar/target/site/apidocs/net/ihe/gazelle/goc/xmm/References.html...
Generating /home/jenkins/.hudson/jobs/gocmodel-jar/workspace/gocmodel-jar/target/site/apidocs/net/ihe/gazelle/goc/xmm/Specification.html...
Generating /home/jenkins/.hudson/jobs/gocmodel-jar/workspace/gocmodel-jar/target/site/apidocs/net/ihe/gazelle/goc/ecore/EPackage.html...
Generating /home/jenkins/.hudson/jobs/gocmodel-jar/workspace/gocmodel-jar/target/site/apidocs/net/ihe/gazelle/goc/ecore/ObjectFactory.html...
Generating /home/jenkins/.hudson/jobs/gocmodel-jar/workspace/gocmodel-jar/target/site/apidocs/overview-frame.html...
Generating /home/jenkins/.hudson/jobs/gocmodel-jar/workspace/gocmodel-jar/target/site/apidocs/net/ihe/gazelle/goc/ecore/package-frame.html...
Generating /home/jenkins/.hudson/jobs/gocmodel-jar/workspace/gocmodel-jar/target/site/apidocs/net/ihe/gazelle/goc/ecore/package-summary.html...
Generating /home/jenkins/.hudson/jobs/gocmodel-jar/workspace/gocmodel-jar/target/site/apidocs/net/ihe/gazelle/goc/ecore/package-tree.html...
Generating /home/jenkins/.hudson/jobs/gocmodel-jar/workspace/gocmodel-jar/target/site/apidocs/net/ihe/gazelle/goc/scripts/package-frame.html...
Generating /home/jenkins/.hudson/jobs/gocmodel-jar/workspace/gocmodel-jar/target/site/apidocs/net/ihe/gazelle/goc/scripts/package-summary.html...
Generating /home/jenkins/.hudson/jobs/gocmodel-jar/workspace/gocmodel-jar/target/site/apidocs/net/ihe/gazelle/goc/scripts/package-tree.html...
Generating /home/jenkins/.hudson/jobs/gocmodel-jar/workspace/gocmodel-jar/target/site/apidocs/net/ihe/gazelle/goc/template/definer/model/package-frame.html...
Generating /home/jenkins/.hudson/jobs/gocmodel-jar/workspace/gocmodel-jar/target/site/apidocs/net/ihe/gazelle/goc/template/definer/model/package-summary.html...
Generating /home/jenkins/.hudson/jobs/gocmodel-jar/workspace/gocmodel-jar/target/site/apidocs/net/ihe/gazelle/goc/template/definer/model/package-tree.html...
Generating /home/jenkins/.hudson/jobs/gocmodel-jar/workspace/gocmodel-jar/target/site/apidocs/net/ihe/gazelle/goc/uml/package-frame.html...
Generating /home/jenkins/.hudson/jobs/gocmodel-jar/workspace/gocmodel-jar/target/site/apidocs/net/ihe/gazelle/goc/uml/package-summary.html...
Generating /home/jenkins/.hudson/jobs/gocmodel-jar/workspace/gocmodel-jar/target/site/apidocs/net/ihe/gazelle/goc/uml/package-tree.html...
Generating /home/jenkins/.hudson/jobs/gocmodel-jar/workspace/gocmodel-jar/target/site/apidocs/net/ihe/gazelle/goc/uml/utils/package-frame.html...
Generating /home/jenkins/.hudson/jobs/gocmodel-jar/workspace/gocmodel-jar/target/site/apidocs/net/ihe/gazelle/goc/uml/utils/package-summary.html...
Generating /home/jenkins/.hudson/jobs/gocmodel-jar/workspace/gocmodel-jar/target/site/apidocs/net/ihe/gazelle/goc/uml/utils/package-tree.html...
Generating /home/jenkins/.hudson/jobs/gocmodel-jar/workspace/gocmodel-jar/target/site/apidocs/net/ihe/gazelle/goc/umlmodel/model/package-frame.html...
Generating /home/jenkins/.hudson/jobs/gocmodel-jar/workspace/gocmodel-jar/target/site/apidocs/net/ihe/gazelle/goc/umlmodel/model/package-summary.html...
Generating /home/jenkins/.hudson/jobs/gocmodel-jar/workspace/gocmodel-jar/target/site/apidocs/net/ihe/gazelle/goc/umlmodel/model/package-tree.html...
Generating /home/jenkins/.hudson/jobs/gocmodel-jar/workspace/gocmodel-jar/target/site/apidocs/net/ihe/gazelle/goc/umlmodel/util/package-frame.html...
Generating /home/jenkins/.hudson/jobs/gocmodel-jar/workspace/gocmodel-jar/target/site/apidocs/net/ihe/gazelle/goc/umlmodel/util/package-summary.html...
Generating /home/jenkins/.hudson/jobs/gocmodel-jar/workspace/gocmodel-jar/target/site/apidocs/net/ihe/gazelle/goc/umlmodel/util/package-tree.html...
Generating /home/jenkins/.hudson/jobs/gocmodel-jar/workspace/gocmodel-jar/target/site/apidocs/net/ihe/gazelle/goc/xmi/package-frame.html...
Generating /home/jenkins/.hudson/jobs/gocmodel-jar/workspace/gocmodel-jar/target/site/apidocs/net/ihe/gazelle/goc/xmi/package-summary.html...
Generating /home/jenkins/.hudson/jobs/gocmodel-jar/workspace/gocmodel-jar/target/site/apidocs/net/ihe/gazelle/goc/xmi/package-tree.html...
Generating /home/jenkins/.hudson/jobs/gocmodel-jar/workspace/gocmodel-jar/target/site/apidocs/net/ihe/gazelle/goc/xmm/package-frame.html...
Generating /home/jenkins/.hudson/jobs/gocmodel-jar/workspace/gocmodel-jar/target/site/apidocs/net/ihe/gazelle/goc/xmm/package-summary.html...
Generating /home/jenkins/.hudson/jobs/gocmodel-jar/workspace/gocmodel-jar/target/site/apidocs/net/ihe/gazelle/goc/xmm/package-tree.html...
Generating /home/jenkins/.hudson/jobs/gocmodel-jar/workspace/gocmodel-jar/target/site/apidocs/constant-values.html...
Generating /home/jenkins/.hudson/jobs/gocmodel-jar/workspace/gocmodel-jar/target/site/apidocs/net/ihe/gazelle/goc/uml/class-use/Model.html...
Generating /home/jenkins/.hudson/jobs/gocmodel-jar/workspace/gocmodel-jar/target/site/apidocs/net/ihe/gazelle/goc/uml/class-use/ObjectFactory.html...
Generating /home/jenkins/.hudson/jobs/gocmodel-jar/workspace/gocmodel-jar/target/site/apidocs/net/ihe/gazelle/goc/uml/utils/class-use/TemplateSpecUtil.html...
Generating /home/jenkins/.hudson/jobs/gocmodel-jar/workspace/gocmodel-jar/target/site/apidocs/net/ihe/gazelle/goc/uml/utils/class-use/TAMLUtil.html...
Generating /home/jenkins/.hudson/jobs/gocmodel-jar/workspace/gocmodel-jar/target/site/apidocs/net/ihe/gazelle/goc/uml/utils/class-use/PackagedElementUtil.html...
Generating /home/jenkins/.hudson/jobs/gocmodel-jar/workspace/gocmodel-jar/target/site/apidocs/net/ihe/gazelle/goc/uml/utils/class-use/ElementImportUtil.html...
Generating /home/jenkins/.hudson/jobs/gocmodel-jar/workspace/gocmodel-jar/target/site/apidocs/net/ihe/gazelle/goc/uml/utils/class-use/ModelDescriberInitializer.html...
Generating /home/jenkins/.hudson/jobs/gocmodel-jar/workspace/gocmodel-jar/target/site/apidocs/net/ihe/gazelle/goc/uml/utils/class-use/XMIUtil.html...
Generating /home/jenkins/.hudson/jobs/gocmodel-jar/workspace/gocmodel-jar/target/site/apidocs/net/ihe/gazelle/goc/uml/utils/class-use/PathWithDT.html...
Generating /home/jenkins/.hudson/jobs/gocmodel-jar/workspace/gocmodel-jar/target/site/apidocs/net/ihe/gazelle/goc/uml/utils/class-use/CDAClassesMap.html...
Generating /home/jenkins/.hudson/jobs/gocmodel-jar/workspace/gocmodel-jar/target/site/apidocs/net/ihe/gazelle/goc/uml/utils/class-use/UMLPrimitiveType.html...
Generating /home/jenkins/.hudson/jobs/gocmodel-jar/workspace/gocmodel-jar/target/site/apidocs/net/ihe/gazelle/goc/uml/utils/class-use/OwnedRuleUtil.html...
Generating /home/jenkins/.hudson/jobs/gocmodel-jar/workspace/gocmodel-jar/target/site/apidocs/net/ihe/gazelle/goc/uml/utils/class-use/GOCModelMarshaller.html...
Generating /home/jenkins/.hudson/jobs/gocmodel-jar/workspace/gocmodel-jar/target/site/apidocs/net/ihe/gazelle/goc/uml/utils/class-use/UMLLoader.html...
Generating /home/jenkins/.hudson/jobs/gocmodel-jar/workspace/gocmodel-jar/target/site/apidocs/net/ihe/gazelle/goc/uml/utils/class-use/PathWithDTUtil.html...
Generating /home/jenkins/.hudson/jobs/gocmodel-jar/workspace/gocmodel-jar/target/site/apidocs/net/ihe/gazelle/goc/template/definer/model/class-use/TemplateSpec.html...
Generating /home/jenkins/.hudson/jobs/gocmodel-jar/workspace/gocmodel-jar/target/site/apidocs/net/ihe/gazelle/goc/template/definer/model/class-use/ConstraintsSpec.html...
Generating /home/jenkins/.hudson/jobs/gocmodel-jar/workspace/gocmodel-jar/target/site/apidocs/net/ihe/gazelle/goc/template/definer/model/class-use/ConstraintKind.html...
Generating /home/jenkins/.hudson/jobs/gocmodel-jar/workspace/gocmodel-jar/target/site/apidocs/net/ihe/gazelle/goc/template/definer/model/class-use/ConstraintType.html...
Generating /home/jenkins/.hudson/jobs/gocmodel-jar/workspace/gocmodel-jar/target/site/apidocs/net/ihe/gazelle/goc/template/definer/model/class-use/AdvancedTemplate.html...
Generating /home/jenkins/.hudson/jobs/gocmodel-jar/workspace/gocmodel-jar/target/site/apidocs/net/ihe/gazelle/goc/template/definer/model/class-use/ConstraintDoc.html...
Generating /home/jenkins/.hudson/jobs/gocmodel-jar/workspace/gocmodel-jar/target/site/apidocs/net/ihe/gazelle/goc/template/definer/model/class-use/Taml.html...
Generating /home/jenkins/.hudson/jobs/gocmodel-jar/workspace/gocmodel-jar/target/site/apidocs/net/ihe/gazelle/goc/template/definer/model/class-use/ObjectFactory.html...
Generating /home/jenkins/.hudson/jobs/gocmodel-jar/workspace/gocmodel-jar/target/site/apidocs/net/ihe/gazelle/goc/umlmodel/util/class-use/ModelsDefinitionUtil.html...
Generating /home/jenkins/.hudson/jobs/gocmodel-jar/workspace/gocmodel-jar/target/site/apidocs/net/ihe/gazelle/goc/umlmodel/util/class-use/ModelDescriberUtil.html...
Generating /home/jenkins/.hudson/jobs/gocmodel-jar/workspace/gocmodel-jar/target/site/apidocs/net/ihe/gazelle/goc/umlmodel/model/class-use/UMLModelsDescription.html...
Generating /home/jenkins/.hudson/jobs/gocmodel-jar/workspace/gocmodel-jar/target/site/apidocs/net/ihe/gazelle/goc/umlmodel/model/class-use/ModelsDefinition.html...
Generating /home/jenkins/.hudson/jobs/gocmodel-jar/workspace/gocmodel-jar/target/site/apidocs/net/ihe/gazelle/goc/umlmodel/model/class-use/ModelDescriber.html...
Generating /home/jenkins/.hudson/jobs/gocmodel-jar/workspace/gocmodel-jar/target/site/apidocs/net/ihe/gazelle/goc/umlmodel/model/class-use/ModelUMLDesc.html...
Generating /home/jenkins/.hudson/jobs/gocmodel-jar/workspace/gocmodel-jar/target/site/apidocs/net/ihe/gazelle/goc/umlmodel/model/class-use/ObjectFactory.html...
Generating /home/jenkins/.hudson/jobs/gocmodel-jar/workspace/gocmodel-jar/target/site/apidocs/net/ihe/gazelle/goc/scripts/class-use/AssertionGeneratorHPD.html...
Generating /home/jenkins/.hudson/jobs/gocmodel-jar/workspace/gocmodel-jar/target/site/apidocs/net/ihe/gazelle/goc/scripts/class-use/AssertionGenerator.html...
Generating /home/jenkins/.hudson/jobs/gocmodel-jar/workspace/gocmodel-jar/target/site/apidocs/net/ihe/gazelle/goc/xmi/class-use/XMIMarshaller.html...
Generating /home/jenkins/.hudson/jobs/gocmodel-jar/workspace/gocmodel-jar/target/site/apidocs/net/ihe/gazelle/goc/xmi/class-use/ObjectFactory.html...
Generating /home/jenkins/.hudson/jobs/gocmodel-jar/workspace/gocmodel-jar/target/site/apidocs/net/ihe/gazelle/goc/xmi/class-use/XMI.html...
Generating /home/jenkins/.hudson/jobs/gocmodel-jar/workspace/gocmodel-jar/target/site/apidocs/net/ihe/gazelle/goc/xmm/class-use/OwnedRuleKind.html...
Generating /home/jenkins/.hudson/jobs/gocmodel-jar/workspace/gocmodel-jar/target/site/apidocs/net/ihe/gazelle/goc/xmm/class-use/OwnedRuleType.html...
Generating /home/jenkins/.hudson/jobs/gocmodel-jar/workspace/gocmodel-jar/target/site/apidocs/net/ihe/gazelle/goc/xmm/class-use/ImportedPackage.html...
Generating /home/jenkins/.hudson/jobs/gocmodel-jar/workspace/gocmodel-jar/target/site/apidocs/net/ihe/gazelle/goc/xmm/class-use/EAnnotations.html...
Generating /home/jenkins/.hudson/jobs/gocmodel-jar/workspace/gocmodel-jar/target/site/apidocs/net/ihe/gazelle/goc/xmm/class-use/General.html...
Generating /home/jenkins/.hudson/jobs/gocmodel-jar/workspace/gocmodel-jar/target/site/apidocs/net/ihe/gazelle/goc/xmm/class-use/OwnedComment.html...
Generating /home/jenkins/.hudson/jobs/gocmodel-jar/workspace/gocmodel-jar/target/site/apidocs/net/ihe/gazelle/goc/xmm/class-use/Generalization.html...
Generating /home/jenkins/.hudson/jobs/gocmodel-jar/workspace/gocmodel-jar/target/site/apidocs/net/ihe/gazelle/goc/xmm/class-use/References.html...
Generating /home/jenkins/.hudson/jobs/gocmodel-jar/workspace/gocmodel-jar/target/site/apidocs/net/ihe/gazelle/goc/xmm/class-use/PackagedElement.html...
Generating /home/jenkins/.hudson/jobs/gocmodel-jar/workspace/gocmodel-jar/target/site/apidocs/net/ihe/gazelle/goc/xmm/class-use/Specification.html...
Generating /home/jenkins/.hudson/jobs/gocmodel-jar/workspace/gocmodel-jar/target/site/apidocs/net/ihe/gazelle/goc/xmm/class-use/ProfileApplication.html...
Generating /home/jenkins/.hudson/jobs/gocmodel-jar/workspace/gocmodel-jar/target/site/apidocs/net/ihe/gazelle/goc/xmm/class-use/AppliedProfile.html...
Generating /home/jenkins/.hudson/jobs/gocmodel-jar/workspace/gocmodel-jar/target/site/apidocs/net/ihe/gazelle/goc/xmm/class-use/ElementImport.html...
Generating /home/jenkins/.hudson/jobs/gocmodel-jar/workspace/gocmodel-jar/target/site/apidocs/net/ihe/gazelle/goc/xmm/class-use/OwnedRule.html...
Generating /home/jenkins/.hudson/jobs/gocmodel-jar/workspace/gocmodel-jar/target/site/apidocs/net/ihe/gazelle/goc/xmm/class-use/ImportedElement.html...
Generating /home/jenkins/.hudson/jobs/gocmodel-jar/workspace/gocmodel-jar/target/site/apidocs/net/ihe/gazelle/goc/xmm/class-use/PackageImport.html...
Generating /home/jenkins/.hudson/jobs/gocmodel-jar/workspace/gocmodel-jar/target/site/apidocs/net/ihe/gazelle/goc/xmm/class-use/ObjectFactory.html...
Generating /home/jenkins/.hudson/jobs/gocmodel-jar/workspace/gocmodel-jar/target/site/apidocs/net/ihe/gazelle/goc/ecore/class-use/EPackage.html...
Generating /home/jenkins/.hudson/jobs/gocmodel-jar/workspace/gocmodel-jar/target/site/apidocs/net/ihe/gazelle/goc/ecore/class-use/ObjectFactory.html...
Generating /home/jenkins/.hudson/jobs/gocmodel-jar/workspace/gocmodel-jar/target/site/apidocs/net/ihe/gazelle/goc/ecore/package-use.html...
Generating /home/jenkins/.hudson/jobs/gocmodel-jar/workspace/gocmodel-jar/target/site/apidocs/net/ihe/gazelle/goc/scripts/package-use.html...
Generating /home/jenkins/.hudson/jobs/gocmodel-jar/workspace/gocmodel-jar/target/site/apidocs/net/ihe/gazelle/goc/template/definer/model/package-use.html...
Generating /home/jenkins/.hudson/jobs/gocmodel-jar/workspace/gocmodel-jar/target/site/apidocs/net/ihe/gazelle/goc/uml/package-use.html...
Generating /home/jenkins/.hudson/jobs/gocmodel-jar/workspace/gocmodel-jar/target/site/apidocs/net/ihe/gazelle/goc/uml/utils/package-use.html...
Generating /home/jenkins/.hudson/jobs/gocmodel-jar/workspace/gocmodel-jar/target/site/apidocs/net/ihe/gazelle/goc/umlmodel/model/package-use.html...
Generating /home/jenkins/.hudson/jobs/gocmodel-jar/workspace/gocmodel-jar/target/site/apidocs/net/ihe/gazelle/goc/umlmodel/util/package-use.html...
Generating /home/jenkins/.hudson/jobs/gocmodel-jar/workspace/gocmodel-jar/target/site/apidocs/net/ihe/gazelle/goc/xmi/package-use.html...
Generating /home/jenkins/.hudson/jobs/gocmodel-jar/workspace/gocmodel-jar/target/site/apidocs/net/ihe/gazelle/goc/xmm/package-use.html...
Building index for all the packages and classes...
Generating /home/jenkins/.hudson/jobs/gocmodel-jar/workspace/gocmodel-jar/target/site/apidocs/overview-tree.html...
Generating /home/jenkins/.hudson/jobs/gocmodel-jar/workspace/gocmodel-jar/target/site/apidocs/index-all.html...
Generating /home/jenkins/.hudson/jobs/gocmodel-jar/workspace/gocmodel-jar/target/site/apidocs/deprecated-list.html...
Building index for all classes...
Generating /home/jenkins/.hudson/jobs/gocmodel-jar/workspace/gocmodel-jar/target/site/apidocs/allclasses-frame.html...
Generating /home/jenkins/.hudson/jobs/gocmodel-jar/workspace/gocmodel-jar/target/site/apidocs/allclasses-noframe.html...
Generating /home/jenkins/.hudson/jobs/gocmodel-jar/workspace/gocmodel-jar/target/site/apidocs/index.html...
Generating /home/jenkins/.hudson/jobs/gocmodel-jar/workspace/gocmodel-jar/target/site/apidocs/overview-summary.html...
Generating /home/jenkins/.hudson/jobs/gocmodel-jar/workspace/gocmodel-jar/target/site/apidocs/help-doc.html...
[INFO] Generating "Test JavaDocs" report    --- maven-javadoc-plugin:2.10.4
[INFO] 
Loading source files for package net.ihe.gazelle.goc.scoring.actiontest...
Loading source files for package net.ihe.gazelle.goc.scripts...
Loading source files for package net.ihe.gazelle.goc.model.test...
Constructing Javadoc information...
Standard Doclet version 1.8.0_191
Building tree for all the packages and classes...
Generating /home/jenkins/.hudson/jobs/gocmodel-jar/workspace/gocmodel-jar/target/site/testapidocs/net/ihe/gazelle/goc/scoring/actiontest/CalculMath.html...
Generating /home/jenkins/.hudson/jobs/gocmodel-jar/workspace/gocmodel-jar/target/site/testapidocs/net/ihe/gazelle/goc/scoring/actiontest/CalculMath2.html...
Generating /home/jenkins/.hudson/jobs/gocmodel-jar/workspace/gocmodel-jar/target/site/testapidocs/net/ihe/gazelle/goc/scoring/actiontest/CalculMath3.html...
Generating /home/jenkins/.hudson/jobs/gocmodel-jar/workspace/gocmodel-jar/target/site/testapidocs/net/ihe/gazelle/goc/scoring/actiontest/MatrixViewer.html...
Generating /home/jenkins/.hudson/jobs/gocmodel-jar/workspace/gocmodel-jar/target/site/testapidocs/net/ihe/gazelle/goc/scripts/ExtractChildDT.html...
Generating /home/jenkins/.hudson/jobs/gocmodel-jar/workspace/gocmodel-jar/target/site/testapidocs/net/ihe/gazelle/goc/scripts/GenerateDefaultDT.html...
Generating /home/jenkins/.hudson/jobs/gocmodel-jar/workspace/gocmodel-jar/target/site/testapidocs/net/ihe/gazelle/goc/model/test/CDAClassesMapTest.html...
Generating /home/jenkins/.hudson/jobs/gocmodel-jar/workspace/gocmodel-jar/target/site/testapidocs/net/ihe/gazelle/goc/model/test/ElementImportUtilTest.html...
Generating /home/jenkins/.hudson/jobs/gocmodel-jar/workspace/gocmodel-jar/target/site/testapidocs/net/ihe/gazelle/goc/model/test/GOCModelMarshallerTest.html...
Generating /home/jenkins/.hudson/jobs/gocmodel-jar/workspace/gocmodel-jar/target/site/testapidocs/net/ihe/gazelle/goc/model/test/ModelDescriberInitializerTest.html...
Generating /home/jenkins/.hudson/jobs/gocmodel-jar/workspace/gocmodel-jar/target/site/testapidocs/net/ihe/gazelle/goc/model/test/ModelDescriberTest.html...
Generating /home/jenkins/.hudson/jobs/gocmodel-jar/workspace/gocmodel-jar/target/site/testapidocs/net/ihe/gazelle/goc/model/test/ModelDescriberUtilTest.html...
Generating /home/jenkins/.hudson/jobs/gocmodel-jar/workspace/gocmodel-jar/target/site/testapidocs/net/ihe/gazelle/goc/model/test/ModelsDefinitionUtilTest.html...
Generating /home/jenkins/.hudson/jobs/gocmodel-jar/workspace/gocmodel-jar/target/site/testapidocs/net/ihe/gazelle/goc/model/test/OwnedRuleUtilTest.html...
Generating /home/jenkins/.hudson/jobs/gocmodel-jar/workspace/gocmodel-jar/target/site/testapidocs/net/ihe/gazelle/goc/model/test/PackagedElementUtilTest.html...
Generating /home/jenkins/.hudson/jobs/gocmodel-jar/workspace/gocmodel-jar/target/site/testapidocs/net/ihe/gazelle/goc/model/test/PathWithDTTest.html...
Generating /home/jenkins/.hudson/jobs/gocmodel-jar/workspace/gocmodel-jar/target/site/testapidocs/net/ihe/gazelle/goc/model/test/PathWithDTUtilTest.html...
Generating /home/jenkins/.hudson/jobs/gocmodel-jar/workspace/gocmodel-jar/target/site/testapidocs/net/ihe/gazelle/goc/model/test/TAMLUtilTest.html...
Generating /home/jenkins/.hudson/jobs/gocmodel-jar/workspace/gocmodel-jar/target/site/testapidocs/net/ihe/gazelle/goc/model/test/TemplateSpecUtilTest.html...
Generating /home/jenkins/.hudson/jobs/gocmodel-jar/workspace/gocmodel-jar/target/site/testapidocs/net/ihe/gazelle/goc/model/test/UMLLoaderTest.html...
Generating /home/jenkins/.hudson/jobs/gocmodel-jar/workspace/gocmodel-jar/target/site/testapidocs/net/ihe/gazelle/goc/model/test/UMLPrimitiveTypeTest.html...
Generating /home/jenkins/.hudson/jobs/gocmodel-jar/workspace/gocmodel-jar/target/site/testapidocs/net/ihe/gazelle/goc/model/test/UmlServicesTest.html...
Generating /home/jenkins/.hudson/jobs/gocmodel-jar/workspace/gocmodel-jar/target/site/testapidocs/net/ihe/gazelle/goc/model/test/XMIMarshallerTest.html...
Generating /home/jenkins/.hudson/jobs/gocmodel-jar/workspace/gocmodel-jar/target/site/testapidocs/net/ihe/gazelle/goc/model/test/XMIUtilTest.html...
Generating /home/jenkins/.hudson/jobs/gocmodel-jar/workspace/gocmodel-jar/target/site/testapidocs/overview-frame.html...
Generating /home/jenkins/.hudson/jobs/gocmodel-jar/workspace/gocmodel-jar/target/site/testapidocs/net/ihe/gazelle/goc/model/test/package-frame.html...
Generating /home/jenkins/.hudson/jobs/gocmodel-jar/workspace/gocmodel-jar/target/site/testapidocs/net/ihe/gazelle/goc/model/test/package-summary.html...
Generating /home/jenkins/.hudson/jobs/gocmodel-jar/workspace/gocmodel-jar/target/site/testapidocs/net/ihe/gazelle/goc/model/test/package-tree.html...
Generating /home/jenkins/.hudson/jobs/gocmodel-jar/workspace/gocmodel-jar/target/site/testapidocs/net/ihe/gazelle/goc/scoring/actiontest/package-frame.html...
Generating /home/jenkins/.hudson/jobs/gocmodel-jar/workspace/gocmodel-jar/target/site/testapidocs/net/ihe/gazelle/goc/scoring/actiontest/package-summary.html...
Generating /home/jenkins/.hudson/jobs/gocmodel-jar/workspace/gocmodel-jar/target/site/testapidocs/net/ihe/gazelle/goc/scoring/actiontest/package-tree.html...
Generating /home/jenkins/.hudson/jobs/gocmodel-jar/workspace/gocmodel-jar/target/site/testapidocs/net/ihe/gazelle/goc/scripts/package-frame.html...
Generating /home/jenkins/.hudson/jobs/gocmodel-jar/workspace/gocmodel-jar/target/site/testapidocs/net/ihe/gazelle/goc/scripts/package-summary.html...
Generating /home/jenkins/.hudson/jobs/gocmodel-jar/workspace/gocmodel-jar/target/site/testapidocs/net/ihe/gazelle/goc/scripts/package-tree.html...
Generating /home/jenkins/.hudson/jobs/gocmodel-jar/workspace/gocmodel-jar/target/site/testapidocs/constant-values.html...
Generating /home/jenkins/.hudson/jobs/gocmodel-jar/workspace/gocmodel-jar/target/site/testapidocs/net/ihe/gazelle/goc/scoring/actiontest/class-use/MatrixViewer.html...
Generating /home/jenkins/.hudson/jobs/gocmodel-jar/workspace/gocmodel-jar/target/site/testapidocs/net/ihe/gazelle/goc/scoring/actiontest/class-use/CalculMath2.html...
Generating /home/jenkins/.hudson/jobs/gocmodel-jar/workspace/gocmodel-jar/target/site/testapidocs/net/ihe/gazelle/goc/scoring/actiontest/class-use/CalculMath.html...
Generating /home/jenkins/.hudson/jobs/gocmodel-jar/workspace/gocmodel-jar/target/site/testapidocs/net/ihe/gazelle/goc/scoring/actiontest/class-use/CalculMath3.html...
Generating /home/jenkins/.hudson/jobs/gocmodel-jar/workspace/gocmodel-jar/target/site/testapidocs/net/ihe/gazelle/goc/scripts/class-use/ExtractChildDT.html...
Generating /home/jenkins/.hudson/jobs/gocmodel-jar/workspace/gocmodel-jar/target/site/testapidocs/net/ihe/gazelle/goc/scripts/class-use/GenerateDefaultDT.html...
Generating /home/jenkins/.hudson/jobs/gocmodel-jar/workspace/gocmodel-jar/target/site/testapidocs/net/ihe/gazelle/goc/model/test/class-use/CDAClassesMapTest.html...
Generating /home/jenkins/.hudson/jobs/gocmodel-jar/workspace/gocmodel-jar/target/site/testapidocs/net/ihe/gazelle/goc/model/test/class-use/PathWithDTUtilTest.html...
Generating /home/jenkins/.hudson/jobs/gocmodel-jar/workspace/gocmodel-jar/target/site/testapidocs/net/ihe/gazelle/goc/model/test/class-use/XMIUtilTest.html...
Generating /home/jenkins/.hudson/jobs/gocmodel-jar/workspace/gocmodel-jar/target/site/testapidocs/net/ihe/gazelle/goc/model/test/class-use/UmlServicesTest.html...
Generating /home/jenkins/.hudson/jobs/gocmodel-jar/workspace/gocmodel-jar/target/site/testapidocs/net/ihe/gazelle/goc/model/test/class-use/UMLLoaderTest.html...
Generating /home/jenkins/.hudson/jobs/gocmodel-jar/workspace/gocmodel-jar/target/site/testapidocs/net/ihe/gazelle/goc/model/test/class-use/ModelDescriberUtilTest.html...
Generating /home/jenkins/.hudson/jobs/gocmodel-jar/workspace/gocmodel-jar/target/site/testapidocs/net/ihe/gazelle/goc/model/test/class-use/GOCModelMarshallerTest.html...
Generating /home/jenkins/.hudson/jobs/gocmodel-jar/workspace/gocmodel-jar/target/site/testapidocs/net/ihe/gazelle/goc/model/test/class-use/ModelDescriberInitializerTest.html...
Generating /home/jenkins/.hudson/jobs/gocmodel-jar/workspace/gocmodel-jar/target/site/testapidocs/net/ihe/gazelle/goc/model/test/class-use/TAMLUtilTest.html...
Generating /home/jenkins/.hudson/jobs/gocmodel-jar/workspace/gocmodel-jar/target/site/testapidocs/net/ihe/gazelle/goc/model/test/class-use/ModelDescriberTest.html...
Generating /home/jenkins/.hudson/jobs/gocmodel-jar/workspace/gocmodel-jar/target/site/testapidocs/net/ihe/gazelle/goc/model/test/class-use/ElementImportUtilTest.html...
Generating /home/jenkins/.hudson/jobs/gocmodel-jar/workspace/gocmodel-jar/target/site/testapidocs/net/ihe/gazelle/goc/model/test/class-use/PathWithDTTest.html...
Generating /home/jenkins/.hudson/jobs/gocmodel-jar/workspace/gocmodel-jar/target/site/testapidocs/net/ihe/gazelle/goc/model/test/class-use/PackagedElementUtilTest.html...
Generating /home/jenkins/.hudson/jobs/gocmodel-jar/workspace/gocmodel-jar/target/site/testapidocs/net/ihe/gazelle/goc/model/test/class-use/UMLPrimitiveTypeTest.html...
Generating /home/jenkins/.hudson/jobs/gocmodel-jar/workspace/gocmodel-jar/target/site/testapidocs/net/ihe/gazelle/goc/model/test/class-use/TemplateSpecUtilTest.html...
Generating /home/jenkins/.hudson/jobs/gocmodel-jar/workspace/gocmodel-jar/target/site/testapidocs/net/ihe/gazelle/goc/model/test/class-use/OwnedRuleUtilTest.html...
Generating /home/jenkins/.hudson/jobs/gocmodel-jar/workspace/gocmodel-jar/target/site/testapidocs/net/ihe/gazelle/goc/model/test/class-use/XMIMarshallerTest.html...
Generating /home/jenkins/.hudson/jobs/gocmodel-jar/workspace/gocmodel-jar/target/site/testapidocs/net/ihe/gazelle/goc/model/test/class-use/ModelsDefinitionUtilTest.html...
Generating /home/jenkins/.hudson/jobs/gocmodel-jar/workspace/gocmodel-jar/target/site/testapidocs/net/ihe/gazelle/goc/model/test/package-use.html...
Generating /home/jenkins/.hudson/jobs/gocmodel-jar/workspace/gocmodel-jar/target/site/testapidocs/net/ihe/gazelle/goc/scoring/actiontest/package-use.html...
Generating /home/jenkins/.hudson/jobs/gocmodel-jar/workspace/gocmodel-jar/target/site/testapidocs/net/ihe/gazelle/goc/scripts/package-use.html...
Building index for all the packages and classes...
Generating /home/jenkins/.hudson/jobs/gocmodel-jar/workspace/gocmodel-jar/target/site/testapidocs/overview-tree.html...
Generating /home/jenkins/.hudson/jobs/gocmodel-jar/workspace/gocmodel-jar/target/site/testapidocs/index-all.html...
Generating /home/jenkins/.hudson/jobs/gocmodel-jar/workspace/gocmodel-jar/target/site/testapidocs/deprecated-list.html...
Building index for all classes...
Generating /home/jenkins/.hudson/jobs/gocmodel-jar/workspace/gocmodel-jar/target/site/testapidocs/allclasses-frame.html...
Generating /home/jenkins/.hudson/jobs/gocmodel-jar/workspace/gocmodel-jar/target/site/testapidocs/allclasses-noframe.html...
Generating /home/jenkins/.hudson/jobs/gocmodel-jar/workspace/gocmodel-jar/target/site/testapidocs/index.html...
Generating /home/jenkins/.hudson/jobs/gocmodel-jar/workspace/gocmodel-jar/target/site/testapidocs/overview-summary.html...
Generating /home/jenkins/.hudson/jobs/gocmodel-jar/workspace/gocmodel-jar/target/site/testapidocs/help-doc.html...
[INFO] Generating "Check Dependencies" report    --- gazelle-plugins:1.60
Problem to read inputStream : https://gazelle.ihe.net/nexus/service/local/lucene/search?g=org.slf4j&a=slf4j-log4j12&collapseresults=true
Problem to read inputStream : https://gazelle.ihe.net/nexus/service/local/lucene/search?g=&g=org.slf4j&a=slf4j-log4j12&collapseresults=true
Problem to read inputStream : https://gazelle.ihe.net/nexus/service/local/lucene/search?g=junit&a=junit&collapseresults=true
Problem to read inputStream : https://gazelle.ihe.net/nexus/service/local/lucene/search?g=&g=junit&a=junit&collapseresults=true
Problem to read inputStream : https://gazelle.ihe.net/nexus/service/local/lucene/search?g=org.eclipse.emf&a=common&collapseresults=true
Problem to read inputStream : https://gazelle.ihe.net/nexus/service/local/lucene/search?g=&g=org.eclipse.emf&a=common&collapseresults=true
Problem to read inputStream : https://gazelle.ihe.net/nexus/service/local/lucene/search?g=org.eclipse.emf&a=ecore&collapseresults=true
Problem to read inputStream : https://gazelle.ihe.net/nexus/service/local/lucene/search?g=&g=org.eclipse.emf&a=ecore&collapseresults=true
Problem to read inputStream : https://gazelle.ihe.net/nexus/service/local/lucene/search?g=org.eclipse.emf&a=ecore.xmi&collapseresults=true
Problem to read inputStream : https://gazelle.ihe.net/nexus/service/local/lucene/search?g=&g=org.eclipse.emf&a=ecore.xmi&collapseresults=true
Problem to read inputStream : https://gazelle.ihe.net/nexus/service/local/lucene/search?g=org.eclipse.uml2&a=uml&collapseresults=true
Problem to read inputStream : https://gazelle.ihe.net/nexus/service/local/lucene/search?g=&g=org.eclipse.uml2&a=uml&collapseresults=true
Problem to read inputStream : https://gazelle.ihe.net/nexus/service/local/lucene/search?g=org.eclipse.uml2&a=common&collapseresults=true
Problem to read inputStream : https://gazelle.ihe.net/nexus/service/local/lucene/search?g=&g=org.eclipse.uml2&a=common&collapseresults=true
Problem to read inputStream : https://gazelle.ihe.net/nexus/service/local/lucene/search?g=commons-lang&a=commons-lang&collapseresults=true
Problem to read inputStream : https://gazelle.ihe.net/nexus/service/local/lucene/search?g=&g=commons-lang&a=commons-lang&collapseresults=true
Problem to read inputStream : https://gazelle.ihe.net/nexus/service/local/lucene/search?g=net.ihe.gazelle&a=AssertionManagerGui-model&collapseresults=true
Problem to read inputStream : https://gazelle.ihe.net/nexus/service/local/lucene/search?g=&g=net.ihe.gazelle&a=AssertionManagerGui-model&collapseresults=true
Problem to read inputStream : https://gazelle.ihe.net/nexus/service/local/lucene/search?g=gov.nist.math&a=jama&collapseresults=true
Problem to read inputStream : https://gazelle.ihe.net/nexus/service/local/lucene/search?g=&g=gov.nist.math&a=jama&collapseresults=true
Problem to read inputStream : https://gazelle.ihe.net/nexus/service/local/lucene/search?g=org.apache.maven.plugins&a=maven-jar-plugin&collapseresults=true
Problem to read inputStream : https://gazelle.ihe.net/nexus/service/local/lucene/search?g=&g=org.apache.maven.plugins&a=maven-jar-plugin&collapseresults=true
Problem to read inputStream : https://gazelle.ihe.net/nexus/service/local/lucene/search?g=org.apache.maven.plugins&a=maven-compiler-plugin&collapseresults=true
Problem to read inputStream : https://gazelle.ihe.net/nexus/service/local/lucene/search?g=&g=org.apache.maven.plugins&a=maven-compiler-plugin&collapseresults=true
Problem to read inputStream : https://gazelle.ihe.net/nexus/service/local/lucene/search?g=org.apache.maven.plugins&a=maven-surefire-plugin&collapseresults=true
Problem to read inputStream : https://gazelle.ihe.net/nexus/service/local/lucene/search?g=&g=org.apache.maven.plugins&a=maven-surefire-plugin&collapseresults=true
Problem to read inputStream : https://gazelle.ihe.net/nexus/service/local/lucene/search?g=org.pitest&a=pitest-maven&collapseresults=true
Problem to read inputStream : https://gazelle.ihe.net/nexus/service/local/lucene/search?g=&g=org.pitest&a=pitest-maven&collapseresults=true
Problem to read inputStream : https://gazelle.ihe.net/nexus/service/local/lucene/search?g=org.jacoco&a=jacoco-maven-plugin&collapseresults=true
Problem to read inputStream : https://gazelle.ihe.net/nexus/service/local/lucene/search?g=&g=org.jacoco&a=jacoco-maven-plugin&collapseresults=true
Problem to read inputStream : https://gazelle.ihe.net/nexus/service/local/lucene/search?g=org.apache.maven.plugins&a=maven-release-plugin&collapseresults=true
Problem to read inputStream : https://gazelle.ihe.net/nexus/service/local/lucene/search?g=&g=org.apache.maven.plugins&a=maven-release-plugin&collapseresults=true
Problem to read inputStream : https://gazelle.ihe.net/nexus/service/local/lucene/search?g=org.apache.maven.plugins&a=maven-clean-plugin&collapseresults=true
Problem to read inputStream : https://gazelle.ihe.net/nexus/service/local/lucene/search?g=&g=org.apache.maven.plugins&a=maven-clean-plugin&collapseresults=true
Problem to read inputStream : https://gazelle.ihe.net/nexus/service/local/lucene/search?g=org.apache.maven.plugins&a=maven-resources-plugin&collapseresults=true
Problem to read inputStream : https://gazelle.ihe.net/nexus/service/local/lucene/search?g=&g=org.apache.maven.plugins&a=maven-resources-plugin&collapseresults=true
Problem to read inputStream : https://gazelle.ihe.net/nexus/service/local/lucene/search?g=org.apache.maven.plugins&a=maven-install-plugin&collapseresults=true
Problem to read inputStream : https://gazelle.ihe.net/nexus/service/local/lucene/search?g=&g=org.apache.maven.plugins&a=maven-install-plugin&collapseresults=true
Problem to read inputStream : https://gazelle.ihe.net/nexus/service/local/lucene/search?g=org.apache.maven.plugins&a=maven-deploy-plugin&collapseresults=true
Problem to read inputStream : https://gazelle.ihe.net/nexus/service/local/lucene/search?g=&g=org.apache.maven.plugins&a=maven-deploy-plugin&collapseresults=true
Problem to read inputStream : https://gazelle.ihe.net/nexus/service/local/lucene/search?g=org.apache.maven.plugins&a=maven-site-plugin&collapseresults=true
Problem to read inputStream : https://gazelle.ihe.net/nexus/service/local/lucene/search?g=&g=org.apache.maven.plugins&a=maven-site-plugin&collapseresults=true
Problem to read inputStream : https://gazelle.ihe.net/nexus/service/local/lucene/search?g=org.apache.maven.plugins&a=maven-antrun-plugin&collapseresults=true
Problem to read inputStream : https://gazelle.ihe.net/nexus/service/local/lucene/search?g=&g=org.apache.maven.plugins&a=maven-antrun-plugin&collapseresults=true
Problem to read inputStream : https://gazelle.ihe.net/nexus/service/local/lucene/search?g=org.apache.maven.plugins&a=maven-assembly-plugin&collapseresults=true
Problem to read inputStream : https://gazelle.ihe.net/nexus/service/local/lucene/search?g=&g=org.apache.maven.plugins&a=maven-assembly-plugin&collapseresults=true
Problem to read inputStream : https://gazelle.ihe.net/nexus/service/local/lucene/search?g=org.apache.maven.plugins&a=maven-dependency-plugin&collapseresults=true
Problem to read inputStream : https://gazelle.ihe.net/nexus/service/local/lucene/search?g=&g=org.apache.maven.plugins&a=maven-dependency-plugin&collapseresults=true
Problem to read inputStream : https://gazelle.ihe.net/nexus/service/local/lucene/search?g=org.apache.maven.plugins&a=maven-release-plugin&collapseresults=true
Problem to read inputStream : https://gazelle.ihe.net/nexus/service/local/lucene/search?g=&g=org.apache.maven.plugins&a=maven-release-plugin&collapseresults=true
Problem to read inputStream : https://gazelle.ihe.net/nexus/service/local/lucene/search?g=org.jacoco&a=jacoco-maven-plugin&collapseresults=true
Problem to read inputStream : https://gazelle.ihe.net/nexus/service/local/lucene/search?g=&g=org.jacoco&a=jacoco-maven-plugin&collapseresults=true
[INFO] Generating "CI Management" report    --- maven-project-info-reports-plugin:2.9
[INFO] Generating "Dependencies" report    --- maven-project-info-reports-plugin:2.9
[WARNING] Unable to create Maven project from repository.
org.apache.maven.project.InvalidProjectModelException: Some problems were encountered while processing the POMs:
[ERROR] 'dependencies.dependency.version' for net.ihe.gazelle.hql:gazelle-hql:jar is missing. @ net.ihe.gazelle:AssertionManagerGui-model:[unknown-version], /home/jenkins/.m2/repository/net/ihe/gazelle/AssertionManagerGui-model/4.1.0/AssertionManagerGui-model-4.1.0.pom, line 64, column 21
[ERROR] 'dependencies.dependency.version' for net.ihe.gazelle.maven:gazelle-tools-jar:jar is missing. @ net.ihe.gazelle:AssertionManagerGui-model:[unknown-version], /home/jenkins/.m2/repository/net/ihe/gazelle/AssertionManagerGui-model/4.1.0/AssertionManagerGui-model-4.1.0.pom, line 70, column 21
[ERROR] 'dependencies.dependency.version' for net.ihe.gazelle.maven:gazelle-seam-tools-jar:ejb is missing. @ net.ihe.gazelle:AssertionManagerGui-model:[unknown-version], /home/jenkins/.m2/repository/net/ihe/gazelle/AssertionManagerGui-model/4.1.0/AssertionManagerGui-model-4.1.0.pom, line 74, column 21
[ERROR] 'dependencies.dependency.version' for net.ihe.gazelle.junit:gazelle-junit:test-jar is missing. @ net.ihe.gazelle:AssertionManagerGui-model:[unknown-version], /home/jenkins/.m2/repository/net/ihe/gazelle/AssertionManagerGui-model/4.1.0/AssertionManagerGui-model-4.1.0.pom, line 90, column 21
[ERROR] 'dependencies.dependency.version' for org.hibernate:hibernate-validator:jar is missing. @ net.ihe.gazelle:AssertionManagerGui-model:[unknown-version], /home/jenkins/.m2/repository/net/ihe/gazelle/AssertionManagerGui-model/4.1.0/AssertionManagerGui-model-4.1.0.pom, line 97, column 21
[ERROR] 'dependencies.dependency.version' for org.hibernate:hibernate-entitymanager:jar is missing. @ net.ihe.gazelle:AssertionManagerGui-model:[unknown-version], /home/jenkins/.m2/repository/net/ihe/gazelle/AssertionManagerGui-model/4.1.0/AssertionManagerGui-model-4.1.0.pom, line 101, column 21
[ERROR] 'dependencies.dependency.version' for org.hibernate:hibernate-core:jar is missing. @ net.ihe.gazelle:AssertionManagerGui-model:[unknown-version], /home/jenkins/.m2/repository/net/ihe/gazelle/AssertionManagerGui-model/4.1.0/AssertionManagerGui-model-4.1.0.pom, line 105, column 21
[ERROR] 'dependencies.dependency.version' for sun-jaxb:jaxb-impl:jar is missing. @ net.ihe.gazelle:AssertionManagerGui-model:[unknown-version], /home/jenkins/.m2/repository/net/ihe/gazelle/AssertionManagerGui-model/4.1.0/AssertionManagerGui-model-4.1.0.pom, line 109, column 21
[ERROR] 'dependencies.dependency.version' for javax.servlet:servlet-api:jar is missing. @ net.ihe.gazelle:AssertionManagerGui-model:[unknown-version], /home/jenkins/.m2/repository/net/ihe/gazelle/AssertionManagerGui-model/4.1.0/AssertionManagerGui-model-4.1.0.pom, line 113, column 21
[ERROR] 'dependencies.dependency.version' for postgresql:postgresql:jar is missing. @ net.ihe.gazelle:AssertionManagerGui-model:[unknown-version], /home/jenkins/.m2/repository/net/ihe/gazelle/AssertionManagerGui-model/4.1.0/AssertionManagerGui-model-4.1.0.pom, line 123, column 21
[ERROR] 'dependencies.dependency.version' for net.sf.ehcache:ehcache-core:jar is missing. @ net.ihe.gazelle:AssertionManagerGui-model:[unknown-version], /home/jenkins/.m2/repository/net/ihe/gazelle/AssertionManagerGui-model/4.1.0/AssertionManagerGui-model-4.1.0.pom, line 128, column 21
[ERROR] 'dependencies.dependency.version' for org.reflections:reflections:jar is missing. @ net.ihe.gazelle:AssertionManagerGui-model:[unknown-version], /home/jenkins/.m2/repository/net/ihe/gazelle/AssertionManagerGui-model/4.1.0/AssertionManagerGui-model-4.1.0.pom, line 133, column 21
[ERROR] 'dependencies.dependency.version' for c3p0:c3p0:jar is missing. @ net.ihe.gazelle:AssertionManagerGui-model:[unknown-version], /home/jenkins/.m2/repository/net/ihe/gazelle/AssertionManagerGui-model/4.1.0/AssertionManagerGui-model-4.1.0.pom, line 138, column 21
[ERROR] 'dependencies.dependency.version' for org.hibernate:hibernate-c3p0:jar is missing. @ net.ihe.gazelle:AssertionManagerGui-model:[unknown-version], /home/jenkins/.m2/repository/net/ihe/gazelle/AssertionManagerGui-model/4.1.0/AssertionManagerGui-model-4.1.0.pom, line 143, column 21
[ERROR] 'dependencies.dependency.version' for commons-logging:commons-logging:jar is missing. @ net.ihe.gazelle:AssertionManagerGui-model:[unknown-version], /home/jenkins/.m2/repository/net/ihe/gazelle/AssertionManagerGui-model/4.1.0/AssertionManagerGui-model-4.1.0.pom, line 148, column 21
[ERROR] 'dependencies.dependency.version' for org.slf4j:slf4j-simple:jar is missing. @ net.ihe.gazelle:AssertionManagerGui-model:[unknown-version], /home/jenkins/.m2/repository/net/ihe/gazelle/AssertionManagerGui-model/4.1.0/AssertionManagerGui-model-4.1.0.pom, line 153, column 21
[ERROR] 'dependencies.dependency.version' for org.jboss.spec.javax.faces:jboss-jsf-api_2.1_spec:jar is missing. @ net.ihe.gazelle:AssertionManagerGui-model:[unknown-version], /home/jenkins/.m2/repository/net/ihe/gazelle/AssertionManagerGui-model/4.1.0/AssertionManagerGui-model-4.1.0.pom, line 158, column 21
[ERROR] 'dependencies.dependency.version' for org.hibernate.javax.persistence:hibernate-jpa-2.0-api:jar is missing. @ net.ihe.gazelle:AssertionManagerGui-model:[unknown-version], /home/jenkins/.m2/repository/net/ihe/gazelle/AssertionManagerGui-model/4.1.0/AssertionManagerGui-model-4.1.0.pom, line 162, column 21
[ERROR] 'dependencies.dependency.version' for net.ihe.gazelle.tm.services:gazelle-tm-rest-data:jar is missing. @ net.ihe.gazelle:AssertionManagerGui-model:[unknown-version], /home/jenkins/.m2/repository/net/ihe/gazelle/AssertionManagerGui-model/4.1.0/AssertionManagerGui-model-4.1.0.pom, line 172, column 21
 for project 
    at org.apache.maven.project.DefaultMavenProjectBuilder.transformError (DefaultMavenProjectBuilder.java:193)
    at org.apache.maven.project.DefaultMavenProjectBuilder.buildFromRepository (DefaultMavenProjectBuilder.java:240)
    at org.apache.maven.project.DefaultMavenProjectBuilder.buildFromRepository (DefaultMavenProjectBuilder.java:251)
    at org.apache.maven.report.projectinfo.dependencies.RepositoryUtils.getMavenProjectFromRepository (RepositoryUtils.java:298)
    at org.apache.maven.report.projectinfo.dependencies.renderer.DependenciesRenderer.renderArtifactRow (DependenciesRenderer.java:903)
    at org.apache.maven.report.projectinfo.dependencies.renderer.DependenciesRenderer.renderDependenciesForScope (DependenciesRenderer.java:852)
    at org.apache.maven.report.projectinfo.dependencies.renderer.DependenciesRenderer.renderDependenciesForAllScopes (DependenciesRenderer.java:427)
    at org.apache.maven.report.projectinfo.dependencies.renderer.DependenciesRenderer.renderSectionProjectDependencies (DependenciesRenderer.java:411)
    at org.apache.maven.report.projectinfo.dependencies.renderer.DependenciesRenderer.renderBody (DependenciesRenderer.java:226)
    at org.apache.maven.reporting.AbstractMavenReportRenderer.render (AbstractMavenReportRenderer.java:83)
    at org.apache.maven.report.projectinfo.DependenciesReport.executeReport (DependenciesReport.java:201)
    at org.apache.maven.reporting.AbstractMavenReport.generate (AbstractMavenReport.java:255)
    at org.apache.maven.plugins.site.ReportDocumentRenderer.renderDocument (ReportDocumentRenderer.java:219)
    at org.apache.maven.doxia.siterenderer.DefaultSiteRenderer.renderModule (DefaultSiteRenderer.java:319)
    at org.apache.maven.doxia.siterenderer.DefaultSiteRenderer.render (DefaultSiteRenderer.java:135)
    at org.apache.maven.plugins.site.SiteMojo.renderLocale (SiteMojo.java:175)
    at org.apache.maven.plugins.site.SiteMojo.execute (SiteMojo.java:138)
    at org.apache.maven.plugin.DefaultBuildPluginManager.executeMojo (DefaultBuildPluginManager.java:134)
    at org.apache.maven.lifecycle.internal.MojoExecutor.execute (MojoExecutor.java:208)
    at org.apache.maven.lifecycle.internal.MojoExecutor.execute (MojoExecutor.java:154)
    at org.apache.maven.lifecycle.internal.MojoExecutor.execute (MojoExecutor.java:146)
    at org.apache.maven.lifecycle.internal.LifecycleModuleBuilder.buildProject (LifecycleModuleBuilder.java:117)
    at org.apache.maven.lifecycle.internal.LifecycleModuleBuilder.buildProject (LifecycleModuleBuilder.java:81)
    at org.apache.maven.lifecycle.internal.builder.singlethreaded.SingleThreadedBuilder.build (SingleThreadedBuilder.java:51)
    at org.apache.maven.lifecycle.internal.LifecycleStarter.execute (LifecycleStarter.java:128)
    at org.apache.maven.DefaultMaven.doExecute (DefaultMaven.java:309)
    at org.apache.maven.DefaultMaven.doExecute (DefaultMaven.java:194)
    at org.apache.maven.DefaultMaven.execute (DefaultMaven.java:107)
    at org.jvnet.hudson.maven3.launcher.Maven35Launcher.main (Maven35Launcher.java:130)
    at sun.reflect.NativeMethodAccessorImpl.invoke0 (Native Method)
    at sun.reflect.NativeMethodAccessorImpl.invoke (NativeMethodAccessorImpl.java:62)
    at sun.reflect.DelegatingMethodAccessorImpl.invoke (DelegatingMethodAccessorImpl.java:43)
    at java.lang.reflect.Method.invoke (Method.java:498)
    at org.codehaus.plexus.classworlds.launcher.Launcher.launchEnhanced (Launcher.java:289)
    at org.codehaus.plexus.classworlds.launcher.Launcher.launch (Launcher.java:229)
    at jenkins.maven3.agent.Maven35Main.launch (Maven35Main.java:178)
    at sun.reflect.NativeMethodAccessorImpl.invoke0 (Native Method)
    at sun.reflect.NativeMethodAccessorImpl.invoke (NativeMethodAccessorImpl.java:62)
    at sun.reflect.DelegatingMethodAccessorImpl.invoke (DelegatingMethodAccessorImpl.java:43)
    at java.lang.reflect.Method.invoke (Method.java:498)
    at hudson.maven.Maven3Builder.call (Maven3Builder.java:139)
    at hudson.maven.Maven3Builder.call (Maven3Builder.java:70)
    at hudson.remoting.UserRequest.perform (UserRequest.java:211)
    at hudson.remoting.UserRequest.perform (UserRequest.java:54)
    at hudson.remoting.Request$2.run (Request.java:376)
    at hudson.remoting.InterceptingExecutorService.lambda$wrap$0 (InterceptingExecutorService.java:78)
    at java.util.concurrent.FutureTask.run (FutureTask.java:266)
    at java.util.concurrent.ThreadPoolExecutor.runWorker (ThreadPoolExecutor.java:1149)
    at java.util.concurrent.ThreadPoolExecutor$Worker.run (ThreadPoolExecutor.java:624)
    at java.lang.Thread.run (Thread.java:748)
[WARNING] Unable to create Maven project from repository for artifact net.ihe.gazelle:AssertionManagerGui-model:jar:4.1.0
org.apache.maven.project.InvalidProjectModelException: Some problems were encountered while processing the POMs:
[ERROR] 'dependencies.dependency.version' for net.ihe.gazelle.hql:gazelle-hql:jar is missing. @ net.ihe.gazelle:AssertionManagerGui-model:[unknown-version], /home/jenkins/.m2/repository/net/ihe/gazelle/AssertionManagerGui-model/4.1.0/AssertionManagerGui-model-4.1.0.pom, line 64, column 21
[ERROR] 'dependencies.dependency.version' for net.ihe.gazelle.maven:gazelle-tools-jar:jar is missing. @ net.ihe.gazelle:AssertionManagerGui-model:[unknown-version], /home/jenkins/.m2/repository/net/ihe/gazelle/AssertionManagerGui-model/4.1.0/AssertionManagerGui-model-4.1.0.pom, line 70, column 21
[ERROR] 'dependencies.dependency.version' for net.ihe.gazelle.maven:gazelle-seam-tools-jar:ejb is missing. @ net.ihe.gazelle:AssertionManagerGui-model:[unknown-version], /home/jenkins/.m2/repository/net/ihe/gazelle/AssertionManagerGui-model/4.1.0/AssertionManagerGui-model-4.1.0.pom, line 74, column 21
[ERROR] 'dependencies.dependency.version' for net.ihe.gazelle.junit:gazelle-junit:test-jar is missing. @ net.ihe.gazelle:AssertionManagerGui-model:[unknown-version], /home/jenkins/.m2/repository/net/ihe/gazelle/AssertionManagerGui-model/4.1.0/AssertionManagerGui-model-4.1.0.pom, line 90, column 21
[ERROR] 'dependencies.dependency.version' for org.hibernate:hibernate-validator:jar is missing. @ net.ihe.gazelle:AssertionManagerGui-model:[unknown-version], /home/jenkins/.m2/repository/net/ihe/gazelle/AssertionManagerGui-model/4.1.0/AssertionManagerGui-model-4.1.0.pom, line 97, column 21
[ERROR] 'dependencies.dependency.version' for org.hibernate:hibernate-entitymanager:jar is missing. @ net.ihe.gazelle:AssertionManagerGui-model:[unknown-version], /home/jenkins/.m2/repository/net/ihe/gazelle/AssertionManagerGui-model/4.1.0/AssertionManagerGui-model-4.1.0.pom, line 101, column 21
[ERROR] 'dependencies.dependency.version' for org.hibernate:hibernate-core:jar is missing. @ net.ihe.gazelle:AssertionManagerGui-model:[unknown-version], /home/jenkins/.m2/repository/net/ihe/gazelle/AssertionManagerGui-model/4.1.0/AssertionManagerGui-model-4.1.0.pom, line 105, column 21
[ERROR] 'dependencies.dependency.version' for sun-jaxb:jaxb-impl:jar is missing. @ net.ihe.gazelle:AssertionManagerGui-model:[unknown-version], /home/jenkins/.m2/repository/net/ihe/gazelle/AssertionManagerGui-model/4.1.0/AssertionManagerGui-model-4.1.0.pom, line 109, column 21
[ERROR] 'dependencies.dependency.version' for javax.servlet:servlet-api:jar is missing. @ net.ihe.gazelle:AssertionManagerGui-model:[unknown-version], /home/jenkins/.m2/repository/net/ihe/gazelle/AssertionManagerGui-model/4.1.0/AssertionManagerGui-model-4.1.0.pom, line 113, column 21
[ERROR] 'dependencies.dependency.version' for postgresql:postgresql:jar is missing. @ net.ihe.gazelle:AssertionManagerGui-model:[unknown-version], /home/jenkins/.m2/repository/net/ihe/gazelle/AssertionManagerGui-model/4.1.0/AssertionManagerGui-model-4.1.0.pom, line 123, column 21
[ERROR] 'dependencies.dependency.version' for net.sf.ehcache:ehcache-core:jar is missing. @ net.ihe.gazelle:AssertionManagerGui-model:[unknown-version], /home/jenkins/.m2/repository/net/ihe/gazelle/AssertionManagerGui-model/4.1.0/AssertionManagerGui-model-4.1.0.pom, line 128, column 21
[ERROR] 'dependencies.dependency.version' for org.reflections:reflections:jar is missing. @ net.ihe.gazelle:AssertionManagerGui-model:[unknown-version], /home/jenkins/.m2/repository/net/ihe/gazelle/AssertionManagerGui-model/4.1.0/AssertionManagerGui-model-4.1.0.pom, line 133, column 21
[ERROR] 'dependencies.dependency.version' for c3p0:c3p0:jar is missing. @ net.ihe.gazelle:AssertionManagerGui-model:[unknown-version], /home/jenkins/.m2/repository/net/ihe/gazelle/AssertionManagerGui-model/4.1.0/AssertionManagerGui-model-4.1.0.pom, line 138, column 21
[ERROR] 'dependencies.dependency.version' for org.hibernate:hibernate-c3p0:jar is missing. @ net.ihe.gazelle:AssertionManagerGui-model:[unknown-version], /home/jenkins/.m2/repository/net/ihe/gazelle/AssertionManagerGui-model/4.1.0/AssertionManagerGui-model-4.1.0.pom, line 143, column 21
[ERROR] 'dependencies.dependency.version' for commons-logging:commons-logging:jar is missing. @ net.ihe.gazelle:AssertionManagerGui-model:[unknown-version], /home/jenkins/.m2/repository/net/ihe/gazelle/AssertionManagerGui-model/4.1.0/AssertionManagerGui-model-4.1.0.pom, line 148, column 21
[ERROR] 'dependencies.dependency.version' for org.slf4j:slf4j-simple:jar is missing. @ net.ihe.gazelle:AssertionManagerGui-model:[unknown-version], /home/jenkins/.m2/repository/net/ihe/gazelle/AssertionManagerGui-model/4.1.0/AssertionManagerGui-model-4.1.0.pom, line 153, column 21
[ERROR] 'dependencies.dependency.version' for org.jboss.spec.javax.faces:jboss-jsf-api_2.1_spec:jar is missing. @ net.ihe.gazelle:AssertionManagerGui-model:[unknown-version], /home/jenkins/.m2/repository/net/ihe/gazelle/AssertionManagerGui-model/4.1.0/AssertionManagerGui-model-4.1.0.pom, line 158, column 21
[ERROR] 'dependencies.dependency.version' for org.hibernate.javax.persistence:hibernate-jpa-2.0-api:jar is missing. @ net.ihe.gazelle:AssertionManagerGui-model:[unknown-version], /home/jenkins/.m2/repository/net/ihe/gazelle/AssertionManagerGui-model/4.1.0/AssertionManagerGui-model-4.1.0.pom, line 162, column 21
[ERROR] 'dependencies.dependency.version' for net.ihe.gazelle.tm.services:gazelle-tm-rest-data:jar is missing. @ net.ihe.gazelle:AssertionManagerGui-model:[unknown-version], /home/jenkins/.m2/repository/net/ihe/gazelle/AssertionManagerGui-model/4.1.0/AssertionManagerGui-model-4.1.0.pom, line 172, column 21
 for project 
    at org.apache.maven.project.DefaultMavenProjectBuilder.transformError (DefaultMavenProjectBuilder.java:193)
    at org.apache.maven.project.DefaultMavenProjectBuilder.buildFromRepository (DefaultMavenProjectBuilder.java:240)
    at org.apache.maven.project.DefaultMavenProjectBuilder.buildFromRepository (DefaultMavenProjectBuilder.java:251)
    at org.apache.maven.report.projectinfo.dependencies.RepositoryUtils.getMavenProjectFromRepository (RepositoryUtils.java:298)
    at org.apache.maven.report.projectinfo.dependencies.renderer.DependenciesRenderer.printDescriptionsAndURLs (DependenciesRenderer.java:994)
    at org.apache.maven.report.projectinfo.dependencies.renderer.DependenciesRenderer.printDependencyListing (DependenciesRenderer.java:951)
    at org.apache.maven.report.projectinfo.dependencies.renderer.DependenciesRenderer.printDependencyListing (DependenciesRenderer.java:971)
    at org.apache.maven.report.projectinfo.dependencies.renderer.DependenciesRenderer.renderSectionDependencyTree (DependenciesRenderer.java:500)
    at org.apache.maven.report.projectinfo.dependencies.renderer.DependenciesRenderer.renderSectionProjectDependencyGraph (DependenciesRenderer.java:463)
    at org.apache.maven.report.projectinfo.dependencies.renderer.DependenciesRenderer.renderBody (DependenciesRenderer.java:232)
    at org.apache.maven.reporting.AbstractMavenReportRenderer.render (AbstractMavenReportRenderer.java:83)
    at org.apache.maven.report.projectinfo.DependenciesReport.executeReport (DependenciesReport.java:201)
    at org.apache.maven.reporting.AbstractMavenReport.generate (AbstractMavenReport.java:255)
    at org.apache.maven.plugins.site.ReportDocumentRenderer.renderDocument (ReportDocumentRenderer.java:219)
    at org.apache.maven.doxia.siterenderer.DefaultSiteRenderer.renderModule (DefaultSiteRenderer.java:319)
    at org.apache.maven.doxia.siterenderer.DefaultSiteRenderer.render (DefaultSiteRenderer.java:135)
    at org.apache.maven.plugins.site.SiteMojo.renderLocale (SiteMojo.java:175)
    at org.apache.maven.plugins.site.SiteMojo.execute (SiteMojo.java:138)
    at org.apache.maven.plugin.DefaultBuildPluginManager.executeMojo (DefaultBuildPluginManager.java:134)
    at org.apache.maven.lifecycle.internal.MojoExecutor.execute (MojoExecutor.java:208)
    at org.apache.maven.lifecycle.internal.MojoExecutor.execute (MojoExecutor.java:154)
    at org.apache.maven.lifecycle.internal.MojoExecutor.execute (MojoExecutor.java:146)
    at org.apache.maven.lifecycle.internal.LifecycleModuleBuilder.buildProject (LifecycleModuleBuilder.java:117)
    at org.apache.maven.lifecycle.internal.LifecycleModuleBuilder.buildProject (LifecycleModuleBuilder.java:81)
    at org.apache.maven.lifecycle.internal.builder.singlethreaded.SingleThreadedBuilder.build (SingleThreadedBuilder.java:51)
    at org.apache.maven.lifecycle.internal.LifecycleStarter.execute (LifecycleStarter.java:128)
    at org.apache.maven.DefaultMaven.doExecute (DefaultMaven.java:309)
    at org.apache.maven.DefaultMaven.doExecute (DefaultMaven.java:194)
    at org.apache.maven.DefaultMaven.execute (DefaultMaven.java:107)
    at org.jvnet.hudson.maven3.launcher.Maven35Launcher.main (Maven35Launcher.java:130)
    at sun.reflect.NativeMethodAccessorImpl.invoke0 (Native Method)
    at sun.reflect.NativeMethodAccessorImpl.invoke (NativeMethodAccessorImpl.java:62)
    at sun.reflect.DelegatingMethodAccessorImpl.invoke (DelegatingMethodAccessorImpl.java:43)
    at java.lang.reflect.Method.invoke (Method.java:498)
    at org.codehaus.plexus.classworlds.launcher.Launcher.launchEnhanced (Launcher.java:289)
    at org.codehaus.plexus.classworlds.launcher.Launcher.launch (Launcher.java:229)
    at jenkins.maven3.agent.Maven35Main.launch (Maven35Main.java:178)
    at sun.reflect.NativeMethodAccessorImpl.invoke0 (Native Method)
    at sun.reflect.NativeMethodAccessorImpl.invoke (NativeMethodAccessorImpl.java:62)
    at sun.reflect.DelegatingMethodAccessorImpl.invoke (DelegatingMethodAccessorImpl.java:43)
    at java.lang.reflect.Method.invoke (Method.java:498)
    at hudson.maven.Maven3Builder.call (Maven3Builder.java:139)
    at hudson.maven.Maven3Builder.call (Maven3Builder.java:70)
    at hudson.remoting.UserRequest.perform (UserRequest.java:211)
    at hudson.remoting.UserRequest.perform (UserRequest.java:54)
    at hudson.remoting.Request$2.run (Request.java:376)
    at hudson.remoting.InterceptingExecutorService.lambda$wrap$0 (InterceptingExecutorService.java:78)
    at java.util.concurrent.FutureTask.run (FutureTask.java:266)
    at java.util.concurrent.ThreadPoolExecutor.runWorker (ThreadPoolExecutor.java:1149)
    at java.util.concurrent.ThreadPoolExecutor$Worker.run (ThreadPoolExecutor.java:624)
    at java.lang.Thread.run (Thread.java:748)
[WARNING] Unable to create Maven project from repository for artifact net.ihe.gazelle:AssertionManagerGui-model:jar:4.1.0
org.apache.maven.project.InvalidProjectModelException: Some problems were encountered while processing the POMs:
[ERROR] 'dependencies.dependency.version' for net.ihe.gazelle.hql:gazelle-hql:jar is missing. @ net.ihe.gazelle:AssertionManagerGui-model:[unknown-version], /home/jenkins/.m2/repository/net/ihe/gazelle/AssertionManagerGui-model/4.1.0/AssertionManagerGui-model-4.1.0.pom, line 64, column 21
[ERROR] 'dependencies.dependency.version' for net.ihe.gazelle.maven:gazelle-tools-jar:jar is missing. @ net.ihe.gazelle:AssertionManagerGui-model:[unknown-version], /home/jenkins/.m2/repository/net/ihe/gazelle/AssertionManagerGui-model/4.1.0/AssertionManagerGui-model-4.1.0.pom, line 70, column 21
[ERROR] 'dependencies.dependency.version' for net.ihe.gazelle.maven:gazelle-seam-tools-jar:ejb is missing. @ net.ihe.gazelle:AssertionManagerGui-model:[unknown-version], /home/jenkins/.m2/repository/net/ihe/gazelle/AssertionManagerGui-model/4.1.0/AssertionManagerGui-model-4.1.0.pom, line 74, column 21
[ERROR] 'dependencies.dependency.version' for net.ihe.gazelle.junit:gazelle-junit:test-jar is missing. @ net.ihe.gazelle:AssertionManagerGui-model:[unknown-version], /home/jenkins/.m2/repository/net/ihe/gazelle/AssertionManagerGui-model/4.1.0/AssertionManagerGui-model-4.1.0.pom, line 90, column 21
[ERROR] 'dependencies.dependency.version' for org.hibernate:hibernate-validator:jar is missing. @ net.ihe.gazelle:AssertionManagerGui-model:[unknown-version], /home/jenkins/.m2/repository/net/ihe/gazelle/AssertionManagerGui-model/4.1.0/AssertionManagerGui-model-4.1.0.pom, line 97, column 21
[ERROR] 'dependencies.dependency.version' for org.hibernate:hibernate-entitymanager:jar is missing. @ net.ihe.gazelle:AssertionManagerGui-model:[unknown-version], /home/jenkins/.m2/repository/net/ihe/gazelle/AssertionManagerGui-model/4.1.0/AssertionManagerGui-model-4.1.0.pom, line 101, column 21
[ERROR] 'dependencies.dependency.version' for org.hibernate:hibernate-core:jar is missing. @ net.ihe.gazelle:AssertionManagerGui-model:[unknown-version], /home/jenkins/.m2/repository/net/ihe/gazelle/AssertionManagerGui-model/4.1.0/AssertionManagerGui-model-4.1.0.pom, line 105, column 21
[ERROR] 'dependencies.dependency.version' for sun-jaxb:jaxb-impl:jar is missing. @ net.ihe.gazelle:AssertionManagerGui-model:[unknown-version], /home/jenkins/.m2/repository/net/ihe/gazelle/AssertionManagerGui-model/4.1.0/AssertionManagerGui-model-4.1.0.pom, line 109, column 21
[ERROR] 'dependencies.dependency.version' for javax.servlet:servlet-api:jar is missing. @ net.ihe.gazelle:AssertionManagerGui-model:[unknown-version], /home/jenkins/.m2/repository/net/ihe/gazelle/AssertionManagerGui-model/4.1.0/AssertionManagerGui-model-4.1.0.pom, line 113, column 21
[ERROR] 'dependencies.dependency.version' for postgresql:postgresql:jar is missing. @ net.ihe.gazelle:AssertionManagerGui-model:[unknown-version], /home/jenkins/.m2/repository/net/ihe/gazelle/AssertionManagerGui-model/4.1.0/AssertionManagerGui-model-4.1.0.pom, line 123, column 21
[ERROR] 'dependencies.dependency.version' for net.sf.ehcache:ehcache-core:jar is missing. @ net.ihe.gazelle:AssertionManagerGui-model:[unknown-version], /home/jenkins/.m2/repository/net/ihe/gazelle/AssertionManagerGui-model/4.1.0/AssertionManagerGui-model-4.1.0.pom, line 128, column 21
[ERROR] 'dependencies.dependency.version' for org.reflections:reflections:jar is missing. @ net.ihe.gazelle:AssertionManagerGui-model:[unknown-version], /home/jenkins/.m2/repository/net/ihe/gazelle/AssertionManagerGui-model/4.1.0/AssertionManagerGui-model-4.1.0.pom, line 133, column 21
[ERROR] 'dependencies.dependency.version' for c3p0:c3p0:jar is missing. @ net.ihe.gazelle:AssertionManagerGui-model:[unknown-version], /home/jenkins/.m2/repository/net/ihe/gazelle/AssertionManagerGui-model/4.1.0/AssertionManagerGui-model-4.1.0.pom, line 138, column 21
[ERROR] 'dependencies.dependency.version' for org.hibernate:hibernate-c3p0:jar is missing. @ net.ihe.gazelle:AssertionManagerGui-model:[unknown-version], /home/jenkins/.m2/repository/net/ihe/gazelle/AssertionManagerGui-model/4.1.0/AssertionManagerGui-model-4.1.0.pom, line 143, column 21
[ERROR] 'dependencies.dependency.version' for commons-logging:commons-logging:jar is missing. @ net.ihe.gazelle:AssertionManagerGui-model:[unknown-version], /home/jenkins/.m2/repository/net/ihe/gazelle/AssertionManagerGui-model/4.1.0/AssertionManagerGui-model-4.1.0.pom, line 148, column 21
[ERROR] 'dependencies.dependency.version' for org.slf4j:slf4j-simple:jar is missing. @ net.ihe.gazelle:AssertionManagerGui-model:[unknown-version], /home/jenkins/.m2/repository/net/ihe/gazelle/AssertionManagerGui-model/4.1.0/AssertionManagerGui-model-4.1.0.pom, line 153, column 21
[ERROR] 'dependencies.dependency.version' for org.jboss.spec.javax.faces:jboss-jsf-api_2.1_spec:jar is missing. @ net.ihe.gazelle:AssertionManagerGui-model:[unknown-version], /home/jenkins/.m2/repository/net/ihe/gazelle/AssertionManagerGui-model/4.1.0/AssertionManagerGui-model-4.1.0.pom, line 158, column 21
[ERROR] 'dependencies.dependency.version' for org.hibernate.javax.persistence:hibernate-jpa-2.0-api:jar is missing. @ net.ihe.gazelle:AssertionManagerGui-model:[unknown-version], /home/jenkins/.m2/repository/net/ihe/gazelle/AssertionManagerGui-model/4.1.0/AssertionManagerGui-model-4.1.0.pom, line 162, column 21
[ERROR] 'dependencies.dependency.version' for net.ihe.gazelle.tm.services:gazelle-tm-rest-data:jar is missing. @ net.ihe.gazelle:AssertionManagerGui-model:[unknown-version], /home/jenkins/.m2/repository/net/ihe/gazelle/AssertionManagerGui-model/4.1.0/AssertionManagerGui-model-4.1.0.pom, line 172, column 21
 for project 
    at org.apache.maven.project.DefaultMavenProjectBuilder.transformError (DefaultMavenProjectBuilder.java:193)
    at org.apache.maven.project.DefaultMavenProjectBuilder.buildFromRepository (DefaultMavenProjectBuilder.java:240)
    at org.apache.maven.project.DefaultMavenProjectBuilder.buildFromRepository (DefaultMavenProjectBuilder.java:251)
    at org.apache.maven.report.projectinfo.dependencies.RepositoryUtils.getMavenProjectFromRepository (RepositoryUtils.java:298)
    at org.apache.maven.report.projectinfo.dependencies.renderer.DependenciesRenderer.renderSectionDependencyRepositoryLocations (DependenciesRenderer.java:800)
    at org.apache.maven.report.projectinfo.dependencies.renderer.DependenciesRenderer.renderBody (DependenciesRenderer.java:246)
    at org.apache.maven.reporting.AbstractMavenReportRenderer.render (AbstractMavenReportRenderer.java:83)
    at org.apache.maven.report.projectinfo.DependenciesReport.executeReport (DependenciesReport.java:201)
    at org.apache.maven.reporting.AbstractMavenReport.generate (AbstractMavenReport.java:255)
    at org.apache.maven.plugins.site.ReportDocumentRenderer.renderDocument (ReportDocumentRenderer.java:219)
    at org.apache.maven.doxia.siterenderer.DefaultSiteRenderer.renderModule (DefaultSiteRenderer.java:319)
    at org.apache.maven.doxia.siterenderer.DefaultSiteRenderer.render (DefaultSiteRenderer.java:135)
    at org.apache.maven.plugins.site.SiteMojo.renderLocale (SiteMojo.java:175)
    at org.apache.maven.plugins.site.SiteMojo.execute (SiteMojo.java:138)
    at org.apache.maven.plugin.DefaultBuildPluginManager.executeMojo (DefaultBuildPluginManager.java:134)
    at org.apache.maven.lifecycle.internal.MojoExecutor.execute (MojoExecutor.java:208)
    at org.apache.maven.lifecycle.internal.MojoExecutor.execute (MojoExecutor.java:154)
    at org.apache.maven.lifecycle.internal.MojoExecutor.execute (MojoExecutor.java:146)
    at org.apache.maven.lifecycle.internal.LifecycleModuleBuilder.buildProject (LifecycleModuleBuilder.java:117)
    at org.apache.maven.lifecycle.internal.LifecycleModuleBuilder.buildProject (LifecycleModuleBuilder.java:81)
    at org.apache.maven.lifecycle.internal.builder.singlethreaded.SingleThreadedBuilder.build (SingleThreadedBuilder.java:51)
    at org.apache.maven.lifecycle.internal.LifecycleStarter.execute (LifecycleStarter.java:128)
    at org.apache.maven.DefaultMaven.doExecute (DefaultMaven.java:309)
    at org.apache.maven.DefaultMaven.doExecute (DefaultMaven.java:194)
    at org.apache.maven.DefaultMaven.execute (DefaultMaven.java:107)
    at org.jvnet.hudson.maven3.launcher.Maven35Launcher.main (Maven35Launcher.java:130)
    at sun.reflect.NativeMethodAccessorImpl.invoke0 (Native Method)
    at sun.reflect.NativeMethodAccessorImpl.invoke (NativeMethodAccessorImpl.java:62)
    at sun.reflect.DelegatingMethodAccessorImpl.invoke (DelegatingMethodAccessorImpl.java:43)
    at java.lang.reflect.Method.invoke (Method.java:498)
    at org.codehaus.plexus.classworlds.launcher.Launcher.launchEnhanced (Launcher.java:289)
    at org.codehaus.plexus.classworlds.launcher.Launcher.launch (Launcher.java:229)
    at jenkins.maven3.agent.Maven35Main.launch (Maven35Main.java:178)
    at sun.reflect.NativeMethodAccessorImpl.invoke0 (Native Method)
    at sun.reflect.NativeMethodAccessorImpl.invoke (NativeMethodAccessorImpl.java:62)
    at sun.reflect.DelegatingMethodAccessorImpl.invoke (DelegatingMethodAccessorImpl.java:43)
    at java.lang.reflect.Method.invoke (Method.java:498)
    at hudson.maven.Maven3Builder.call (Maven3Builder.java:139)
    at hudson.maven.Maven3Builder.call (Maven3Builder.java:70)
    at hudson.remoting.UserRequest.perform (UserRequest.java:211)
    at hudson.remoting.UserRequest.perform (UserRequest.java:54)
    at hudson.remoting.Request$2.run (Request.java:376)
    at hudson.remoting.InterceptingExecutorService.lambda$wrap$0 (InterceptingExecutorService.java:78)
    at java.util.concurrent.FutureTask.run (FutureTask.java:266)
    at java.util.concurrent.ThreadPoolExecutor.runWorker (ThreadPoolExecutor.java:1149)
    at java.util.concurrent.ThreadPoolExecutor$Worker.run (ThreadPoolExecutor.java:624)
    at java.lang.Thread.run (Thread.java:748)
[ERROR] Unable to determine if resource commons-lang:commons-lang:jar:2.6:compile exists in https://gazelle.ihe.net/nexus/content/groups/public
[ERROR] Unable to determine if resource gov.nist.math:jama:jar:1.0.3:compile exists in https://gazelle.ihe.net/nexus/content/groups/public
[ERROR] Unable to determine if resource junit:junit:jar:4.12:test exists in https://gazelle.ihe.net/nexus/content/groups/public
[ERROR] Unable to determine if resource log4j:log4j:jar:1.2.14:compile exists in https://gazelle.ihe.net/nexus/content/groups/public
[ERROR] Unable to determine if resource net.ihe.gazelle:AssertionManagerGui-model:jar:4.1.0:compile exists in https://gazelle.ihe.net/nexus/content/groups/public
[ERROR] Unable to determine if resource org.eclipse.emf:common:jar:2.7.0:compile exists in https://gazelle.ihe.net/nexus/content/groups/public
[ERROR] Unable to determine if resource org.eclipse.emf:ecore:jar:2.7.0:compile exists in https://gazelle.ihe.net/nexus/content/groups/public
[ERROR] Unable to determine if resource org.eclipse.emf:ecore.xmi:jar:2.7.0:compile exists in https://gazelle.ihe.net/nexus/content/groups/public
[ERROR] Unable to determine if resource org.eclipse.uml2:common:jar:1.6.0:compile exists in https://gazelle.ihe.net/nexus/content/groups/public
[ERROR] Unable to determine if resource org.eclipse.uml2:uml:jar:3.2.1:compile exists in https://gazelle.ihe.net/nexus/content/groups/public
[ERROR] Unable to determine if resource org.hamcrest:hamcrest-core:jar:1.3:test exists in https://gazelle.ihe.net/nexus/content/groups/public
[ERROR] Unable to determine if resource org.slf4j:slf4j-api:jar:1.5.6:compile exists in https://gazelle.ihe.net/nexus/content/groups/public
[ERROR] Unable to determine if resource org.slf4j:slf4j-log4j12:jar:1.5.6:compile exists in https://gazelle.ihe.net/nexus/content/groups/public
[INFO] Generating "Dependency Convergence" report    --- maven-project-info-reports-plugin:2.9
[WARNING] Invalid POM for net.ihe.gazelle:AssertionManagerGui-model:jar:4.1.0, transitive dependencies (if any) will not be available, enable debug logging for more details
[INFO] Generating "Dependency Information" report    --- maven-project-info-reports-plugin:2.9
[INFO] Generating "Distribution Management" report    --- maven-project-info-reports-plugin:2.9
[INFO] Generating "About" report    --- maven-project-info-reports-plugin:2.9
[INFO] Generating "Issue Management" report    --- maven-project-info-reports-plugin:2.9
[INFO] Generating "Mailing Lists" report    --- maven-project-info-reports-plugin:2.9
[INFO] Generating "Plugin Management" report    --- maven-project-info-reports-plugin:2.9
[INFO] Generating "Plugins" report    --- maven-project-info-reports-plugin:2.9
[INFO] Generating "Source Code Management" report    --- maven-project-info-reports-plugin:2.9
[INFO] Generating "Summary" report    --- maven-project-info-reports-plugin:2.9
[JENKINS] Archiving site from /home/jenkins/.hudson/jobs/gocmodel-jar/workspace/gocmodel-jar/target/site to /home/jenkins/.hudson/jobs/gocmodel-jar/site
Collecting metadata...
Metadata collection done.
Started calculate disk usage of build
Finished Calculation of disk usage of build in 0 seconds
Started calculate disk usage of workspace
Finished Calculation of disk usage of workspace in 0 seconds
[INFO] 
[INFO] ------------------------------------------------------------------------
[INFO] Building gocmodel-jar 1.1.1-SNAPSHOT
[INFO] ------------------------------------------------------------------------
[INFO] 
[INFO] --- sonar-maven-plugin:3.8.0.2131:sonar (default-cli) @ gocmodel-jar ---
[INFO] User cache: /home/jenkins/.sonar/cache
[ERROR] SonarQube server [https://gazelle.ihe.net/sonar] can not be reached
Collecting metadata...
[WARNING] The following metadata could not be added due to conflict with existing values:
	build

Metadata collection done.
Started calculate disk usage of build
Finished Calculation of disk usage of build in 0 seconds
Started calculate disk usage of workspace
Finished Calculation of disk usage of workspace in 0 seconds
[INFO] ------------------------------------------------------------------------
[INFO] BUILD FAILURE
[INFO] ------------------------------------------------------------------------
[INFO] Total time: 32.677 s
[INFO] Finished at: 2021-01-23T02:23:51+01:00
[INFO] Final Memory: 60M/1037M
[INFO] ------------------------------------------------------------------------
[ERROR] Failed to execute goal org.sonarsource.scanner.maven:sonar-maven-plugin:3.8.0.2131:sonar (default-cli) on project gocmodel-jar: Unable to execute SonarScanner analysis: Fail to get bootstrap index from server: sun.security.validator.ValidatorException: PKIX path building failed: sun.security.provider.certpath.SunCertPathBuilderException: unable to find valid certification path to requested target -> [Help 1]
[ERROR] 
[ERROR] To see the full stack trace of the errors, re-run Maven with the -e switch.
[ERROR] Re-run Maven using the -X switch to enable full debug logging.
[ERROR] 
[ERROR] For more information about the errors and possible solutions, please read the following articles:
[ERROR] [Help 1] http://cwiki.apache.org/confluence/display/MAVEN/MojoExecutionException
[JENKINS] Archiving /home/jenkins/.hudson/jobs/gocmodel-jar/workspace/gocmodel-jar/pom.xml to net.ihe.gazelle/gocmodel-jar/1.1.1-SNAPSHOT/gocmodel-jar-1.1.1-SNAPSHOT.pom
[JENKINS] Archiving /home/jenkins/.hudson/jobs/gocmodel-jar/workspace/gocmodel-jar/target/gocmodel-jar-1.1.1-SNAPSHOT.jar to net.ihe.gazelle/gocmodel-jar/1.1.1-SNAPSHOT/gocmodel-jar-1.1.1-SNAPSHOT.jar
channel stopped
WARN: Unable to locate 'report-task.txt' in the workspace. Did the SonarScanner succeed?
Collecting metadata...
Metadata collection done.
Started calculate disk usage of build
Finished Calculation of disk usage of build in 0 seconds
Started calculate disk usage of workspace
Finished Calculation of disk usage of workspace in 0 seconds
Sending e-mails to: anne-gaelle.berge@ihe-europe.net cel@kereval.com eric.poiseau@inria.fr guillaume.thomazon@ihe-europe.net mtc@kereval.com yct@kereval.com wbs@kereval.com
Finished: FAILURE