FailedConsole Output

Started by timer
Running as SYSTEM
[EnvInject] - Loading node environment variables.
Building on master in workspace /home/jenkins/.hudson/jobs/hl7templates-packager-jar/workspace
[WS-CLEANUP] Deleting project workspace...
[WS-CLEANUP] Deferred wipeout is used...
[WS-CLEANUP] Done
Cleaning local Directory .
Checking out svn+ssh://scm.gforge.inria.fr/svn/gazelle/validators/hl7templates/hl7templates-packager-jar/trunk at revision '2020-11-21T04:25:13.915 +0100'
Using sole credentials gazelle-jenkins in realm ‘svn+ssh://scm.gforge.inria.fr’
Using sole credentials gazelle-jenkins in realm ‘svn+ssh://scm.gforge.inria.fr’
A         src
A         src/test
A         src/test/java
A         src/test/java/net
A         src/test/java/net/ihe
A         src/test/java/net/ihe/gazelle
A         src/test/java/net/ihe/gazelle/pack
A         src/test/java/net/ihe/gazelle/pack/test
AU        src/test/java/net/ihe/gazelle/pack/test/UpdateModelsDefinitionTest.java
A         src/main
A         src/main/java
A         src/main/java/net
A         src/main/java/net/ihe
A         src/main/java/net/ihe/gazelle
A         src/main/java/net/ihe/gazelle/hl7templates
A         src/main/java/net/ihe/gazelle/hl7templates/packager
AU        src/main/java/net/ihe/gazelle/hl7templates/packager/UpdateModelsDefinition.java
AU        src/main/java/net/ihe/gazelle/hl7templates/packager/HL7Templates2GOC.java
AU        src/main/java/net/ihe/gazelle/hl7templates/packager/GOCPackager.java
A         src/main/resources
A         src/main/resources/sequoia-db-hack
A         src/main/resources/sequoia-db-hack/src
A         src/main/resources/sequoia-db-hack/src/test
A         src/main/resources/sequoia-db-hack/src/test/java
A         src/main/resources/sequoia-db-hack/src/test/java/net
A         src/main/resources/sequoia-db-hack/src/test/java/net/ihe
A         src/main/resources/sequoia-db-hack/src/test/java/net/ihe/gazelle
A         src/main/resources/sequoia-db-hack/src/test/java/net/ihe/gazelle/db
A         src/main/resources/sequoia-db-hack/src/test/java/net/ihe/gazelle/db/test
AU        src/main/resources/sequoia-db-hack/src/test/java/net/ihe/gazelle/db/test/ConnectionUtilTest.java
A         src/main/resources/sequoia-db-hack/src/main
A         src/main/resources/sequoia-db-hack/src/main/java
A         src/main/resources/sequoia-db-hack/src/main/java/net
A         src/main/resources/sequoia-db-hack/src/main/java/net/ihe
A         src/main/resources/sequoia-db-hack/src/main/java/net/ihe/gazelle
A         src/main/resources/sequoia-db-hack/src/main/java/net/ihe/gazelle/assembler
A         src/main/resources/sequoia-db-hack/src/main/java/net/ihe/gazelle/assembler/ccda21
AU        src/main/resources/sequoia-db-hack/src/main/java/net/ihe/gazelle/assembler/ccda21/GazelleValidatorCore.java
AU        src/main/resources/sequoia-db-hack/src/main/java/net/ihe/gazelle/assembler/ccda21/MicroDocumentValidation.java
A         src/main/resources/sequoia-db-hack/src/main/java/net/ihe/gazelle/utils
AU        src/main/resources/sequoia-db-hack/src/main/java/net/ihe/gazelle/utils/ConceptProviderSVSImpl.java
A         src/main/resources/sequoia-db-hack/src/main/java/net/ihe/gazelle/db
A         src/main/resources/sequoia-db-hack/src/main/java/net/ihe/gazelle/db/utils
AU        src/main/resources/sequoia-db-hack/src/main/java/net/ihe/gazelle/db/utils/ConnectionUtil.java
AU        src/main/resources/sequoia-db-hack/src/main/java/net/ihe/gazelle/db/utils/ConceptProviderDBImpl.java
AU        src/main/resources/sequoia-db-hack/pom.xml
A         src/main/resources/valresources
AU        src/main/resources/valresources/mbvalidatorDetailedResult.xsl
A         src/main/resources/valresources/samples
AU        src/main/resources/valresources/samples/res.html
AU        src/main/resources/valresources/samples/sample1.xml
AU        src/main/resources/valresources/samples/sample2.xml
A         src/main/resources/valresources/valueSets
A         src/main/resources/valresources/valueSets/1.3.6.1.4.1.12559.11.18.7.xml
A         src/main/resources/valresources/valueSets/1.3.6.1.4.1.12559.11.18.8.xml
A         src/main/resources/valresources/valueSets/1.3.6.1.4.1.12559.11.18.9.xml
A         src/main/resources/valresources/valueSets/1.3.6.1.4.1.12559.11.18.1.xml
A         src/main/resources/valresources/valueSets/1.3.6.1.4.1.12559.11.18.10.xml
A         src/main/resources/valresources/valueSets/1.3.6.1.4.1.12559.11.18.2.xml
A         src/main/resources/valresources/valueSets/1.3.6.1.4.1.12559.11.18.4.xml
A         src/main/resources/valresources/valueSets/1.3.6.1.4.1.12559.11.18.5.xml
A         src/main/resources/valresources/valueSets/1.3.6.1.4.1.12559.11.18.6.xml
A         src/main/resources/valresources/xsd
A         src/main/resources/valresources/xsd/coreschemas
AU        src/main/resources/valresources/xsd/coreschemas/datatypes.xsd
AU        src/main/resources/valresources/xsd/coreschemas/infrastructureRoot.xsd
AU        src/main/resources/valresources/xsd/coreschemas/NarrativeBlock.xsd
AU        src/main/resources/valresources/xsd/coreschemas/datatypes-base.xsd
AU        src/main/resources/valresources/xsd/coreschemas/voc.xsd
AU        src/main/resources/valresources/xsd/CDA.xsd
AU        src/main/resources/valresources/xsd/POCD_MT000040.xsd
AU        src/main/resources/conf.properties
A         src/main/resources/project-templates
A         src/main/resources/project-templates/project-validator-jar
A         src/main/resources/project-templates/project-validator-jar/src
A         src/main/resources/project-templates/project-validator-jar/src/main
A         src/main/resources/project-templates/project-validator-jar/src/main/test
A         src/main/resources/project-templates/project-validator-jar/src/main/test/net
A         src/main/resources/project-templates/project-validator-jar/src/main/test/net/ihe
A         src/main/resources/project-templates/project-validator-jar/src/main/test/net/ihe/gazelle
A         src/main/resources/project-templates/project-validator-jar/src/main/test/net/ihe/gazelle/assembler
A         src/main/resources/project-templates/project-validator-jar/src/main/test/net/ihe/gazelle/assembler/${project_name}
A         src/main/resources/project-templates/project-validator-jar/src/main/test/net/ihe/gazelle/assembler/${project_name}/NullFlavorCheckerTest.java
A         src/main/resources/project-templates/project-validator-jar/src/main/test/resource
A         src/main/resources/project-templates/project-validator-jar/src/main/test/resource/testNullFlavor.xml
A         src/main/resources/project-templates/project-validator-jar/src/main/test/resource/checkedNullFlavorResult.xml
A         src/main/resources/project-templates/project-validator-jar/src/main/test/resource/testParse.xml
A         src/main/resources/project-templates/project-validator-jar/src/main/java
A         src/main/resources/project-templates/project-validator-jar/src/main/java/net
A         src/main/resources/project-templates/project-validator-jar/src/main/java/net/ihe
A         src/main/resources/project-templates/project-validator-jar/src/main/java/net/ihe/gazelle
A         src/main/resources/project-templates/project-validator-jar/src/main/java/net/ihe/gazelle/assembler
A         src/main/resources/project-templates/project-validator-jar/src/main/java/net/ihe/gazelle/assembler/${project_name}
AU        src/main/resources/project-templates/project-validator-jar/src/main/java/net/ihe/gazelle/assembler/${project_name}/FileReadWrite.java
A         src/main/resources/project-templates/project-validator-jar/src/main/java/net/ihe/gazelle/assembler/${project_name}/NullFlavorChecker.java
AU        src/main/resources/project-templates/project-validator-jar/src/main/java/net/ihe/gazelle/assembler/${project_name}/DetailedResultTransformer.java
AU        src/main/resources/project-templates/project-validator-jar/src/main/java/net/ihe/gazelle/assembler/${project_name}/Gazelle${project_name_capitalysed}Validator.java
AU        src/main/resources/project-templates/project-validator-jar/src/main/java/net/ihe/gazelle/assembler/${project_name}/CDATemplateParser.java
AU        src/main/resources/project-templates/project-validator-jar/src/main/java/net/ihe/gazelle/assembler/${project_name}/GazelleValidatorCore.java
AU        src/main/resources/project-templates/project-validator-jar/src/main/java/net/ihe/gazelle/assembler/${project_name}/MicroDocumentValidation.java
AU        src/main/resources/project-templates/project-validator-jar/src/main/java/net/ihe/gazelle/assembler/${project_name}/ValidatorException.java
A         src/main/resources/project-templates/project-validator-jar/src/main/java/net/ihe/gazelle/utils
AU        src/main/resources/project-templates/project-validator-jar/src/main/java/net/ihe/gazelle/utils/ValueSetProviderClass.java
AU        src/main/resources/project-templates/project-validator-jar/src/main/java/net/ihe/gazelle/utils/XMLValidation.java
AU        src/main/resources/project-templates/project-validator-jar/src/main/java/net/ihe/gazelle/utils/ProjectDependencies.java
AU        src/main/resources/project-templates/project-validator-jar/src/main/java/net/ihe/gazelle/utils/FileReadWrite.java
A         src/main/resources/project-templates/project-validator-jar/src/main/resources
A         src/main/resources/project-templates/project-validator-jar/src/main/resources/valueSets
AU        src/main/resources/project-templates/project-validator-jar/log4j.properties
AU        src/main/resources/project-templates/project-validator-jar/pom.xml
A         src/main/resources/project-templates/project-model
AU        src/main/resources/project-templates/project-model/default.properties
A         src/main/resources/project-templates/project-model/model
AU        src/main/resources/project-templates/ocl2java-1.1.2.jar
AU        src/main/resources/project-templates/ocl2java-1.1.4.jar
A         src/main/resources/generateValidator.sh
AU        src/main/resources/log4j.properties
AU        pom.xml
AU        packgergen.sh
 U        .
At revision 68986

No changes for svn+ssh://scm.gforge.inria.fr/svn/gazelle/validators/hl7templates/hl7templates-packager-jar/trunk since the previous build
[Checks API] No suitable checks publisher found.
Injecting SonarQube environment variables using the configuration: Sonar
Parsing POMs
Established TCP socket on 37557
[workspace] $ /usr/lib/jvm/java-8-oracle//bin/java -Djava.net.preferIPv4Stack=true -Dfile.encoding=UTF8 -Xmx4096m -XX:MaxPermSize=1024m -cp /home/jenkins/.hudson/plugins/maven-plugin/WEB-INF/lib/maven35-agent-1.13.jar:/home/jenkins/.hudson/tools/hudson.tasks.Maven_MavenInstallation/Maven3/boot/plexus-classworlds-2.5.2.jar:/home/jenkins/.hudson/tools/hudson.tasks.Maven_MavenInstallation/Maven3/conf/logging jenkins.maven3.agent.Maven35Main /home/jenkins/.hudson/tools/hudson.tasks.Maven_MavenInstallation/Maven3 /home/jenkins/.hudson/war/WEB-INF/lib/remoting-4.5.jar /home/jenkins/.hudson/plugins/maven-plugin/WEB-INF/lib/maven35-interceptor-1.13.jar /home/jenkins/.hudson/plugins/maven-plugin/WEB-INF/lib/maven3-interceptor-commons-1.13.jar 37557
Java HotSpot(TM) 64-Bit Server VM warning: ignoring option MaxPermSize=1024m; support was removed in 8.0
<===[JENKINS REMOTING CAPACITY]===>channel started
Executing Maven:  -B -f /home/jenkins/.hudson/jobs/hl7templates-packager-jar/workspace/pom.xml clean install site org.sonarsource.scanner.maven:sonar-maven-plugin:sonar -DHL7TEMP_RESOURCES_PATH=/home/jenkins/.hudson/jobs/gocmodel-jar/workspace/hl7templates-resources/ -Djavax.net.ssl.trustStore=/opt/gazelle/cert/truststore.jks -Djavax.net.ssl.trustStorePassword=password -e
[INFO] Error stacktraces are turned on.
[INFO] Scanning for projects...
[INFO] 
[INFO] ------------------------------------------------------------------------
[INFO] Building hl7templates-packager-jar 1.1.1-SNAPSHOT
[INFO] ------------------------------------------------------------------------
[WARNING] The POM for net.ihe.gazelle:AssertionManagerGui-model:jar:4.1.0 is invalid, transitive dependencies (if any) will not be available, enable debug logging for more details
[INFO] 
[INFO] --- maven-clean-plugin:2.5:clean (default-clean) @ hl7templates-packager-jar ---
[INFO] 
[INFO] --- maven-resources-plugin:2.6:resources (default-resources) @ hl7templates-packager-jar ---
[INFO] Using 'UTF-8' encoding to copy filtered resources.
[INFO] Copying 51 resources
[INFO] 
[INFO] --- maven-compiler-plugin:3.1:compile (default-compile) @ hl7templates-packager-jar ---
[INFO] Changes detected - recompiling the module!
[INFO] Compiling 3 source files to /home/jenkins/.hudson/jobs/hl7templates-packager-jar/workspace/target/classes
[INFO] -------------------------------------------------------------
[ERROR] COMPILATION ERROR : 
[INFO] -------------------------------------------------------------
[ERROR] /home/jenkins/.hudson/jobs/hl7templates-packager-jar/workspace/src/main/java/net/ihe/gazelle/hl7templates/packager/GOCPackager.java:[17,34] error: package net.ihe.gazelle.common.util does not exist
[ERROR] /home/jenkins/.hudson/jobs/hl7templates-packager-jar/workspace/src/main/java/net/ihe/gazelle/hl7templates/packager/GOCPackager.java:[129,2] error: cannot find symbol
[INFO] 2 errors 
[INFO] -------------------------------------------------------------
Collecting metadata...
Metadata collection done.
Started calculate disk usage of build
Finished Calculation of disk usage of build in 0 seconds
Started calculate disk usage of workspace
Finished Calculation of disk usage of workspace in 0 seconds
[Checks API] No suitable checks publisher found.
[INFO] 
[INFO] ------------------------------------------------------------------------
[INFO] Skipping hl7templates-packager-jar
[INFO] This project has been banned from the build due to previous failures.
[INFO] ------------------------------------------------------------------------
[INFO] ------------------------------------------------------------------------
[INFO] BUILD FAILURE
[INFO] ------------------------------------------------------------------------
[INFO] Total time: 3.553 s
[INFO] Finished at: 2020-11-21T04:25:24+01:00
[INFO] Final Memory: 16M/400M
[INFO] ------------------------------------------------------------------------
Waiting for Jenkins to finish collecting data
[ERROR] Failed to execute goal org.apache.maven.plugins:maven-compiler-plugin:3.1:compile (default-compile) on project hl7templates-packager-jar: Compilation failure: Compilation failure:
[ERROR] /home/jenkins/.hudson/jobs/hl7templates-packager-jar/workspace/src/main/java/net/ihe/gazelle/hl7templates/packager/GOCPackager.java:[17,34] error: package net.ihe.gazelle.common.util does not exist
[ERROR] /home/jenkins/.hudson/jobs/hl7templates-packager-jar/workspace/src/main/java/net/ihe/gazelle/hl7templates/packager/GOCPackager.java:[129,2] error: cannot find symbol
[ERROR] -> [Help 1]
org.apache.maven.lifecycle.LifecycleExecutionException: Failed to execute goal org.apache.maven.plugins:maven-compiler-plugin:3.1:compile (default-compile) on project hl7templates-packager-jar: Compilation failure
    at org.apache.maven.lifecycle.internal.MojoExecutor.execute (MojoExecutor.java:213)
    at org.apache.maven.lifecycle.internal.MojoExecutor.execute (MojoExecutor.java:154)
    at org.apache.maven.lifecycle.internal.MojoExecutor.execute (MojoExecutor.java:146)
    at org.apache.maven.lifecycle.internal.LifecycleModuleBuilder.buildProject (LifecycleModuleBuilder.java:117)
    at org.apache.maven.lifecycle.internal.LifecycleModuleBuilder.buildProject (LifecycleModuleBuilder.java:81)
    at org.apache.maven.lifecycle.internal.builder.singlethreaded.SingleThreadedBuilder.build (SingleThreadedBuilder.java:51)
    at org.apache.maven.lifecycle.internal.LifecycleStarter.execute (LifecycleStarter.java:128)
    at org.apache.maven.DefaultMaven.doExecute (DefaultMaven.java:309)
    at org.apache.maven.DefaultMaven.doExecute (DefaultMaven.java:194)
    at org.apache.maven.DefaultMaven.execute (DefaultMaven.java:107)
    at org.jvnet.hudson.maven3.launcher.Maven35Launcher.main (Maven35Launcher.java:130)
    at sun.reflect.NativeMethodAccessorImpl.invoke0 (Native Method)
    at sun.reflect.NativeMethodAccessorImpl.invoke (NativeMethodAccessorImpl.java:62)
    at sun.reflect.DelegatingMethodAccessorImpl.invoke (DelegatingMethodAccessorImpl.java:43)
    at java.lang.reflect.Method.invoke (Method.java:498)
    at org.codehaus.plexus.classworlds.launcher.Launcher.launchEnhanced (Launcher.java:289)
    at org.codehaus.plexus.classworlds.launcher.Launcher.launch (Launcher.java:229)
    at jenkins.maven3.agent.Maven35Main.launch (Maven35Main.java:178)
    at sun.reflect.NativeMethodAccessorImpl.invoke0 (Native Method)
    at sun.reflect.NativeMethodAccessorImpl.invoke (NativeMethodAccessorImpl.java:62)
    at sun.reflect.DelegatingMethodAccessorImpl.invoke (DelegatingMethodAccessorImpl.java:43)
    at java.lang.reflect.Method.invoke (Method.java:498)
    at hudson.maven.Maven3Builder.call (Maven3Builder.java:139)
    at hudson.maven.Maven3Builder.call (Maven3Builder.java:70)
    at hudson.remoting.UserRequest.perform (UserRequest.java:211)
    at hudson.remoting.UserRequest.perform (UserRequest.java:54)
    at hudson.remoting.Request$2.run (Request.java:375)
    at hudson.remoting.InterceptingExecutorService$1.call (InterceptingExecutorService.java:73)
    at java.util.concurrent.FutureTask.run (FutureTask.java:266)
    at java.util.concurrent.ThreadPoolExecutor.runWorker (ThreadPoolExecutor.java:1149)
    at java.util.concurrent.ThreadPoolExecutor$Worker.run (ThreadPoolExecutor.java:624)
    at java.lang.Thread.run (Thread.java:748)
Caused by: org.apache.maven.plugin.compiler.CompilationFailureException: Compilation failure
    at org.apache.maven.plugin.compiler.AbstractCompilerMojo.execute (AbstractCompilerMojo.java:858)
    at org.apache.maven.plugin.compiler.CompilerMojo.execute (CompilerMojo.java:129)
    at org.apache.maven.plugin.DefaultBuildPluginManager.executeMojo (DefaultBuildPluginManager.java:134)
    at org.apache.maven.lifecycle.internal.MojoExecutor.execute (MojoExecutor.java:208)
    at org.apache.maven.lifecycle.internal.MojoExecutor.execute (MojoExecutor.java:154)
    at org.apache.maven.lifecycle.internal.MojoExecutor.execute (MojoExecutor.java:146)
    at org.apache.maven.lifecycle.internal.LifecycleModuleBuilder.buildProject (LifecycleModuleBuilder.java:117)
    at org.apache.maven.lifecycle.internal.LifecycleModuleBuilder.buildProject (LifecycleModuleBuilder.java:81)
    at org.apache.maven.lifecycle.internal.builder.singlethreaded.SingleThreadedBuilder.build (SingleThreadedBuilder.java:51)
    at org.apache.maven.lifecycle.internal.LifecycleStarter.execute (LifecycleStarter.java:128)
    at org.apache.maven.DefaultMaven.doExecute (DefaultMaven.java:309)
    at org.apache.maven.DefaultMaven.doExecute (DefaultMaven.java:194)
    at org.apache.maven.DefaultMaven.execute (DefaultMaven.java:107)
    at org.jvnet.hudson.maven3.launcher.Maven35Launcher.main (Maven35Launcher.java:130)
    at sun.reflect.NativeMethodAccessorImpl.invoke0 (Native Method)
    at sun.reflect.NativeMethodAccessorImpl.invoke (NativeMethodAccessorImpl.java:62)
    at sun.reflect.DelegatingMethodAccessorImpl.invoke (DelegatingMethodAccessorImpl.java:43)
    at java.lang.reflect.Method.invoke (Method.java:498)
    at org.codehaus.plexus.classworlds.launcher.Launcher.launchEnhanced (Launcher.java:289)
    at org.codehaus.plexus.classworlds.launcher.Launcher.launch (Launcher.java:229)
    at jenkins.maven3.agent.Maven35Main.launch (Maven35Main.java:178)
    at sun.reflect.NativeMethodAccessorImpl.invoke0 (Native Method)
    at sun.reflect.NativeMethodAccessorImpl.invoke (NativeMethodAccessorImpl.java:62)
    at sun.reflect.DelegatingMethodAccessorImpl.invoke (DelegatingMethodAccessorImpl.java:43)
    at java.lang.reflect.Method.invoke (Method.java:498)
    at hudson.maven.Maven3Builder.call (Maven3Builder.java:139)
    at hudson.maven.Maven3Builder.call (Maven3Builder.java:70)
    at hudson.remoting.UserRequest.perform (UserRequest.java:211)
    at hudson.remoting.UserRequest.perform (UserRequest.java:54)
    at hudson.remoting.Request$2.run (Request.java:375)
    at hudson.remoting.InterceptingExecutorService$1.call (InterceptingExecutorService.java:73)
    at java.util.concurrent.FutureTask.run (FutureTask.java:266)
    at java.util.concurrent.ThreadPoolExecutor.runWorker (ThreadPoolExecutor.java:1149)
    at java.util.concurrent.ThreadPoolExecutor$Worker.run (ThreadPoolExecutor.java:624)
    at java.lang.Thread.run (Thread.java:748)
[ERROR] 
[ERROR] Re-run Maven using the -X switch to enable full debug logging.
[ERROR] 
[ERROR] For more information about the errors and possible solutions, please read the following articles:
[ERROR] [Help 1] http://cwiki.apache.org/confluence/display/MAVEN/MojoFailureException
[JENKINS] Archiving /home/jenkins/.hudson/jobs/hl7templates-packager-jar/workspace/pom.xml to net.ihe.gazelle/hl7templates-packager-jar/1.1.1-SNAPSHOT/hl7templates-packager-jar-1.1.1-SNAPSHOT.pom
channel stopped
WARN: Unable to locate 'report-task.txt' in the workspace. Did the SonarScanner succeed?
Collecting metadata...
Metadata collection done.
Started calculate disk usage of build
Finished Calculation of disk usage of build in 0 seconds
Started calculate disk usage of workspace
Finished Calculation of disk usage of workspace in 0 seconds
[Checks API] No suitable checks publisher found.
Sending e-mails to: anne-gaelle.berge@ihe-europe.net cel@kereval.com eric.poiseau@inria.fr guillaume.thomazon@ihe-europe.net hra@kereval.com mtc@kereval.com yct@kereval.com
Finished: FAILURE