SuccessConsole Output

Skipping installation of https://repo.maven.apache.org/maven2/org/apache/maven/apache-maven/3.0.4/apache-maven-3.0.4-bin.zip to /home/jenkins/.hudson/tools/hudson.tasks.Maven_MavenInstallation/Maven3: javax.net.ssl.SSLHandshakeException: sun.security.validator.ValidatorException: PKIX path building failed: sun.security.provider.certpath.SunCertPathBuilderException: unable to find valid certification path to requested target
Established TCP socket on 60345
Skipping installation of https://repo.maven.apache.org/maven2/org/apache/maven/apache-maven/3.0.4/apache-maven-3.0.4-bin.zip to /home/jenkins/.hudson/tools/hudson.tasks.Maven_MavenInstallation/Maven3: javax.net.ssl.SSLHandshakeException: sun.security.validator.ValidatorException: PKIX path building failed: sun.security.provider.certpath.SunCertPathBuilderException: unable to find valid certification path to requested target
<===[JENKINS REMOTING CAPACITY]===>channel started
Executing Maven:  -B -f /home/jenkins/.hudson/jobs/ihej-dicom/workspace/trunk/pom.xml clean install
[INFO] Scanning for projects...
[INFO]                                                                         
[INFO] ------------------------------------------------------------------------
[INFO] Building DICOM-Message-Parser 2.0.2-SNAPSHOT
[INFO] ------------------------------------------------------------------------
[INFO] 
[INFO] --- maven-clean-plugin:2.4.1:clean (default-clean) @ ihej-dicom ---
[INFO] 
[INFO] --- maven-resources-plugin:2.5:resources (default-resources) @ ihej-dicom ---
[debug] execute contextualize
[INFO] Using 'UTF-8' encoding to copy filtered resources.
[INFO] skip non existing resourceDirectory /home/jenkins/.hudson/jobs/ihej-dicom/workspace/trunk/src/main/resources
[INFO] 
[INFO] --- maven-compiler-plugin:2.3.2:compile (default-compile) @ ihej-dicom ---
[INFO] Compiling 41 source files to /home/jenkins/.hudson/jobs/ihej-dicom/workspace/trunk/target/classes
[INFO] 
[INFO] --- maven-resources-plugin:2.5:testResources (default-testResources) @ ihej-dicom ---
[debug] execute contextualize
[INFO] Using 'UTF-8' encoding to copy filtered resources.
[INFO] skip non existing resourceDirectory /home/jenkins/.hudson/jobs/ihej-dicom/workspace/trunk/src/test/resources
[INFO] 
[INFO] --- maven-compiler-plugin:2.3.2:testCompile (default-testCompile) @ ihej-dicom ---
[INFO] No sources to compile
[INFO] 
[INFO] --- maven-surefire-plugin:2.10:test (default-test) @ ihej-dicom ---
[INFO] No tests to run.
[INFO] Surefire report directory: /home/jenkins/.hudson/jobs/ihej-dicom/workspace/trunk/target/surefire-reports

-------------------------------------------------------
 T E S T S
-------------------------------------------------------

Results :

Tests run: 0, Failures: 0, Errors: 0, Skipped: 0

[JENKINS] Recording test results
[INFO] 
[INFO] --- maven-jar-plugin:2.3.2:jar (default-jar) @ ihej-dicom ---
[INFO] Building jar: /home/jenkins/.hudson/jobs/ihej-dicom/workspace/trunk/target/ihej-dicom-2.0.2-SNAPSHOT.jar
[INFO] 
[INFO] --- maven-install-plugin:2.3.1:install (default-install) @ ihej-dicom ---
[INFO] Installing /home/jenkins/.hudson/jobs/ihej-dicom/workspace/trunk/target/ihej-dicom-2.0.2-SNAPSHOT.jar to /home/jenkins/.m2/repository/jp/digitalsensation/ihej/transactionmonitor/ihej-dicom/2.0.2-SNAPSHOT/ihej-dicom-2.0.2-SNAPSHOT.jar
[INFO] Installing /home/jenkins/.hudson/jobs/ihej-dicom/workspace/trunk/pom.xml to /home/jenkins/.m2/repository/jp/digitalsensation/ihej/transactionmonitor/ihej-dicom/2.0.2-SNAPSHOT/ihej-dicom-2.0.2-SNAPSHOT.pom
Started calculate disk usage of build
Finished Calculation of disk usage of build in 0 seconds
Started calculate disk usage of workspace
Finished Calculation of disk usage of workspace in 0 seconds
[INFO] ------------------------------------------------------------------------
[INFO] BUILD SUCCESS
[INFO] ------------------------------------------------------------------------
[INFO] Total time: 2.774s
[INFO] Finished at: Mon May 02 11:25:29 CEST 2016
[INFO] Final Memory: 16M/481M
[INFO] ------------------------------------------------------------------------
Waiting for Jenkins to finish collecting data
Sending e-mails to: abderrazek.boufahja@ihe-europe.net anne-gaelle.berge@ihe-europe.net eric.poiseau@inria.fr guillaume.thomazon@ihe-europe.net jean-francois.labbe@ihe-europe.net