FailedConsole Output

Started by user Guillaume T
[EnvInject] - Loading node environment variables.
Building in workspace /home/jenkins/.hudson/jobs/ihej-dicom/workspace
Skipping installation of https://repo.maven.apache.org/maven2/org/apache/maven/apache-maven/3.0.4/apache-maven-3.0.4-bin.zip to /home/jenkins/.hudson/tools/hudson.tasks.Maven_MavenInstallation/Maven3: javax.net.ssl.SSLHandshakeException: sun.security.validator.ValidatorException: PKIX path building failed: sun.security.provider.certpath.SunCertPathBuilderException: unable to find valid certification path to requested target
Cleaning local Directory trunk
Checking out svn+ssh://scm.gforge.inria.fr/svn/gazelle/Maven/libs/ihej-dicom/DICOM-Message-Parser/trunk at revision '2016-05-02T10:36:36.379 +0200'
AU        .classpath
AU        .project
A         dictionary
AU        dictionary/CommandDictionary.csv
AU        dictionary/CreateCommandDictionarySource.BOO
A         src
A         src/jp
A         src/jp/digitalsensation
A         src/jp/digitalsensation/ihej
A         src/jp/digitalsensation/ihej/transactionmonitor
A         src/jp/digitalsensation/ihej/transactionmonitor/dicom
A         src/jp/digitalsensation/ihej/transactionmonitor/dicom/datastructure
AU        src/jp/digitalsensation/ihej/transactionmonitor/dicom/datastructure/Tag.java
AU        src/jp/digitalsensation/ihej/transactionmonitor/dicom/datastructure/ValueRepresentation.java
A         src/jp/digitalsensation/ihej/transactionmonitor/dicom/upperlayerprotocol
AU        src/jp/digitalsensation/ihej/transactionmonitor/dicom/upperlayerprotocol/DicomULParser.java
AU        src/jp/digitalsensation/ihej/transactionmonitor/dicom/upperlayerprotocol/TransferSyntaxItem.java
AU        src/jp/digitalsensation/ihej/transactionmonitor/dicom/upperlayerprotocol/ImplementationVersionNameItem.java
AU        src/jp/digitalsensation/ihej/transactionmonitor/dicom/upperlayerprotocol/A_ASSOCIATE_RJ_PDU.java
AU        src/jp/digitalsensation/ihej/transactionmonitor/dicom/upperlayerprotocol/A_ABORT_PDU.java
AU        src/jp/digitalsensation/ihej/transactionmonitor/dicom/upperlayerprotocol/ProtocolDataUnitTypes.java
AU        src/jp/digitalsensation/ihej/transactionmonitor/dicom/upperlayerprotocol/PresentationDataValueItem.java
AU        src/jp/digitalsensation/ihej/transactionmonitor/dicom/upperlayerprotocol/ItemTypes.java
AU        src/jp/digitalsensation/ihej/transactionmonitor/dicom/upperlayerprotocol/A_ASSOCIATE_RQ_PDU.java
AU        src/jp/digitalsensation/ihej/transactionmonitor/dicom/upperlayerprotocol/A_ASSOCIATE_AC_PDU.java
AU        src/jp/digitalsensation/ihej/transactionmonitor/dicom/upperlayerprotocol/ApplicationContextItem.java
AU        src/jp/digitalsensation/ihej/transactionmonitor/dicom/upperlayerprotocol/SOPClassExtendedNegotiationItem.java
AU        src/jp/digitalsensation/ihej/transactionmonitor/dicom/upperlayerprotocol/DicomULParserException.java
AU        src/jp/digitalsensation/ihej/transactionmonitor/dicom/upperlayerprotocol/AbstractSyntaxItem.java
AU        src/jp/digitalsensation/ihej/transactionmonitor/dicom/upperlayerprotocol/A_RELEASE_RP_PDU.java
AU        src/jp/digitalsensation/ihej/transactionmonitor/dicom/upperlayerprotocol/P_DATA_TF_PDU.java
AU        src/jp/digitalsensation/ihej/transactionmonitor/dicom/upperlayerprotocol/A_RELEASE_RQ_PDU.java
AU        src/jp/digitalsensation/ihej/transactionmonitor/dicom/upperlayerprotocol/ProtocolDataUnit.java
AU        src/jp/digitalsensation/ihej/transactionmonitor/dicom/upperlayerprotocol/ImplementationClassUIDItem.java
AU        src/jp/digitalsensation/ihej/transactionmonitor/dicom/upperlayerprotocol/Item.java
AU        src/jp/digitalsensation/ihej/transactionmonitor/dicom/upperlayerprotocol/MaximumLengthItem.java
AU        src/jp/digitalsensation/ihej/transactionmonitor/dicom/upperlayerprotocol/PresentationContextResultItem.java
AU        src/jp/digitalsensation/ihej/transactionmonitor/dicom/upperlayerprotocol/PresentationContextItem.java
AU        src/jp/digitalsensation/ihej/transactionmonitor/dicom/upperlayerprotocol/GenericUserInformationItem.java
AU        src/jp/digitalsensation/ihej/transactionmonitor/dicom/upperlayerprotocol/PresentationDataValue.java
AU        src/jp/digitalsensation/ihej/transactionmonitor/dicom/upperlayerprotocol/UserInformationItem.java
AU        src/jp/digitalsensation/ihej/transactionmonitor/dicom/upperlayerprotocol/AsynchronousOperationsWindowItem.java
AU        src/jp/digitalsensation/ihej/transactionmonitor/dicom/upperlayerprotocol/SCUOrSCPRoleSelectionItem.java
AU        src/jp/digitalsensation/ihej/transactionmonitor/dicom/DicomParserException.java
A         src/jp/digitalsensation/ihej/transactionmonitor/dicom/messageexchange
AU        src/jp/digitalsensation/ihej/transactionmonitor/dicom/messageexchange/CommandDictionaryEntry.java
AU        src/jp/digitalsensation/ihej/transactionmonitor/dicom/messageexchange/DimseMessage.java
AU        src/jp/digitalsensation/ihej/transactionmonitor/dicom/messageexchange/Association.java
AU        src/jp/digitalsensation/ihej/transactionmonitor/dicom/messageexchange/CommandSetReader.java
AU        src/jp/digitalsensation/ihej/transactionmonitor/dicom/messageexchange/PresentationContext.java
AU        src/jp/digitalsensation/ihej/transactionmonitor/dicom/messageexchange/DimseMessageParser.java
AU        src/jp/digitalsensation/ihej/transactionmonitor/dicom/messageexchange/CommandDictionary.java
A         src/jp/digitalsensation/ihej/transactionmonitor/utils
AU        src/jp/digitalsensation/ihej/transactionmonitor/utils/ObjectDump.java
AU        src/jp/digitalsensation/ihej/transactionmonitor/utils/ByteBuffer.java
AU        src/jp/digitalsensation/ihej/transactionmonitor/utils/ByteArrayUtility.java
AU        pom.xml
A         .settings
AU        .settings/org.eclipse.jdt.core.prefs
AU        .settings/org.eclipse.m2e.core.prefs
AU        .settings/org.eclipse.core.resources.prefs
 U        .
At revision 51842

No changes for svn+ssh://scm.gforge.inria.fr/svn/gazelle/Maven/libs/ihej-dicom/DICOM-Message-Parser/trunk since the previous build
Skipping installation of https://repo.maven.apache.org/maven2/org/apache/maven/apache-maven/3.0.4/apache-maven-3.0.4-bin.zip to /home/jenkins/.hudson/tools/hudson.tasks.Maven_MavenInstallation/Maven3: javax.net.ssl.SSLHandshakeException: sun.security.validator.ValidatorException: PKIX path building failed: sun.security.provider.certpath.SunCertPathBuilderException: unable to find valid certification path to requested target
Skipping installation of https://repo.maven.apache.org/maven2/org/apache/maven/apache-maven/3.0.4/apache-maven-3.0.4-bin.zip to /home/jenkins/.hudson/tools/hudson.tasks.Maven_MavenInstallation/Maven3: javax.net.ssl.SSLHandshakeException: sun.security.validator.ValidatorException: PKIX path building failed: sun.security.provider.certpath.SunCertPathBuilderException: unable to find valid certification path to requested target
Skipping installation of https://repo.maven.apache.org/maven2/org/apache/maven/apache-maven/3.0.4/apache-maven-3.0.4-bin.zip to /home/jenkins/.hudson/tools/hudson.tasks.Maven_MavenInstallation/Maven3: javax.net.ssl.SSLHandshakeException: sun.security.validator.ValidatorException: PKIX path building failed: sun.security.provider.certpath.SunCertPathBuilderException: unable to find valid certification path to requested target
Parsing POMs
Skipping installation of https://repo.maven.apache.org/maven2/org/apache/maven/apache-maven/3.0.4/apache-maven-3.0.4-bin.zip to /home/jenkins/.hudson/tools/hudson.tasks.Maven_MavenInstallation/Maven3: javax.net.ssl.SSLHandshakeException: sun.security.validator.ValidatorException: PKIX path building failed: sun.security.provider.certpath.SunCertPathBuilderException: unable to find valid certification path to requested target
Established TCP socket on 37094
Skipping installation of https://repo.maven.apache.org/maven2/org/apache/maven/apache-maven/3.0.4/apache-maven-3.0.4-bin.zip to /home/jenkins/.hudson/tools/hudson.tasks.Maven_MavenInstallation/Maven3: javax.net.ssl.SSLHandshakeException: sun.security.validator.ValidatorException: PKIX path building failed: sun.security.provider.certpath.SunCertPathBuilderException: unable to find valid certification path to requested target
[trunk] $ /usr/lib/jvm/java-7-oracle//bin/java -Djava.net.preferIPv4Stack=true -Dfile.encoding=UTF8 -cp /home/jenkins/.hudson/plugins/maven-plugin/WEB-INF/lib/maven3-agent-1.7.jar:/home/jenkins/.hudson/tools/hudson.tasks.Maven_MavenInstallation/Maven3/boot/plexus-classworlds-2.4.jar org.jvnet.hudson.maven3.agent.Maven3Main /home/jenkins/.hudson/tools/hudson.tasks.Maven_MavenInstallation/Maven3 /home/jenkins/.hudson/war/WEB-INF/lib/remoting-2.53.3.jar /home/jenkins/.hudson/plugins/maven-plugin/WEB-INF/lib/maven3-interceptor-1.7.jar /home/jenkins/.hudson/plugins/maven-plugin/WEB-INF/lib/maven3-interceptor-commons-1.7.jar 37094
<===[JENKINS REMOTING CAPACITY]===>channel started
Executing Maven:  -B -f /home/jenkins/.hudson/jobs/ihej-dicom/workspace/trunk/pom.xml -DdevelopmentVersion=2.0.2-SNAPSHOT -DreleaseVersion=2.0.1 -Dresume=false release:prepare release:perform
[INFO] Scanning for projects...
[INFO]                                                                         
[INFO] ------------------------------------------------------------------------
[INFO] Building DICOM-Message-Parser 2.0.1-SNAPSHOT
[INFO] ------------------------------------------------------------------------
[INFO] 
[INFO] --- maven-release-plugin:2.0:prepare (default-cli) @ ihej-dicom ---
[INFO] Verifying that there are no local modifications...
[INFO] Executing: /bin/sh -c cd /home/jenkins/.hudson/jobs/ihej-dicom/workspace/trunk && svn --non-interactive status
[INFO] Working directory: /home/jenkins/.hudson/jobs/ihej-dicom/workspace/trunk
[INFO] Checking dependencies and plugins for snapshots ...
[INFO] Transforming 'DICOM-Message-Parser'...
[INFO] Not generating release POMs
[INFO] Executing goals 'clean verify'...
[INFO] [INFO] Scanning for projects...
[INFO] [INFO]                                                                         
[INFO] [INFO] ------------------------------------------------------------------------
[INFO] [INFO] Building DICOM-Message-Parser 2.0.1
[INFO] [INFO] ------------------------------------------------------------------------
[INFO] [INFO] 
[INFO] [INFO] --- maven-clean-plugin:2.4.1:clean (default-clean) @ ihej-dicom ---
[INFO] [INFO] 
[INFO] [INFO] --- maven-resources-plugin:2.5:resources (default-resources) @ ihej-dicom ---
[INFO] [debug] execute contextualize
[INFO] [INFO] Using 'UTF-8' encoding to copy filtered resources.
[INFO] [INFO] skip non existing resourceDirectory /home/jenkins/.hudson/jobs/ihej-dicom/workspace/trunk/src/main/resources
[INFO] [INFO] 
[INFO] [INFO] --- maven-compiler-plugin:2.3.2:compile (default-compile) @ ihej-dicom ---
[INFO] [INFO] Compiling 41 source files to /home/jenkins/.hudson/jobs/ihej-dicom/workspace/trunk/target/classes
[INFO] [INFO] 
[INFO] [INFO] --- maven-resources-plugin:2.5:testResources (default-testResources) @ ihej-dicom ---
[INFO] [debug] execute contextualize
[INFO] [INFO] Using 'UTF-8' encoding to copy filtered resources.
[INFO] [INFO] skip non existing resourceDirectory /home/jenkins/.hudson/jobs/ihej-dicom/workspace/trunk/src/test/resources
[INFO] [INFO] 
[INFO] [INFO] --- maven-compiler-plugin:2.3.2:testCompile (default-testCompile) @ ihej-dicom ---
[INFO] [INFO] No sources to compile
[INFO] [INFO] 
[INFO] [INFO] --- maven-surefire-plugin:2.10:test (default-test) @ ihej-dicom ---
[INFO] [INFO] No tests to run.
[INFO] [INFO] Surefire report directory: /home/jenkins/.hudson/jobs/ihej-dicom/workspace/trunk/target/surefire-reports
[INFO] 
[INFO] -------------------------------------------------------
[INFO]  T E S T S
[INFO] -------------------------------------------------------
[INFO] 
[INFO] Results :
[INFO] 
[INFO] Tests run: 0, Failures: 0, Errors: 0, Skipped: 0
[INFO] 
[INFO] [INFO] 
[INFO] [INFO] --- maven-jar-plugin:2.3.2:jar (default-jar) @ ihej-dicom ---
[INFO] [INFO] Building jar: /home/jenkins/.hudson/jobs/ihej-dicom/workspace/trunk/target/ihej-dicom-2.0.1.jar
[INFO] [INFO] ------------------------------------------------------------------------
[INFO] [INFO] BUILD SUCCESS
[INFO] [INFO] ------------------------------------------------------------------------
[INFO] [INFO] Total time: 1.851s
[INFO] [INFO] Finished at: Mon May 02 10:36:43 CEST 2016
[INFO] [INFO] Final Memory: 12M/481M
[INFO] [INFO] ------------------------------------------------------------------------
[INFO] Checking in modified POMs...
[INFO] Executing: /bin/sh -c cd /home/jenkins/.hudson/jobs/ihej-dicom/workspace/trunk && svn --non-interactive commit --file /tmp/maven-scm-139301325.commit --targets /tmp/maven-scm-1420291629175256819-targets
[INFO] Working directory: /home/jenkins/.hudson/jobs/ihej-dicom/workspace/trunk
[INFO] Tagging release with the label ihej-dicom-2.0.1...
[INFO] Executing: /bin/sh -c cd /home/jenkins/.hudson/jobs/ihej-dicom/workspace/trunk && svn --non-interactive copy --file /tmp/maven-scm-3151644.commit --revision 51843 https://scm.gforge.inria.fr/svn/gazelle/Maven/libs/ihej-dicom/DICOM-Message-Parser/trunk https://scm.gforge.inria.fr/svn/gazelle/Maven/libs/ihej-dicom/DICOM-Message-Parser/tags/ihej-dicom-2.0.1
[INFO] Working directory: /home/jenkins/.hudson/jobs/ihej-dicom/workspace/trunk
Started calculate disk usage of build
Finished Calculation of disk usage of build in 0 seconds
Started calculate disk usage of workspace
Finished Calculation of disk usage of workspace in 0 seconds
[INFO] ------------------------------------------------------------------------
[INFO] BUILD FAILURE
[INFO] ------------------------------------------------------------------------
[INFO] Total time: 5.335s
[INFO] Finished at: Mon May 02 10:36:44 CEST 2016
[INFO] Final Memory: 15M/481M
[INFO] ------------------------------------------------------------------------
Waiting for Jenkins to finish collecting data
[ERROR] Failed to execute goal org.apache.maven.plugins:maven-release-plugin:2.0:prepare (default-cli) on project ihej-dicom: Unable to tag SCM
[ERROR] Provider message:
[ERROR] The svn tag command failed.
[ERROR] Command output:
[ERROR] svn: Repository moved permanently to 'https://scm.gforge.inria.fr/authscm/gazelle-jenkins/svn/gazelle/Maven/libs/ihej-dicom/DICOM-Message-Parser'; please relocate
[ERROR] -> [Help 1]
[ERROR] 
[ERROR] To see the full stack trace of the errors, re-run Maven with the -e switch.
[ERROR] Re-run Maven using the -X switch to enable full debug logging.
[ERROR] 
[ERROR] For more information about the errors and possible solutions, please read the following articles:
[ERROR] [Help 1] http://cwiki.apache.org/confluence/display/MAVEN/MojoFailureException
[JENKINS] Archiving /home/jenkins/.hudson/jobs/ihej-dicom/workspace/trunk/pom.xml to jp.digitalsensation.ihej.transactionmonitor/ihej-dicom/2.0.1-SNAPSHOT/ihej-dicom-2.0.1-SNAPSHOT.pom
Sending e-mails to: abderrazek.boufahja@ihe-europe.net anne-gaelle.berge@ihe-europe.net eric.poiseau@inria.fr guillaume.thomazon@ihe-europe.net jean-francois.labbe@ihe-europe.net
Skipping sonar analysis due to bad build status FAILURE
Skipping installation of https://repo.maven.apache.org/maven2/org/apache/maven/apache-maven/3.0.4/apache-maven-3.0.4-bin.zip to /home/jenkins/.hudson/tools/hudson.tasks.Maven_MavenInstallation/Maven3: javax.net.ssl.SSLHandshakeException: sun.security.validator.ValidatorException: PKIX path building failed: sun.security.provider.certpath.SunCertPathBuilderException: unable to find valid certification path to requested target
Sending e-mails to: abderrazek.boufahja@ihe-europe.net anne-gaelle.berge@ihe-europe.net eric.poiseau@inria.fr guillaume.thomazon@ihe-europe.net jean-francois.labbe@ihe-europe.net
Started calculate disk usage of build
Finished Calculation of disk usage of build in 0 seconds
Started calculate disk usage of workspace
Finished Calculation of disk usage of workspace in 0 seconds
Sending e-mails to: abderrazek.boufahja@ihe-europe.net anne-gaelle.berge@ihe-europe.net eric.poiseau@inria.fr guillaume.thomazon@ihe-europe.net jean-francois.labbe@ihe-europe.net
Warning: you have no plugins providing access control for builds, so falling back to legacy behavior of permitting any downstream builds to be triggered
Finished: FAILURE