FailedConsole Output

Skipping installation of https://repo.maven.apache.org/maven2/org/apache/maven/apache-maven/3.0.4/apache-maven-3.0.4-bin.zip to /home/jenkins/.hudson/tools/hudson.tasks.Maven_MavenInstallation/Maven3: javax.net.ssl.SSLHandshakeException: sun.security.validator.ValidatorException: PKIX path building failed: sun.security.provider.certpath.SunCertPathBuilderException: unable to find valid certification path to requested target
Established TCP socket on 37094
Skipping installation of https://repo.maven.apache.org/maven2/org/apache/maven/apache-maven/3.0.4/apache-maven-3.0.4-bin.zip to /home/jenkins/.hudson/tools/hudson.tasks.Maven_MavenInstallation/Maven3: javax.net.ssl.SSLHandshakeException: sun.security.validator.ValidatorException: PKIX path building failed: sun.security.provider.certpath.SunCertPathBuilderException: unable to find valid certification path to requested target
<===[JENKINS REMOTING CAPACITY]===>channel started
Executing Maven:  -B -f /home/jenkins/.hudson/jobs/ihej-dicom/workspace/trunk/pom.xml -DdevelopmentVersion=2.0.2-SNAPSHOT -DreleaseVersion=2.0.1 -Dresume=false release:prepare release:perform
[INFO] Scanning for projects...
[INFO]                                                                         
[INFO] ------------------------------------------------------------------------
[INFO] Building DICOM-Message-Parser 2.0.1-SNAPSHOT
[INFO] ------------------------------------------------------------------------
[INFO] 
[INFO] --- maven-release-plugin:2.0:prepare (default-cli) @ ihej-dicom ---
[INFO] Verifying that there are no local modifications...
[INFO] Executing: /bin/sh -c cd /home/jenkins/.hudson/jobs/ihej-dicom/workspace/trunk && svn --non-interactive status
[INFO] Working directory: /home/jenkins/.hudson/jobs/ihej-dicom/workspace/trunk
[INFO] Checking dependencies and plugins for snapshots ...
[INFO] Transforming 'DICOM-Message-Parser'...
[INFO] Not generating release POMs
[INFO] Executing goals 'clean verify'...
[INFO] [INFO] Scanning for projects...
[INFO] [INFO]                                                                         
[INFO] [INFO] ------------------------------------------------------------------------
[INFO] [INFO] Building DICOM-Message-Parser 2.0.1
[INFO] [INFO] ------------------------------------------------------------------------
[INFO] [INFO] 
[INFO] [INFO] --- maven-clean-plugin:2.4.1:clean (default-clean) @ ihej-dicom ---
[INFO] [INFO] 
[INFO] [INFO] --- maven-resources-plugin:2.5:resources (default-resources) @ ihej-dicom ---
[INFO] [debug] execute contextualize
[INFO] [INFO] Using 'UTF-8' encoding to copy filtered resources.
[INFO] [INFO] skip non existing resourceDirectory /home/jenkins/.hudson/jobs/ihej-dicom/workspace/trunk/src/main/resources
[INFO] [INFO] 
[INFO] [INFO] --- maven-compiler-plugin:2.3.2:compile (default-compile) @ ihej-dicom ---
[INFO] [INFO] Compiling 41 source files to /home/jenkins/.hudson/jobs/ihej-dicom/workspace/trunk/target/classes
[INFO] [INFO] 
[INFO] [INFO] --- maven-resources-plugin:2.5:testResources (default-testResources) @ ihej-dicom ---
[INFO] [debug] execute contextualize
[INFO] [INFO] Using 'UTF-8' encoding to copy filtered resources.
[INFO] [INFO] skip non existing resourceDirectory /home/jenkins/.hudson/jobs/ihej-dicom/workspace/trunk/src/test/resources
[INFO] [INFO] 
[INFO] [INFO] --- maven-compiler-plugin:2.3.2:testCompile (default-testCompile) @ ihej-dicom ---
[INFO] [INFO] No sources to compile
[INFO] [INFO] 
[INFO] [INFO] --- maven-surefire-plugin:2.10:test (default-test) @ ihej-dicom ---
[INFO] [INFO] No tests to run.
[INFO] [INFO] Surefire report directory: /home/jenkins/.hudson/jobs/ihej-dicom/workspace/trunk/target/surefire-reports
[INFO] 
[INFO] -------------------------------------------------------
[INFO]  T E S T S
[INFO] -------------------------------------------------------
[INFO] 
[INFO] Results :
[INFO] 
[INFO] Tests run: 0, Failures: 0, Errors: 0, Skipped: 0
[INFO] 
[INFO] [INFO] 
[INFO] [INFO] --- maven-jar-plugin:2.3.2:jar (default-jar) @ ihej-dicom ---
[INFO] [INFO] Building jar: /home/jenkins/.hudson/jobs/ihej-dicom/workspace/trunk/target/ihej-dicom-2.0.1.jar
[INFO] [INFO] ------------------------------------------------------------------------
[INFO] [INFO] BUILD SUCCESS
[INFO] [INFO] ------------------------------------------------------------------------
[INFO] [INFO] Total time: 1.851s
[INFO] [INFO] Finished at: Mon May 02 10:36:43 CEST 2016
[INFO] [INFO] Final Memory: 12M/481M
[INFO] [INFO] ------------------------------------------------------------------------
[INFO] Checking in modified POMs...
[INFO] Executing: /bin/sh -c cd /home/jenkins/.hudson/jobs/ihej-dicom/workspace/trunk && svn --non-interactive commit --file /tmp/maven-scm-139301325.commit --targets /tmp/maven-scm-1420291629175256819-targets
[INFO] Working directory: /home/jenkins/.hudson/jobs/ihej-dicom/workspace/trunk
[INFO] Tagging release with the label ihej-dicom-2.0.1...
[INFO] Executing: /bin/sh -c cd /home/jenkins/.hudson/jobs/ihej-dicom/workspace/trunk && svn --non-interactive copy --file /tmp/maven-scm-3151644.commit --revision 51843 https://scm.gforge.inria.fr/svn/gazelle/Maven/libs/ihej-dicom/DICOM-Message-Parser/trunk https://scm.gforge.inria.fr/svn/gazelle/Maven/libs/ihej-dicom/DICOM-Message-Parser/tags/ihej-dicom-2.0.1
[INFO] Working directory: /home/jenkins/.hudson/jobs/ihej-dicom/workspace/trunk
Started calculate disk usage of build
Finished Calculation of disk usage of build in 0 seconds
Started calculate disk usage of workspace
Finished Calculation of disk usage of workspace in 0 seconds
[INFO] ------------------------------------------------------------------------
[INFO] BUILD FAILURE
[INFO] ------------------------------------------------------------------------
[INFO] Total time: 5.335s
[INFO] Finished at: Mon May 02 10:36:44 CEST 2016
[INFO] Final Memory: 15M/481M
[INFO] ------------------------------------------------------------------------
Waiting for Jenkins to finish collecting data
[ERROR] Failed to execute goal org.apache.maven.plugins:maven-release-plugin:2.0:prepare (default-cli) on project ihej-dicom: Unable to tag SCM
[ERROR] Provider message:
[ERROR] The svn tag command failed.
[ERROR] Command output:
[ERROR] svn: Repository moved permanently to 'https://scm.gforge.inria.fr/authscm/gazelle-jenkins/svn/gazelle/Maven/libs/ihej-dicom/DICOM-Message-Parser'; please relocate
[ERROR] -> [Help 1]
[ERROR] 
[ERROR] To see the full stack trace of the errors, re-run Maven with the -e switch.
[ERROR] Re-run Maven using the -X switch to enable full debug logging.
[ERROR] 
[ERROR] For more information about the errors and possible solutions, please read the following articles:
[ERROR] [Help 1] http://cwiki.apache.org/confluence/display/MAVEN/MojoFailureException
Sending e-mails to: abderrazek.boufahja@ihe-europe.net anne-gaelle.berge@ihe-europe.net eric.poiseau@inria.fr guillaume.thomazon@ihe-europe.net jean-francois.labbe@ihe-europe.net