FailedConsole Output

Established TCP socket on 44715
Java HotSpot(TM) 64-Bit Server VM warning: ignoring option MaxPermSize=1024m; support was removed in 8.0
<===[JENKINS REMOTING CAPACITY]===>channel started
Executing Maven:  -B -f /home/jenkins/.hudson/jobs/lab-validator-jar/workspace/pom.xml clean install -P production org.sonarsource.scanner.maven:sonar-maven-plugin:sonar
[INFO] Scanning for projects...
[WARNING] 
[WARNING] Some problems were encountered while building the effective model for net.ihe.gazelle.lab:lab-validator-jar:jar:1.2-SNAPSHOT
[WARNING] 'build.plugins.plugin.version' for org.apache.maven.plugins:maven-compiler-plugin is missing. @ line 13, column 12
[WARNING] 
[WARNING] It is highly recommended to fix these problems because they threaten the stability of your build.
[WARNING] 
[WARNING] For this reason, future Maven versions might no longer support building such malformed projects.
[WARNING] 
[INFO] 
[INFO] ------------------------------------------------------------------------
[INFO] Building lab-validator-jar 1.2-SNAPSHOT
[INFO] ------------------------------------------------------------------------
[INFO] 
[INFO] --- maven-clean-plugin:2.5:clean (default-clean) @ lab-validator-jar ---
[INFO] 
[INFO] --- maven-resources-plugin:2.6:resources (default-resources) @ lab-validator-jar ---
[WARNING] Using platform encoding (UTF8 actually) to copy filtered resources, i.e. build is platform dependent!
[INFO] skip non existing resourceDirectory /home/jenkins/.hudson/jobs/lab-validator-jar/workspace/src/main/resources
[INFO] 
[INFO] --- maven-compiler-plugin:3.1:compile (default-compile) @ lab-validator-jar ---
[INFO] Changes detected - recompiling the module!
[WARNING] File encoding has not been set, using platform encoding UTF8, i.e. build is platform dependent!
[INFO] Compiling 1 source file to /home/jenkins/.hudson/jobs/lab-validator-jar/workspace/target/classes
[INFO] 
[INFO] --- maven-resources-plugin:2.6:testResources (default-testResources) @ lab-validator-jar ---
[WARNING] Using platform encoding (UTF8 actually) to copy filtered resources, i.e. build is platform dependent!
[INFO] skip non existing resourceDirectory /home/jenkins/.hudson/jobs/lab-validator-jar/workspace/src/test/resources
[INFO] 
[INFO] --- maven-compiler-plugin:3.1:testCompile (default-testCompile) @ lab-validator-jar ---
[INFO] No sources to compile
[INFO] 
[INFO] --- maven-surefire-plugin:2.12.4:test (default-test) @ lab-validator-jar ---
[INFO] No tests to run.
[JENKINS] Recording test results
[INFO] 
[INFO] --- maven-jar-plugin:2.3:jar (default-jar) @ lab-validator-jar ---
[INFO] Building jar: /home/jenkins/.hudson/jobs/lab-validator-jar/workspace/target/lab-validator-jar-1.2-SNAPSHOT.jar
[INFO] 
[INFO] --- maven-install-plugin:2.4:install (default-install) @ lab-validator-jar ---
[INFO] Installing /home/jenkins/.hudson/jobs/lab-validator-jar/workspace/target/lab-validator-jar-1.2-SNAPSHOT.jar to /home/jenkins/.m2/repository/net/ihe/gazelle/lab/lab-validator-jar/1.2-SNAPSHOT/lab-validator-jar-1.2-SNAPSHOT.jar
[INFO] Installing /home/jenkins/.hudson/jobs/lab-validator-jar/workspace/pom.xml to /home/jenkins/.m2/repository/net/ihe/gazelle/lab/lab-validator-jar/1.2-SNAPSHOT/lab-validator-jar-1.2-SNAPSHOT.pom
Collecting metadata...
Metadata collection done.
Started calculate disk usage of build
Finished Calculation of disk usage of build in 0 seconds
Started calculate disk usage of workspace
Finished Calculation of disk usage of workspace in 0 seconds
[INFO] 
[INFO] ------------------------------------------------------------------------
[INFO] Building lab-validator-jar 1.2-SNAPSHOT
[INFO] ------------------------------------------------------------------------
[INFO] 
[INFO] --- sonar-maven-plugin:3.9.0.2155:sonar (default-cli) @ lab-validator-jar ---
[INFO] User cache: /home/jenkins/.sonar/cache
[ERROR] SonarQube server [https://gazelle.ihe.net/sonar] can not be reached
Collecting metadata...
[WARNING] The following metadata could not be added due to conflict with existing values:
	build

Metadata collection done.
Started calculate disk usage of build
Finished Calculation of disk usage of build in 0 seconds
Started calculate disk usage of workspace
Finished Calculation of disk usage of workspace in 0 seconds
[INFO] ------------------------------------------------------------------------
[INFO] BUILD FAILURE
[INFO] ------------------------------------------------------------------------
[INFO] Total time: 4.510 s
[INFO] Finished at: 2021-09-18T05:28:08+02:00
[INFO] Final Memory: 21M/399M
[INFO] ------------------------------------------------------------------------
[WARNING] The requested profile "production" could not be activated because it does not exist.
Waiting for Jenkins to finish collecting data
[ERROR] Failed to execute goal org.sonarsource.scanner.maven:sonar-maven-plugin:3.9.0.2155:sonar (default-cli) on project lab-validator-jar: Unable to execute SonarScanner analysis: Fail to get bootstrap index from server: Status returned by url [https://gazelle.ihe.net/sonar/batch/index] is not valid: [404] -> [Help 1]
[ERROR] 
[ERROR] To see the full stack trace of the errors, re-run Maven with the -e switch.
[ERROR] Re-run Maven using the -X switch to enable full debug logging.
[ERROR] 
[ERROR] For more information about the errors and possible solutions, please read the following articles:
[ERROR] [Help 1] http://cwiki.apache.org/confluence/display/MAVEN/MojoExecutionException