FailedConsole Output

Started by timer
Running as SYSTEM
[EnvInject] - Loading node environment variables.
Building on master in workspace /home/jenkins/.hudson/jobs/rcsep-validator-jar/workspace
Reverting /home/jenkins/.hudson/jobs/rcsep-validator-jar/workspace/. to depth infinity with ignoreExternals: false
Updating svn+ssh://scm.gforge.inria.fr/svn/gazelle/validators/src-gen/cda/rcsep-validator-jar/trunk at revision '2020-01-18T04:28:15.775 +0100'
Using sole credentials gazelle-jenkins in realm ‘svn+ssh://scm.gforge.inria.fr’
Using sole credentials gazelle-jenkins in realm ‘svn+ssh://scm.gforge.inria.fr’
At revision 68691

No changes for svn+ssh://scm.gforge.inria.fr/svn/gazelle/validators/src-gen/cda/rcsep-validator-jar/trunk since the previous build
Parsing POMs
Established TCP socket on 33373
[workspace] $ java -Djava.net.preferIPv4Stack=true -Dfile.encoding=UTF8 -Xmx4096m -XX:MaxPermSize=1024m -cp /home/jenkins/.hudson/plugins/maven-plugin/WEB-INF/lib/maven35-agent-1.13.jar:/home/jenkins/.hudson/tools/hudson.tasks.Maven_MavenInstallation/Maven3/boot/plexus-classworlds-2.5.2.jar:/home/jenkins/.hudson/tools/hudson.tasks.Maven_MavenInstallation/Maven3/conf/logging jenkins.maven3.agent.Maven35Main /home/jenkins/.hudson/tools/hudson.tasks.Maven_MavenInstallation/Maven3 /home/jenkins/.hudson/war/WEB-INF/lib/remoting-3.29.jar /home/jenkins/.hudson/plugins/maven-plugin/WEB-INF/lib/maven35-interceptor-1.13.jar /home/jenkins/.hudson/plugins/maven-plugin/WEB-INF/lib/maven3-interceptor-commons-1.13.jar 33373
Java HotSpot(TM) 64-Bit Server VM warning: ignoring option MaxPermSize=1024m; support was removed in 8.0
<===[JENKINS REMOTING CAPACITY]===>channel started
Executing Maven:  -B -f /home/jenkins/.hudson/jobs/rcsep-validator-jar/workspace/pom.xml clean install
[INFO] Scanning for projects...
[WARNING] 
[WARNING] Some problems were encountered while building the effective model for net.ihe.gazelle:rcsep-validator-jar:jar:1.0.11-SNAPSHOT
[WARNING] 'build.plugins.plugin.version' for org.apache.maven.plugins:maven-compiler-plugin is missing. @ line 14, column 12
[WARNING] 
[WARNING] It is highly recommended to fix these problems because they threaten the stability of your build.
[WARNING] 
[WARNING] For this reason, future Maven versions might no longer support building such malformed projects.
[WARNING] 
[INFO] 
[INFO] ------------------------------------------------------------------------
[INFO] Building CDA - ACC - Registry Content Submission Electrophysiology 1.0.11-SNAPSHOT
[INFO] ------------------------------------------------------------------------
[INFO] 
[INFO] --- maven-clean-plugin:2.5:clean (default-clean) @ rcsep-validator-jar ---
[INFO] Deleting /home/jenkins/.hudson/jobs/rcsep-validator-jar/workspace/target
[INFO] 
[INFO] --- maven-resources-plugin:2.6:resources (default-resources) @ rcsep-validator-jar ---
[WARNING] Using platform encoding (UTF8 actually) to copy filtered resources, i.e. build is platform dependent!
[INFO] skip non existing resourceDirectory /home/jenkins/.hudson/jobs/rcsep-validator-jar/workspace/src/main/resources
[INFO] 
[INFO] --- maven-compiler-plugin:3.1:compile (default-compile) @ rcsep-validator-jar ---
[INFO] Changes detected - recompiling the module!
[WARNING] File encoding has not been set, using platform encoding UTF8, i.e. build is platform dependent!
[INFO] Compiling 167 source files to /home/jenkins/.hudson/jobs/rcsep-validator-jar/workspace/target/classes
[INFO] 
[INFO] --- maven-resources-plugin:2.6:testResources (default-testResources) @ rcsep-validator-jar ---
[WARNING] Using platform encoding (UTF8 actually) to copy filtered resources, i.e. build is platform dependent!
[INFO] Copying 1165 resources
[INFO] 
[INFO] --- maven-compiler-plugin:3.1:testCompile (default-testCompile) @ rcsep-validator-jar ---
[INFO] Changes detected - recompiling the module!
[WARNING] File encoding has not been set, using platform encoding UTF8, i.e. build is platform dependent!
[INFO] Compiling 37 source files to /home/jenkins/.hudson/jobs/rcsep-validator-jar/workspace/target/test-classes
[INFO] 
[INFO] --- maven-surefire-plugin:2.12.4:test (default-test) @ rcsep-validator-jar ---
[INFO] Surefire report directory: /home/jenkins/.hudson/jobs/rcsep-validator-jar/workspace/target/surefire-reports

-------------------------------------------------------
 T E S T S
-------------------------------------------------------
Running net.ihe.gazelle.test.E_RCSEP_21000_Patient_Demographic_ObserTest
Initiating the CDA validator of the application
log4j:WARN No appenders could be found for logger (org.apache.commons.httpclient.HttpClient).
log4j:WARN Please initialize the log4j system properly.
Tests run: 8, Failures: 0, Errors: 0, Skipped: 0, Time elapsed: 5.432 sec
Running net.ihe.gazelle.test.E_RCSEP_42000_Procedure_Session_ObservaTest
Tests run: 7, Failures: 0, Errors: 0, Skipped: 0, Time elapsed: 3.568 sec
Running net.ihe.gazelle.test.RCSEP_41500_Preprocedure_Vital_Sign_ObsTest
Tests run: 12, Failures: 0, Errors: 0, Skipped: 0, Time elapsed: 4.707 sec
Running net.ihe.gazelle.test.E_RCSEP_41100_Preprocedure_Test_Result_Test
Tests run: 13, Failures: 0, Errors: 0, Skipped: 0, Time elapsed: 5.16 sec
Running net.ihe.gazelle.test.E_RCSEP_43121_Procedure_Device_ObservatTest
Tests run: 11, Failures: 0, Errors: 0, Skipped: 0, Time elapsed: 4.565 sec
Running net.ihe.gazelle.test.E_RCSEP_52000_Discharge_MedicationTest
Java HotSpot(TM) 64-Bit Server VM warning: INFO: os::commit_memory(0x0000000752000000, 281018368, 0) failed; error='Cannot allocate memory' (errno=12)
#
# There is insufficient memory for the Java Runtime Environment to continue.
# Native memory allocation (mmap) failed to map 281018368 bytes for committing reserved memory.
# An error report file with more information is saved as:
# /home/jenkins/.hudson/jobs/rcsep-validator-jar/workspace/hs_err_pid14369.log

Results :

Tests run: 51, Failures: 0, Errors: 0, Skipped: 0

[JENKINS] Recording test results
Collecting metadata...
Metadata collection done.
Started calculate disk usage of build
Finished Calculation of disk usage of build in 0 seconds
Started calculate disk usage of workspace
Finished Calculation of disk usage of workspace in 0 seconds
[INFO] ------------------------------------------------------------------------
[INFO] BUILD FAILURE
[INFO] ------------------------------------------------------------------------
[INFO] Total time: 42.148 s
[INFO] Finished at: 2020-01-18T04:29:02+01:00
[INFO] Final Memory: 19M/393M
[INFO] ------------------------------------------------------------------------
Waiting for Jenkins to finish collecting data
[ERROR] Failed to execute goal org.apache.maven.plugins:maven-surefire-plugin:2.12.4:test (default-test) on project rcsep-validator-jar: Execution default-test of goal org.apache.maven.plugins:maven-surefire-plugin:2.12.4:test failed: The forked VM terminated without saying properly goodbye. VM crash or System.exit called ? -> [Help 1]
[ERROR] 
[ERROR] To see the full stack trace of the errors, re-run Maven with the -e switch.
[ERROR] Re-run Maven using the -X switch to enable full debug logging.
[ERROR] 
[ERROR] For more information about the errors and possible solutions, please read the following articles:
[ERROR] [Help 1] http://cwiki.apache.org/confluence/display/MAVEN/PluginExecutionException
[JENKINS] Archiving /home/jenkins/.hudson/jobs/rcsep-validator-jar/workspace/pom.xml to net.ihe.gazelle/rcsep-validator-jar/1.0.11-SNAPSHOT/rcsep-validator-jar-1.0.11-SNAPSHOT.pom
channel stopped
Collecting metadata...
Metadata collection done.
Started calculate disk usage of build
Finished Calculation of disk usage of build in 0 seconds
Started calculate disk usage of workspace
Finished Calculation of disk usage of workspace in 0 seconds
Sending e-mails to: anne-gaelle.berge@ihe-europe.net cel@kereval.com eric.poiseau@inria.fr guillaume.thomazon@ihe-europe.net hra@kereval.com mtc@kereval.com yct@kereval.com
Finished: FAILURE