UnstableConsole Output

Started by user Guillaume T
[EnvInject] - Loading node environment variables.
Building on master in workspace /home/jenkins/.hudson/jobs/gazelle-tm-rest-services/workspace
Reverting /home/jenkins/.hudson/jobs/gazelle-tm-rest-services/workspace/. to depth infinity with ignoreExternals: false
Updating svn+ssh://scm.gforge.inria.fr/svn/gazelle/Maven/gazelle-tm-rest-services/trunk at revision '2017-09-08T16:00:06.486 +0200'
Using sole credentials gazelle-jenkins in realm ‘svn+ssh://scm.gforge.inria.fr’
Using sole credentials gazelle-jenkins in realm ‘svn+ssh://scm.gforge.inria.fr’
At revision 59222

No changes for svn+ssh://scm.gforge.inria.fr/svn/gazelle/Maven/gazelle-tm-rest-services/trunk since the previous build
Injecting SonarQube environment variables using the configuration: Sonar
Parsing POMs
Established TCP socket on 56672
[workspace] $ /usr/lib/jvm/java-8-oracle//bin/java -Djava.net.preferIPv4Stack=true -Dfile.encoding=UTF8 -Xmx4096m -XX:MaxPermSize=1024m -cp /home/jenkins/.hudson/plugins/maven-plugin/WEB-INF/lib/maven33-agent-1.11.jar:/home/jenkins/.hudson/tools/hudson.tasks.Maven_MavenInstallation/Maven3/boot/plexus-classworlds-2.5.2.jar:/home/jenkins/.hudson/tools/hudson.tasks.Maven_MavenInstallation/Maven3/conf/logging jenkins.maven3.agent.Maven33Main /home/jenkins/.hudson/tools/hudson.tasks.Maven_MavenInstallation/Maven3 /home/jenkins/.hudson/war/WEB-INF/lib/remoting-3.11.jar /home/jenkins/.hudson/plugins/maven-plugin/WEB-INF/lib/maven33-interceptor-1.11.jar /home/jenkins/.hudson/plugins/maven-plugin/WEB-INF/lib/maven3-interceptor-commons-1.11.jar 56672
Java HotSpot(TM) 64-Bit Server VM warning: ignoring option MaxPermSize=1024m; support was removed in 8.0
<===[JENKINS REMOTING CAPACITY]===>channel started
Executing Maven:  -B -f /home/jenkins/.hudson/jobs/gazelle-tm-rest-services/workspace/pom.xml clean install org.sonarsource.scanner.maven:sonar-maven-plugin:sonar
[INFO] Scanning for projects...
[INFO] ------------------------------------------------------------------------
[INFO] Reactor Build Order:
[INFO] 
[INFO] gazelle-tm-rest-serices
[INFO] gazelle-tm-rest-data
[INFO] gazelle-tm-rest-client
[INFO]                                                                         
[INFO] ------------------------------------------------------------------------
[INFO] Building gazelle-tm-rest-serices 1.0.2-SNAPSHOT
[INFO] ------------------------------------------------------------------------
[INFO] 
[INFO] --- maven-clean-plugin:2.5:clean (default-clean) @ gazelle-tm-rest-services ---
[INFO] Deleting /home/jenkins/.hudson/jobs/gazelle-tm-rest-services/workspace/target
[INFO] 
[INFO] --- maven-enforcer-plugin:1.2:enforce (enforce-java-version) @ gazelle-tm-rest-services ---
[INFO] 
[INFO] --- maven-enforcer-plugin:1.2:enforce (enforce-maven-version) @ gazelle-tm-rest-services ---
[INFO] 
[INFO] --- buildnumber-maven-plugin:1.2:create-timestamp (get-build-timestamp) @ gazelle-tm-rest-services ---
[INFO] 
[INFO] --- buildnumber-maven-plugin:1.2:create (get-scm-revision) @ gazelle-tm-rest-services ---
[INFO] Checking for local modifications: skipped.
[INFO] Updating project files from SCM: skipped.
[INFO] Executing: /bin/sh -c cd /home/jenkins/.hudson/jobs/gazelle-tm-rest-services/workspace && svn --non-interactive info
[INFO] Working directory: /home/jenkins/.hudson/jobs/gazelle-tm-rest-services/workspace
[INFO] Storing buildNumber: UNKNOWN at timestamp: 1504879212750
[INFO] Executing: /bin/sh -c cd /home/jenkins/.hudson/jobs/gazelle-tm-rest-services/workspace && svn --non-interactive info
[INFO] Working directory: /home/jenkins/.hudson/jobs/gazelle-tm-rest-services/workspace
[INFO] Storing buildScmBranch: UNKNOWN_BRANCH
[INFO] 
[INFO] --- maven-buildmetadata-plugin:1.1.0.IHE.3:provide-buildmetadata (default) @ gazelle-tm-rest-services ---
[INFO] Executing: /bin/sh -c cd /home/jenkins/.hudson/jobs/gazelle-tm-rest-services/workspace && svn --non-interactive log -v -r '{2017-08-09 14:00:13 +0000}:{2017-09-09 14:00:13 +0000}' svn+ssh://scm.gforge.inria.fr/svn/gazelle/Maven/gazelle-tm-rest-services/trunk
[INFO] Working directory: /home/jenkins/.hudson/jobs/gazelle-tm-rest-services/workspace
[INFO] Executing: /bin/sh -c cd /home/jenkins/.hudson/jobs/gazelle-tm-rest-services/workspace && svn --non-interactive log -v -r '{2017-07-10 14:00:14 +0000}:{2017-09-09 14:00:14 +0000}' svn+ssh://scm.gforge.inria.fr/svn/gazelle/Maven/gazelle-tm-rest-services/trunk
[INFO] Working directory: /home/jenkins/.hudson/jobs/gazelle-tm-rest-services/workspace
[INFO] Executing: /bin/sh -c cd /home/jenkins/.hudson/jobs/gazelle-tm-rest-services/workspace && svn --non-interactive log -v -r '{2017-06-10 14:00:15 +0000}:{2017-09-09 14:00:15 +0000}' svn+ssh://scm.gforge.inria.fr/svn/gazelle/Maven/gazelle-tm-rest-services/trunk
[INFO] Working directory: /home/jenkins/.hudson/jobs/gazelle-tm-rest-services/workspace
[INFO] Executing: /bin/sh -c cd /home/jenkins/.hudson/jobs/gazelle-tm-rest-services/workspace && svn --non-interactive log -v -r '{2017-05-11 14:00:16 +0000}:{2017-09-09 14:00:16 +0000}' svn+ssh://scm.gforge.inria.fr/svn/gazelle/Maven/gazelle-tm-rest-services/trunk
[INFO] Working directory: /home/jenkins/.hudson/jobs/gazelle-tm-rest-services/workspace
[INFO] Executing: /bin/sh -c cd /home/jenkins/.hudson/jobs/gazelle-tm-rest-services/workspace && svn --non-interactive log -v -r '{2017-04-11 14:00:17 +0000}:{2017-09-09 14:00:17 +0000}' svn+ssh://scm.gforge.inria.fr/svn/gazelle/Maven/gazelle-tm-rest-services/trunk
[INFO] Working directory: /home/jenkins/.hudson/jobs/gazelle-tm-rest-services/workspace
[INFO] Executing: /bin/sh -c cd /home/jenkins/.hudson/jobs/gazelle-tm-rest-services/workspace && svn --non-interactive log -v -r '{2017-03-12 14:00:17 +0000}:{2017-09-09 14:00:17 +0000}' svn+ssh://scm.gforge.inria.fr/svn/gazelle/Maven/gazelle-tm-rest-services/trunk
[INFO] Working directory: /home/jenkins/.hudson/jobs/gazelle-tm-rest-services/workspace
[INFO] Writing properties '/home/jenkins/.hudson/jobs/gazelle-tm-rest-services/workspace/target/build.properties'...
[INFO] Writing XML report '/home/jenkins/.hudson/jobs/gazelle-tm-rest-services/workspace/target/buildmetadata.xml'...
[INFO] 
[INFO] --- maven-source-plugin:2.2.1:jar-no-fork (attach-sources) @ gazelle-tm-rest-services ---
[INFO] 
[INFO] --- maven-jar-plugin:2.6:test-jar (default) @ gazelle-tm-rest-services ---
[WARNING] JAR will be empty - no content was marked for inclusion!
[INFO] Building jar: /home/jenkins/.hudson/jobs/gazelle-tm-rest-services/workspace/target/gazelle-tm-rest-services-tests.jar
[INFO] 
[INFO] --- maven-assembly-plugin:2.4:single (make-assembly-metadata) @ gazelle-tm-rest-services ---
[INFO] Building zip: /home/jenkins/.hudson/jobs/gazelle-tm-rest-services/workspace/target/gazelle-tm-rest-services-metadata.zip
[INFO] 
[INFO] --- maven-install-plugin:2.4:install (default-install) @ gazelle-tm-rest-services ---
[INFO] Installing /home/jenkins/.hudson/jobs/gazelle-tm-rest-services/workspace/pom.xml to /home/jenkins/.m2/repository/net/ihe/gazelle/tm/services/gazelle-tm-rest-services/1.0.2-SNAPSHOT/gazelle-tm-rest-services-1.0.2-SNAPSHOT.pom
[INFO] Installing /home/jenkins/.hudson/jobs/gazelle-tm-rest-services/workspace/target/gazelle-tm-rest-services-tests.jar to /home/jenkins/.m2/repository/net/ihe/gazelle/tm/services/gazelle-tm-rest-services/1.0.2-SNAPSHOT/gazelle-tm-rest-services-1.0.2-SNAPSHOT-tests.jar
[INFO] Installing /home/jenkins/.hudson/jobs/gazelle-tm-rest-services/workspace/target/gazelle-tm-rest-services-metadata.zip to /home/jenkins/.m2/repository/net/ihe/gazelle/tm/services/gazelle-tm-rest-services/1.0.2-SNAPSHOT/gazelle-tm-rest-services-1.0.2-SNAPSHOT-metadata.zip
Started calculate disk usage of build
Finished Calculation of disk usage of build in 0 seconds
Started calculate disk usage of workspace
Finished Calculation of disk usage of workspace in 0 seconds
[INFO]                                                                         
[INFO] ------------------------------------------------------------------------
[INFO] Building gazelle-tm-rest-data 1.0.2-SNAPSHOT
[INFO] ------------------------------------------------------------------------
[INFO] 
[INFO] --- maven-clean-plugin:2.5:clean (default-clean) @ gazelle-tm-rest-data ---
[INFO] Deleting /home/jenkins/.hudson/jobs/gazelle-tm-rest-services/workspace/gazelle-tm-rest-data/target
[INFO] 
[INFO] --- maven-enforcer-plugin:1.2:enforce (enforce-java-version) @ gazelle-tm-rest-data ---
[INFO] 
[INFO] --- maven-enforcer-plugin:1.2:enforce (enforce-maven-version) @ gazelle-tm-rest-data ---
[INFO] 
[INFO] --- buildnumber-maven-plugin:1.2:create-timestamp (get-build-timestamp) @ gazelle-tm-rest-data ---
[INFO] 
[INFO] --- buildnumber-maven-plugin:1.2:create (get-scm-revision) @ gazelle-tm-rest-data ---
[INFO] 
[INFO] --- maven-buildmetadata-plugin:1.1.0.IHE.3:provide-buildmetadata (default) @ gazelle-tm-rest-data ---
[INFO] Executing: /bin/sh -c cd /home/jenkins/.hudson/jobs/gazelle-tm-rest-services/workspace/gazelle-tm-rest-data && svn --non-interactive log -v -r '{2017-08-09 14:00:19 +0000}:{2017-09-09 14:00:19 +0000}' svn+ssh://scm.gforge.inria.fr/svn/gazelle/Maven/gazelle-tm-rest-services/trunk/gazelle-tm-rest-data
[INFO] Working directory: /home/jenkins/.hudson/jobs/gazelle-tm-rest-services/workspace/gazelle-tm-rest-data
[INFO] Executing: /bin/sh -c cd /home/jenkins/.hudson/jobs/gazelle-tm-rest-services/workspace/gazelle-tm-rest-data && svn --non-interactive log -v -r '{2017-07-10 14:00:20 +0000}:{2017-09-09 14:00:20 +0000}' svn+ssh://scm.gforge.inria.fr/svn/gazelle/Maven/gazelle-tm-rest-services/trunk/gazelle-tm-rest-data
[INFO] Working directory: /home/jenkins/.hudson/jobs/gazelle-tm-rest-services/workspace/gazelle-tm-rest-data
[INFO] Executing: /bin/sh -c cd /home/jenkins/.hudson/jobs/gazelle-tm-rest-services/workspace/gazelle-tm-rest-data && svn --non-interactive log -v -r '{2017-06-10 14:00:20 +0000}:{2017-09-09 14:00:20 +0000}' svn+ssh://scm.gforge.inria.fr/svn/gazelle/Maven/gazelle-tm-rest-services/trunk/gazelle-tm-rest-data
[INFO] Working directory: /home/jenkins/.hudson/jobs/gazelle-tm-rest-services/workspace/gazelle-tm-rest-data
[INFO] Executing: /bin/sh -c cd /home/jenkins/.hudson/jobs/gazelle-tm-rest-services/workspace/gazelle-tm-rest-data && svn --non-interactive log -v -r '{2017-05-11 14:00:20 +0000}:{2017-09-09 14:00:20 +0000}' svn+ssh://scm.gforge.inria.fr/svn/gazelle/Maven/gazelle-tm-rest-services/trunk/gazelle-tm-rest-data
[INFO] Working directory: /home/jenkins/.hudson/jobs/gazelle-tm-rest-services/workspace/gazelle-tm-rest-data
[INFO] Executing: /bin/sh -c cd /home/jenkins/.hudson/jobs/gazelle-tm-rest-services/workspace/gazelle-tm-rest-data && svn --non-interactive log -v -r '{2017-04-11 14:00:21 +0000}:{2017-09-09 14:00:21 +0000}' svn+ssh://scm.gforge.inria.fr/svn/gazelle/Maven/gazelle-tm-rest-services/trunk/gazelle-tm-rest-data
[INFO] Working directory: /home/jenkins/.hudson/jobs/gazelle-tm-rest-services/workspace/gazelle-tm-rest-data
[INFO] Executing: /bin/sh -c cd /home/jenkins/.hudson/jobs/gazelle-tm-rest-services/workspace/gazelle-tm-rest-data && svn --non-interactive log -v -r '{2017-03-12 14:00:21 +0000}:{2017-09-09 14:00:21 +0000}' svn+ssh://scm.gforge.inria.fr/svn/gazelle/Maven/gazelle-tm-rest-services/trunk/gazelle-tm-rest-data
[INFO] Working directory: /home/jenkins/.hudson/jobs/gazelle-tm-rest-services/workspace/gazelle-tm-rest-data
[INFO] Writing properties '/home/jenkins/.hudson/jobs/gazelle-tm-rest-services/workspace/gazelle-tm-rest-data/target/classes/META-INF/build.properties'...
[INFO] Writing XML report '/home/jenkins/.hudson/jobs/gazelle-tm-rest-services/workspace/gazelle-tm-rest-data/target/buildmetadata.xml'...
[INFO] 
[INFO] --- maven-resources-plugin:2.7:resources (default-resources) @ gazelle-tm-rest-data ---
[INFO] Using 'UTF-8' encoding to copy filtered resources.
[INFO] skip non existing resourceDirectory /home/jenkins/.hudson/jobs/gazelle-tm-rest-services/workspace/gazelle-tm-rest-data/src/main/resources
[INFO] 
[INFO] --- maven-compiler-plugin:3.5.1:compile (default-compile) @ gazelle-tm-rest-data ---
[INFO] Changes detected - recompiling the module!
[INFO] Compiling 33 source files to /home/jenkins/.hudson/jobs/gazelle-tm-rest-services/workspace/gazelle-tm-rest-data/target/classes
[WARNING] bootstrap class path not set in conjunction with -source 1.6
[INFO] 
[INFO] --- maven-resources-plugin:2.7:testResources (default-testResources) @ gazelle-tm-rest-data ---
[INFO] Using 'UTF-8' encoding to copy filtered resources.
[INFO] skip non existing resourceDirectory /home/jenkins/.hudson/jobs/gazelle-tm-rest-services/workspace/gazelle-tm-rest-data/src/test/resources
[INFO] 
[INFO] --- maven-compiler-plugin:3.5.1:testCompile (default-testCompile) @ gazelle-tm-rest-data ---
[INFO] Changes detected - recompiling the module!
[INFO] Compiling 2 source files to /home/jenkins/.hudson/jobs/gazelle-tm-rest-services/workspace/gazelle-tm-rest-data/target/test-classes
[WARNING] bootstrap class path not set in conjunction with -source 1.6
[INFO] 
[INFO] --- maven-surefire-plugin:2.19.1:test (default-test) @ gazelle-tm-rest-data ---

-------------------------------------------------------
 T E S T S
-------------------------------------------------------
Running net.ihe.gazelle.tm.ws.data.IntegrationProfileNamesWrapperTest
Tests run: 1, Failures: 0, Errors: 0, Skipped: 0, Time elapsed: 0.001 sec - in net.ihe.gazelle.tm.ws.data.IntegrationProfileNamesWrapperTest
Running net.ihe.gazelle.tm.ws.data.TransactionWrapperTest
iti-1
iti-2
iti-3
iti-10
iti-11
ITI-12
rad-8
Rad-10
Tests run: 1, Failures: 0, Errors: 0, Skipped: 0, Time elapsed: 0.001 sec - in net.ihe.gazelle.tm.ws.data.TransactionWrapperTest

Results :

Tests run: 2, Failures: 0, Errors: 0, Skipped: 0

[JENKINS] Recording test results
[INFO] 
[INFO] --- maven-jar-plugin:2.6:jar (default-jar) @ gazelle-tm-rest-data ---
[INFO] Building jar: /home/jenkins/.hudson/jobs/gazelle-tm-rest-services/workspace/gazelle-tm-rest-data/target/gazelle-tm-rest-data.jar
[INFO] 
[INFO] --- maven-source-plugin:2.2.1:jar-no-fork (attach-sources) @ gazelle-tm-rest-data ---
[INFO] Building jar: /home/jenkins/.hudson/jobs/gazelle-tm-rest-services/workspace/gazelle-tm-rest-data/target/gazelle-tm-rest-data-sources.jar
[INFO] 
[INFO] --- maven-jar-plugin:2.6:test-jar (default) @ gazelle-tm-rest-data ---
[INFO] Building jar: /home/jenkins/.hudson/jobs/gazelle-tm-rest-services/workspace/gazelle-tm-rest-data/target/gazelle-tm-rest-data-tests.jar
[INFO] 
[INFO] --- maven-install-plugin:2.4:install (default-install) @ gazelle-tm-rest-data ---
[INFO] Installing /home/jenkins/.hudson/jobs/gazelle-tm-rest-services/workspace/gazelle-tm-rest-data/target/gazelle-tm-rest-data.jar to /home/jenkins/.m2/repository/net/ihe/gazelle/tm/services/gazelle-tm-rest-data/1.0.2-SNAPSHOT/gazelle-tm-rest-data-1.0.2-SNAPSHOT.jar
[INFO] Installing /home/jenkins/.hudson/jobs/gazelle-tm-rest-services/workspace/gazelle-tm-rest-data/pom.xml to /home/jenkins/.m2/repository/net/ihe/gazelle/tm/services/gazelle-tm-rest-data/1.0.2-SNAPSHOT/gazelle-tm-rest-data-1.0.2-SNAPSHOT.pom
[INFO] Installing /home/jenkins/.hudson/jobs/gazelle-tm-rest-services/workspace/gazelle-tm-rest-data/target/gazelle-tm-rest-data-sources.jar to /home/jenkins/.m2/repository/net/ihe/gazelle/tm/services/gazelle-tm-rest-data/1.0.2-SNAPSHOT/gazelle-tm-rest-data-1.0.2-SNAPSHOT-sources.jar
[INFO] Installing /home/jenkins/.hudson/jobs/gazelle-tm-rest-services/workspace/gazelle-tm-rest-data/target/gazelle-tm-rest-data-tests.jar to /home/jenkins/.m2/repository/net/ihe/gazelle/tm/services/gazelle-tm-rest-data/1.0.2-SNAPSHOT/gazelle-tm-rest-data-1.0.2-SNAPSHOT-tests.jar
Started calculate disk usage of build
Finished Calculation of disk usage of build in 0 seconds
Started calculate disk usage of workspace
Finished Calculation of disk usage of workspace in 0 seconds
[INFO]                                                                         
[INFO] ------------------------------------------------------------------------
[INFO] Building gazelle-tm-rest-client 1.0.2-SNAPSHOT
[INFO] ------------------------------------------------------------------------
[INFO] Downloading: https://gazelle.ihe.net/nexus/content/groups/public/net/ihe/gazelle/maven/gazelle-seam-tools-jar/3.0.21/gazelle-seam-tools-jar-3.0.21.pom
[INFO] Downloaded: https://gazelle.ihe.net/nexus/content/groups/public/net/ihe/gazelle/maven/gazelle-seam-tools-jar/3.0.21/gazelle-seam-tools-jar-3.0.21.pom (7 KB at 1.1 KB/sec)
[INFO] Downloading: https://gazelle.ihe.net/nexus/content/groups/public/net/ihe/gazelle/maven/gazelle-tools-jar/3.0.21/gazelle-tools-jar-3.0.21.pom
[INFO] Downloaded: https://gazelle.ihe.net/nexus/content/groups/public/net/ihe/gazelle/maven/gazelle-tools-jar/3.0.21/gazelle-tools-jar-3.0.21.pom (2 KB at 0.4 KB/sec)
[INFO] Downloading: https://gazelle.ihe.net/nexus/content/groups/public/net/ihe/gazelle/maven/gazelle-seam-tools-jar/3.0.21/gazelle-seam-tools-jar-3.0.21.jar
[INFO] Downloading: https://gazelle.ihe.net/nexus/content/groups/public/net/ihe/gazelle/maven/gazelle-tools-jar/3.0.21/gazelle-tools-jar-3.0.21.jar
[INFO] Downloaded: https://gazelle.ihe.net/nexus/content/groups/public/net/ihe/gazelle/maven/gazelle-seam-tools-jar/3.0.21/gazelle-seam-tools-jar-3.0.21.jar (223 KB at 34.9 KB/sec)
[INFO] Downloaded: https://gazelle.ihe.net/nexus/content/groups/public/net/ihe/gazelle/maven/gazelle-tools-jar/3.0.21/gazelle-tools-jar-3.0.21.jar (34 KB at 5.0 KB/sec)
[INFO] 
[INFO] --- maven-clean-plugin:2.5:clean (default-clean) @ gazelle-tm-rest-client ---
[INFO] Deleting /home/jenkins/.hudson/jobs/gazelle-tm-rest-services/workspace/gazelle-tm-rest-client/target
[INFO] 
[INFO] --- maven-enforcer-plugin:1.2:enforce (enforce-java-version) @ gazelle-tm-rest-client ---
[INFO] 
[INFO] --- maven-enforcer-plugin:1.2:enforce (enforce-maven-version) @ gazelle-tm-rest-client ---
[INFO] 
[INFO] --- buildnumber-maven-plugin:1.2:create-timestamp (get-build-timestamp) @ gazelle-tm-rest-client ---
[INFO] 
[INFO] --- buildnumber-maven-plugin:1.2:create (get-scm-revision) @ gazelle-tm-rest-client ---
[INFO] 
[INFO] --- maven-buildmetadata-plugin:1.1.0.IHE.3:provide-buildmetadata (default) @ gazelle-tm-rest-client ---
[INFO] Executing: /bin/sh -c cd /home/jenkins/.hudson/jobs/gazelle-tm-rest-services/workspace/gazelle-tm-rest-client && svn --non-interactive log -v -r '{2017-08-09 14:00:43 +0000}:{2017-09-09 14:00:43 +0000}' svn+ssh://scm.gforge.inria.fr/svn/gazelle/Maven/gazelle-tm-rest-services/trunk/gazelle-tm-rest-client
[INFO] Working directory: /home/jenkins/.hudson/jobs/gazelle-tm-rest-services/workspace/gazelle-tm-rest-client
[INFO] Executing: /bin/sh -c cd /home/jenkins/.hudson/jobs/gazelle-tm-rest-services/workspace/gazelle-tm-rest-client && svn --non-interactive log -v -r '{2017-07-10 14:00:43 +0000}:{2017-09-09 14:00:43 +0000}' svn+ssh://scm.gforge.inria.fr/svn/gazelle/Maven/gazelle-tm-rest-services/trunk/gazelle-tm-rest-client
[INFO] Working directory: /home/jenkins/.hudson/jobs/gazelle-tm-rest-services/workspace/gazelle-tm-rest-client
[INFO] Executing: /bin/sh -c cd /home/jenkins/.hudson/jobs/gazelle-tm-rest-services/workspace/gazelle-tm-rest-client && svn --non-interactive log -v -r '{2017-06-10 14:00:44 +0000}:{2017-09-09 14:00:44 +0000}' svn+ssh://scm.gforge.inria.fr/svn/gazelle/Maven/gazelle-tm-rest-services/trunk/gazelle-tm-rest-client
[INFO] Working directory: /home/jenkins/.hudson/jobs/gazelle-tm-rest-services/workspace/gazelle-tm-rest-client
[INFO] Executing: /bin/sh -c cd /home/jenkins/.hudson/jobs/gazelle-tm-rest-services/workspace/gazelle-tm-rest-client && svn --non-interactive log -v -r '{2017-05-11 14:00:44 +0000}:{2017-09-09 14:00:44 +0000}' svn+ssh://scm.gforge.inria.fr/svn/gazelle/Maven/gazelle-tm-rest-services/trunk/gazelle-tm-rest-client
[INFO] Working directory: /home/jenkins/.hudson/jobs/gazelle-tm-rest-services/workspace/gazelle-tm-rest-client
[INFO] Executing: /bin/sh -c cd /home/jenkins/.hudson/jobs/gazelle-tm-rest-services/workspace/gazelle-tm-rest-client && svn --non-interactive log -v -r '{2017-04-11 14:00:44 +0000}:{2017-09-09 14:00:44 +0000}' svn+ssh://scm.gforge.inria.fr/svn/gazelle/Maven/gazelle-tm-rest-services/trunk/gazelle-tm-rest-client
[INFO] Working directory: /home/jenkins/.hudson/jobs/gazelle-tm-rest-services/workspace/gazelle-tm-rest-client
[INFO] Executing: /bin/sh -c cd /home/jenkins/.hudson/jobs/gazelle-tm-rest-services/workspace/gazelle-tm-rest-client && svn --non-interactive log -v -r '{2017-03-12 14:00:45 +0000}:{2017-09-09 14:00:45 +0000}' svn+ssh://scm.gforge.inria.fr/svn/gazelle/Maven/gazelle-tm-rest-services/trunk/gazelle-tm-rest-client
[INFO] Working directory: /home/jenkins/.hudson/jobs/gazelle-tm-rest-services/workspace/gazelle-tm-rest-client
[INFO] Writing properties '/home/jenkins/.hudson/jobs/gazelle-tm-rest-services/workspace/gazelle-tm-rest-client/target/classes/META-INF/build.properties'...
[INFO] Writing XML report '/home/jenkins/.hudson/jobs/gazelle-tm-rest-services/workspace/gazelle-tm-rest-client/target/buildmetadata.xml'...
[INFO] 
[INFO] --- maven-resources-plugin:2.7:resources (default-resources) @ gazelle-tm-rest-client ---
[INFO] Using 'UTF-8' encoding to copy filtered resources.
[INFO] skip non existing resourceDirectory /home/jenkins/.hudson/jobs/gazelle-tm-rest-services/workspace/gazelle-tm-rest-client/src/main/resources
[INFO] 
[INFO] --- maven-compiler-plugin:3.5.1:compile (default-compile) @ gazelle-tm-rest-client ---
[INFO] Changes detected - recompiling the module!
[INFO] Compiling 15 source files to /home/jenkins/.hudson/jobs/gazelle-tm-rest-services/workspace/gazelle-tm-rest-client/target/classes
[WARNING] bootstrap class path not set in conjunction with -source 1.6
[WARNING] No SupportedSourceVersion annotation found on net.ihe.gazelle.common.interfacegenerator.InterfaceGeneratorProcessor, returning RELEASE_6.
[INFO] Hibernate JPA 2 Static-Metamodel Generator [WORKING]
[INFO] 
[INFO] --- maven-resources-plugin:2.7:testResources (default-testResources) @ gazelle-tm-rest-client ---
[INFO] Using 'UTF-8' encoding to copy filtered resources.
[INFO] Copying 1 resource
[INFO] 
[INFO] --- maven-compiler-plugin:3.5.1:testCompile (default-testCompile) @ gazelle-tm-rest-client ---
[INFO] Changes detected - recompiling the module!
[INFO] Compiling 1 source file to /home/jenkins/.hudson/jobs/gazelle-tm-rest-services/workspace/gazelle-tm-rest-client/target/test-classes
[WARNING] bootstrap class path not set in conjunction with -source 1.6
[WARNING] No SupportedSourceVersion annotation found on net.ihe.gazelle.common.interfacegenerator.InterfaceGeneratorProcessor, returning RELEASE_6.
[INFO] Hibernate JPA 2 Static-Metamodel Generator [WORKING]
[INFO] 
[INFO] --- maven-surefire-plugin:2.19.1:test (default-test) @ gazelle-tm-rest-client ---

-------------------------------------------------------
 T E S T S
-------------------------------------------------------
Running net.ihe.gazelle.tm.ws.client.wsClientTest
Tests run: 20, Failures: 0, Errors: 20, Skipped: 0, Time elapsed: 0.157 sec <<< FAILURE! - in net.ihe.gazelle.tm.ws.client.wsClientTest
getATest(net.ihe.gazelle.tm.ws.client.wsClientTest)  Time elapsed: 0.017 sec  <<< ERROR!
java.lang.NoClassDefFoundError: org/apache/http/client/methods/HttpRequestBase
	at net.ihe.gazelle.tm.ws.client.wsClientTest.getATest(wsClientTest.java:28)
Caused by: java.lang.ClassNotFoundException: org.apache.http.client.methods.HttpRequestBase
	at net.ihe.gazelle.tm.ws.client.wsClientTest.getATest(wsClientTest.java:28)

getTestTypes(net.ihe.gazelle.tm.ws.client.wsClientTest)  Time elapsed: 0.001 sec  <<< ERROR!
java.lang.NoClassDefFoundError: org/apache/http/client/methods/HttpRequestBase
	at net.ihe.gazelle.tm.ws.client.wsClientTest.getTestTypes(wsClientTest.java:34)
Caused by: java.lang.ClassNotFoundException: org.apache.http.client.methods.HttpRequestBase
	at net.ihe.gazelle.tm.ws.client.wsClientTest.getTestTypes(wsClientTest.java:34)

getTestStep(net.ihe.gazelle.tm.ws.client.wsClientTest)  Time elapsed: 0.001 sec  <<< ERROR!
java.lang.NoClassDefFoundError: org/apache/http/client/methods/HttpRequestBase
	at net.ihe.gazelle.tm.ws.client.wsClientTest.getTestStep(wsClientTest.java:64)
Caused by: java.lang.ClassNotFoundException: org.apache.http.client.methods.HttpRequestBase
	at net.ihe.gazelle.tm.ws.client.wsClientTest.getTestStep(wsClientTest.java:64)

getIntegrationProfilesWithoutAnswer(net.ihe.gazelle.tm.ws.client.wsClientTest)  Time elapsed: 0.001 sec  <<< ERROR!
java.lang.NoClassDefFoundError: org/apache/http/client/methods/HttpRequestBase
	at net.ihe.gazelle.tm.ws.client.wsClientTest.getIntegrationProfilesWithoutAnswer(wsClientTest.java:46)
Caused by: java.lang.ClassNotFoundException: org.apache.http.client.methods.HttpRequestBase
	at net.ihe.gazelle.tm.ws.client.wsClientTest.getIntegrationProfilesWithoutAnswer(wsClientTest.java:46)

getIntegrationProfilesWithAnswer(net.ihe.gazelle.tm.ws.client.wsClientTest)  Time elapsed: 0.001 sec  <<< ERROR!
java.lang.NoClassDefFoundError: org/apache/http/client/methods/HttpRequestBase
	at net.ihe.gazelle.tm.ws.client.wsClientTest.getIntegrationProfilesWithAnswer(wsClientTest.java:76)
Caused by: java.lang.ClassNotFoundException: org.apache.http.client.methods.HttpRequestBase
	at net.ihe.gazelle.tm.ws.client.wsClientTest.getIntegrationProfilesWithAnswer(wsClientTest.java:76)

getTestForIntegrationProfileWithAnswer(net.ihe.gazelle.tm.ws.client.wsClientTest)  Time elapsed: 0.001 sec  <<< ERROR!
java.lang.NoClassDefFoundError: org/apache/http/client/methods/HttpRequestBase
	at net.ihe.gazelle.tm.ws.client.wsClientTest.getTestForIntegrationProfileWithAnswer(wsClientTest.java:82)
Caused by: java.lang.ClassNotFoundException: org.apache.http.client.methods.HttpRequestBase
	at net.ihe.gazelle.tm.ws.client.wsClientTest.getTestForIntegrationProfileWithAnswer(wsClientTest.java:82)

getTestForIntegrationProfileWithoutAnswer(net.ihe.gazelle.tm.ws.client.wsClientTest)  Time elapsed: 0.001 sec  <<< ERROR!
java.lang.NoClassDefFoundError: org/apache/http/client/methods/HttpRequestBase
	at net.ihe.gazelle.tm.ws.client.wsClientTest.getTestForIntegrationProfileWithoutAnswer(wsClientTest.java:52)
Caused by: java.lang.ClassNotFoundException: org.apache.http.client.methods.HttpRequestBase
	at net.ihe.gazelle.tm.ws.client.wsClientTest.getTestForIntegrationProfileWithoutAnswer(wsClientTest.java:52)

getTestSteps(net.ihe.gazelle.tm.ws.client.wsClientTest)  Time elapsed: 0.124 sec  <<< ERROR!
java.lang.NoClassDefFoundError: org/apache/http/client/methods/HttpRequestBase
	at net.ihe.gazelle.tm.ws.client.wsClientTest.getTestSteps(wsClientTest.java:89)
Caused by: java.lang.ClassNotFoundException: org.apache.http.client.methods.HttpRequestBase
	at net.ihe.gazelle.tm.ws.client.wsClientTest.getTestSteps(wsClientTest.java:89)

getTestsWithoutAnswer(net.ihe.gazelle.tm.ws.client.wsClientTest)  Time elapsed: 0.001 sec  <<< ERROR!
java.lang.NoClassDefFoundError: org/apache/http/client/methods/HttpRequestBase
	at net.ihe.gazelle.tm.ws.client.wsClientTest.getTestsWithoutAnswer(wsClientTest.java:22)
Caused by: java.lang.ClassNotFoundException: org.apache.http.client.methods.HttpRequestBase
	at net.ihe.gazelle.tm.ws.client.wsClientTest.getTestsWithoutAnswer(wsClientTest.java:22)

getTestsWithAnswer(net.ihe.gazelle.tm.ws.client.wsClientTest)  Time elapsed: 0.001 sec  <<< ERROR!
java.lang.NoClassDefFoundError: org/apache/http/client/methods/HttpRequestBase
	at net.ihe.gazelle.tm.ws.client.wsClientTest.getTestsWithAnswer(wsClientTest.java:58)
Caused by: java.lang.ClassNotFoundException: org.apache.http.client.methods.HttpRequestBase
	at net.ihe.gazelle.tm.ws.client.wsClientTest.getTestsWithAnswer(wsClientTest.java:58)

getTestDescription(net.ihe.gazelle.tm.ws.client.wsClientTest)  Time elapsed: 0.001 sec  <<< ERROR!
java.lang.NoClassDefFoundError: org/apache/http/client/methods/HttpRequestBase
	at net.ihe.gazelle.tm.ws.client.wsClientTest.getTestDescription(wsClientTest.java:70)
Caused by: java.lang.ClassNotFoundException: org.apache.http.client.methods.HttpRequestBase
	at net.ihe.gazelle.tm.ws.client.wsClientTest.getTestDescription(wsClientTest.java:70)

getRules(net.ihe.gazelle.tm.ws.client.wsClientTest)  Time elapsed: 0.001 sec  <<< ERROR!
java.lang.NoClassDefFoundError: org/apache/http/client/methods/HttpRequestBase
	at net.ihe.gazelle.tm.ws.client.wsClientTest.getRules(wsClientTest.java:97)
Caused by: java.lang.ClassNotFoundException: org.apache.http.client.methods.HttpRequestBase
	at net.ihe.gazelle.tm.ws.client.wsClientTest.getRules(wsClientTest.java:97)

getIntegrationProfileRules(net.ihe.gazelle.tm.ws.client.wsClientTest)  Time elapsed: 0.001 sec  <<< ERROR!
java.lang.NoClassDefFoundError: org/apache/http/client/methods/HttpRequestBase
	at net.ihe.gazelle.tm.ws.client.wsClientTest.getIntegrationProfileRules(wsClientTest.java:103)
Caused by: java.lang.ClassNotFoundException: org.apache.http.client.methods.HttpRequestBase
	at net.ihe.gazelle.tm.ws.client.wsClientTest.getIntegrationProfileRules(wsClientTest.java:103)

getintegrationProfilesWithRules(net.ihe.gazelle.tm.ws.client.wsClientTest)  Time elapsed: 0 sec  <<< ERROR!
java.lang.NoClassDefFoundError: org/apache/http/client/methods/HttpRequestBase
	at net.ihe.gazelle.tm.ws.client.wsClientTest.getintegrationProfilesWithRules(wsClientTest.java:109)
Caused by: java.lang.ClassNotFoundException: org.apache.http.client.methods.HttpRequestBase
	at net.ihe.gazelle.tm.ws.client.wsClientTest.getintegrationProfilesWithRules(wsClientTest.java:109)

getintegrationProfilesWithRulesByDomain(net.ihe.gazelle.tm.ws.client.wsClientTest)  Time elapsed: 0 sec  <<< ERROR!
java.lang.NoClassDefFoundError: org/apache/http/client/methods/HttpRequestBase
	at net.ihe.gazelle.tm.ws.client.wsClientTest.getintegrationProfilesWithRulesByDomain(wsClientTest.java:115)
Caused by: java.lang.ClassNotFoundException: org.apache.http.client.methods.HttpRequestBase
	at net.ihe.gazelle.tm.ws.client.wsClientTest.getintegrationProfilesWithRulesByDomain(wsClientTest.java:115)

getintegrationProfilesWithTests(net.ihe.gazelle.tm.ws.client.wsClientTest)  Time elapsed: 0.001 sec  <<< ERROR!
java.lang.NoClassDefFoundError: org/apache/http/client/methods/HttpRequestBase
	at net.ihe.gazelle.tm.ws.client.wsClientTest.getintegrationProfilesWithTests(wsClientTest.java:121)
Caused by: java.lang.ClassNotFoundException: org.apache.http.client.methods.HttpRequestBase
	at net.ihe.gazelle.tm.ws.client.wsClientTest.getintegrationProfilesWithTests(wsClientTest.java:121)

getintegrationProfilesWithTestsByDomain(net.ihe.gazelle.tm.ws.client.wsClientTest)  Time elapsed: 0.001 sec  <<< ERROR!
java.lang.NoClassDefFoundError: org/apache/http/client/methods/HttpRequestBase
	at net.ihe.gazelle.tm.ws.client.wsClientTest.getintegrationProfilesWithTestsByDomain(wsClientTest.java:127)
Caused by: java.lang.ClassNotFoundException: org.apache.http.client.methods.HttpRequestBase
	at net.ihe.gazelle.tm.ws.client.wsClientTest.getintegrationProfilesWithTestsByDomain(wsClientTest.java:127)

getRuleById(net.ihe.gazelle.tm.ws.client.wsClientTest)  Time elapsed: 0.001 sec  <<< ERROR!
java.lang.NoClassDefFoundError: org/apache/http/client/methods/HttpRequestBase
	at net.ihe.gazelle.tm.ws.client.wsClientTest.getRuleById(wsClientTest.java:133)
Caused by: java.lang.ClassNotFoundException: org.apache.http.client.methods.HttpRequestBase
	at net.ihe.gazelle.tm.ws.client.wsClientTest.getRuleById(wsClientTest.java:133)

getActors(net.ihe.gazelle.tm.ws.client.wsClientTest)  Time elapsed: 0 sec  <<< ERROR!
java.lang.NoClassDefFoundError: org/apache/http/client/methods/HttpRequestBase
	at net.ihe.gazelle.tm.ws.client.wsClientTest.getActors(wsClientTest.java:139)
Caused by: java.lang.ClassNotFoundException: org.apache.http.client.methods.HttpRequestBase
	at net.ihe.gazelle.tm.ws.client.wsClientTest.getActors(wsClientTest.java:139)

getTestsWithWrongResourcePath(net.ihe.gazelle.tm.ws.client.wsClientTest)  Time elapsed: 0 sec  <<< ERROR!
java.lang.NoClassDefFoundError: org/apache/http/client/methods/HttpRequestBase
	at net.ihe.gazelle.tm.ws.client.wsClientTest.getTestsWithWrongResourcePath(wsClientTest.java:40)
Caused by: java.lang.ClassNotFoundException: org.apache.http.client.methods.HttpRequestBase
	at net.ihe.gazelle.tm.ws.client.wsClientTest.getTestsWithWrongResourcePath(wsClientTest.java:40)


Results :

Tests in error: 
  wsClientTest.getATest:28 » NoClassDefFound org/apache/http/client/methods/Http...
  wsClientTest.getActors:139 » NoClassDefFound org/apache/http/client/methods/Ht...
  wsClientTest.getIntegrationProfileRules:103 » NoClassDefFound org/apache/http/...
  wsClientTest.getIntegrationProfilesWithAnswer:76 » NoClassDefFound org/apache/...
  wsClientTest.getIntegrationProfilesWithoutAnswer:46 » NoClassDefFound org/apac...
  wsClientTest.getRuleById:133 » NoClassDefFound org/apache/http/client/methods/...
  wsClientTest.getRules:97 » NoClassDefFound org/apache/http/client/methods/Http...
  wsClientTest.getTestDescription:70 » NoClassDefFound org/apache/http/client/me...
  wsClientTest.getTestForIntegrationProfileWithAnswer:82 » NoClassDefFound org/a...
  wsClientTest.getTestForIntegrationProfileWithoutAnswer:52 » NoClassDefFound or...
  wsClientTest.getTestStep:64 » NoClassDefFound org/apache/http/client/methods/H...
  wsClientTest.getTestSteps:89 » NoClassDefFound org/apache/http/client/methods/...
  wsClientTest.getTestTypes:34 » NoClassDefFound org/apache/http/client/methods/...
  wsClientTest.getTestsWithAnswer:58 » NoClassDefFound org/apache/http/client/me...
  wsClientTest.getTestsWithWrongResourcePath:40 » NoClassDefFound org/apache/htt...
  wsClientTest.getTestsWithoutAnswer:22 » NoClassDefFound org/apache/http/client...
  wsClientTest.getintegrationProfilesWithRules:109 » NoClassDefFound org/apache/...
  wsClientTest.getintegrationProfilesWithRulesByDomain:115 » NoClassDefFound org...
  wsClientTest.getintegrationProfilesWithTests:121 » NoClassDefFound org/apache/...
  wsClientTest.getintegrationProfilesWithTestsByDomain:127 » NoClassDefFound org...

Tests run: 20, Failures: 0, Errors: 20, Skipped: 0

[ERROR] There are test failures.

Please refer to /home/jenkins/.hudson/jobs/gazelle-tm-rest-services/workspace/gazelle-tm-rest-client/target/surefire-reports for the individual test results.
[JENKINS] Recording test results
[INFO] 
[INFO] --- maven-jar-plugin:2.6:jar (default-jar) @ gazelle-tm-rest-client ---
[INFO] Building jar: /home/jenkins/.hudson/jobs/gazelle-tm-rest-services/workspace/gazelle-tm-rest-client/target/gazelle-tm-rest-client.jar
[INFO] 
[INFO] --- maven-source-plugin:2.2.1:jar-no-fork (attach-sources) @ gazelle-tm-rest-client ---
[INFO] Building jar: /home/jenkins/.hudson/jobs/gazelle-tm-rest-services/workspace/gazelle-tm-rest-client/target/gazelle-tm-rest-client-sources.jar
[INFO] 
[INFO] --- maven-jar-plugin:2.6:test-jar (default) @ gazelle-tm-rest-client ---
[INFO] Building jar: /home/jenkins/.hudson/jobs/gazelle-tm-rest-services/workspace/gazelle-tm-rest-client/target/gazelle-tm-rest-client-tests.jar
[INFO] 
[INFO] --- maven-install-plugin:2.4:install (default-install) @ gazelle-tm-rest-client ---
[INFO] Installing /home/jenkins/.hudson/jobs/gazelle-tm-rest-services/workspace/gazelle-tm-rest-client/target/gazelle-tm-rest-client.jar to /home/jenkins/.m2/repository/net/ihe/gazelle/tm/services/gazelle-tm-rest-client/1.0.2-SNAPSHOT/gazelle-tm-rest-client-1.0.2-SNAPSHOT.jar
[INFO] Installing /home/jenkins/.hudson/jobs/gazelle-tm-rest-services/workspace/gazelle-tm-rest-client/pom.xml to /home/jenkins/.m2/repository/net/ihe/gazelle/tm/services/gazelle-tm-rest-client/1.0.2-SNAPSHOT/gazelle-tm-rest-client-1.0.2-SNAPSHOT.pom
[INFO] Installing /home/jenkins/.hudson/jobs/gazelle-tm-rest-services/workspace/gazelle-tm-rest-client/target/gazelle-tm-rest-client-sources.jar to /home/jenkins/.m2/repository/net/ihe/gazelle/tm/services/gazelle-tm-rest-client/1.0.2-SNAPSHOT/gazelle-tm-rest-client-1.0.2-SNAPSHOT-sources.jar
[INFO] Installing /home/jenkins/.hudson/jobs/gazelle-tm-rest-services/workspace/gazelle-tm-rest-client/target/gazelle-tm-rest-client-tests.jar to /home/jenkins/.m2/repository/net/ihe/gazelle/tm/services/gazelle-tm-rest-client/1.0.2-SNAPSHOT/gazelle-tm-rest-client-1.0.2-SNAPSHOT-tests.jar
[BFA] Scanning build for known causes...
[BFA] No failure causes found
[BFA] Done. 0s
Started calculate disk usage of build
Finished Calculation of disk usage of build in 0 seconds
Started calculate disk usage of workspace
Finished Calculation of disk usage of workspace in 0 seconds
[INFO]                                                                         
[INFO] ------------------------------------------------------------------------
[INFO] Building gazelle-tm-rest-serices 1.0.2-SNAPSHOT
[INFO] ------------------------------------------------------------------------
[INFO] 
[INFO] --- sonar-maven-plugin:3.3.0.603:sonar (default-cli) @ gazelle-tm-rest-services ---
[INFO] User cache: /home/jenkins/.sonar/cache
[INFO] Load global settings
[INFO] Load global settings (done) | time=122ms
[INFO] Server id: 1e5f71089284882
[INFO] User cache: /home/jenkins/.sonar/cache
[INFO] Load plugins index
[INFO] Load plugins index (done) | time=13ms
[INFO] Plugin [l10nes] defines 'l10nen' as base plugin. This metadata can be removed from manifest of l10n plugins since version 5.2.
[INFO] Plugin [l10nja] defines 'l10nen' as base plugin. This metadata can be removed from manifest of l10n plugins since version 5.2.
[INFO] Plugin [l10nde] defines 'l10nen' as base plugin. This metadata can be removed from manifest of l10n plugins since version 5.2.
[INFO] Plugin [l10nko] defines 'l10nen' as base plugin. This metadata can be removed from manifest of l10n plugins since version 5.2.
[INFO] Plugin [l10nfr] defines 'l10nen' as base plugin. This metadata can be removed from manifest of l10n plugins since version 5.2.
[INFO] Plugin [l10nit] defines 'l10nen' as base plugin. This metadata can be removed from manifest of l10n plugins since version 5.2.
[INFO] Plugin [l10nel] defines 'l10nen' as base plugin. This metadata can be removed from manifest of l10n plugins since version 5.2.
[INFO] SonarQube version: 6.5.0
[INFO] Default locale: "en_GB", source code encoding: "UTF-8"
[INFO] Process project properties
[INFO] Load project repositories
[INFO] Load project repositories (done) | time=69ms
[INFO] Load quality profiles
[INFO] Load quality profiles (done) | time=21ms
[INFO] Load active rules
[INFO] Load active rules (done) | time=339ms
[INFO] Load metrics repository
[INFO] Load metrics repository (done) | time=62ms
[INFO] Publish mode
[INFO] Project key: net.ihe.gazelle.tm.services:gazelle-tm-rest-services
[INFO] -------------  Scan gazelle-tm-rest-data
[INFO] Load server rules
[INFO] Load server rules (done) | time=46ms
[INFO] Base dir: /home/jenkins/.hudson/jobs/gazelle-tm-rest-services/workspace/gazelle-tm-rest-data
[INFO] Working dir: /home/jenkins/.hudson/jobs/gazelle-tm-rest-services/workspace/gazelle-tm-rest-data/target/sonar
[INFO] Source paths: pom.xml, src/main/java
[INFO] Test paths: src/test/java
[INFO] Source encoding: UTF-8, default locale: en_GB
[INFO] Index files
[INFO] 36 files indexed
[INFO] Quality profile for java: Sonar way with Findbugs
[INFO] Quality profile for xml: Sonar way (outdated copy)
[WARNING] ----------------------------------------------------------------
[WARNING] Sonargraph Integration: Skipping project gazelle-tm-rest-data [net.ihe.gazelle.tm.services:gazelle-tm-rest-data], since no Sonargraph rules are activated in current SonarQube quality profile [SonarQube].
[WARNING] ----------------------------------------------------------------
[INFO] Sensor JavaSquidSensor [java]
[INFO] Configured Java source version (sonar.java.source): 7
[INFO] JavaClasspath initialization
[WARNING] Bytecode of dependencies was not provided for analysis of source files, you might end up with less precise results. Bytecode can be provided using sonar.java.libraries property
[INFO] JavaClasspath initialization (done) | time=8ms
[INFO] JavaTestClasspath initialization
[INFO] JavaTestClasspath initialization (done) | time=0ms
[INFO] Java Main Files AST scan
[INFO] 33 source files to be analyzed
[INFO] Java Main Files AST scan (done) | time=2149ms
[INFO] 33/33 source files have been analyzed
[INFO] Java Test Files AST scan
[INFO] 2 source files to be analyzed
[INFO] Java Test Files AST scan (done) | time=36ms
[INFO] Sensor JavaSquidSensor [java] (done) | time=2578ms
[INFO] Sensor PmdSensor [pmd]
[INFO] 2/2 source files have been analyzed
[INFO] Execute PMD 5.4.2...
[INFO] Java version: 1.7
[INFO] PMD configuration: /home/jenkins/.hudson/jobs/gazelle-tm-rest-services/workspace/gazelle-tm-rest-data/target/sonar/pmd.xml
[INFO] PMD configuration: /home/jenkins/.hudson/jobs/gazelle-tm-rest-services/workspace/gazelle-tm-rest-data/target/sonar/pmd-unit-tests.xml
[INFO] Execute PMD 5.4.2 done: 542 ms
[INFO] Sensor PmdSensor [pmd] (done) | time=544ms
[INFO] Sensor Sonar-Sonargraph-Plugin [3.5] [Sonargraph]
[INFO] ----------------------------------------------------------------
[INFO] Sonargraph: Skipping project gazelle-tm-rest-data [net.ihe.gazelle.tm.services:gazelle-tm-rest-data], since no Sonargraph rules are activated in current SonarQube quality profile.
[INFO] ----------------------------------------------------------------
[INFO] Sensor Sonar-Sonargraph-Plugin [3.5] [Sonargraph] (done) | time=2ms
[INFO] Sensor FindBugs Sensor [findbugs]
[INFO] Loading findbugs plugin: /home/jenkins/.hudson/jobs/gazelle-tm-rest-services/workspace/gazelle-tm-rest-data/target/sonar/findbugs/fb-contrib.jar
[INFO] Loading findbugs plugin: /home/jenkins/.hudson/jobs/gazelle-tm-rest-services/workspace/gazelle-tm-rest-data/target/sonar/findbugs/findsecbugs-plugin.jar
[INFO] Findbugs output report: /home/jenkins/.hudson/jobs/gazelle-tm-rest-services/workspace/gazelle-tm-rest-data/target/sonar/findbugs-result.xml
[INFO] Sensor FindBugs Sensor [findbugs] (done) | time=3921ms
[INFO] Sensor SurefireSensor [java]
[INFO] Property 'sonar.junit.reportsPath' is deprecated. Use property 'sonar.junit.reportPaths' instead.
[INFO] parsing [/home/jenkins/.hudson/jobs/gazelle-tm-rest-services/workspace/gazelle-tm-rest-data/target/surefire-reports]
[INFO] Sensor SurefireSensor [java] (done) | time=85ms
[INFO] Sensor JaCoCoSensor [java]
[INFO] Sensor JaCoCoSensor [java] (done) | time=1ms
[INFO] Sensor SonarJavaXmlFileSensor [java]
[INFO] 1 source files to be analyzed
[INFO] Sensor SonarJavaXmlFileSensor [java] (done) | time=164ms
[INFO] 1/1 source files have been analyzed
[INFO] Sensor XML Sensor [xml]
[INFO] Sensor XML Sensor [xml] (done) | time=79ms
[INFO] SCM Publisher is disabled
[INFO] -------------  Scan gazelle-tm-rest-client
[INFO] Base dir: /home/jenkins/.hudson/jobs/gazelle-tm-rest-services/workspace/gazelle-tm-rest-client
[INFO] Working dir: /home/jenkins/.hudson/jobs/gazelle-tm-rest-services/workspace/gazelle-tm-rest-client/target/sonar
[INFO] Source paths: pom.xml, src/main/java
[INFO] Test paths: src/test/java
[INFO] Source encoding: UTF-8, default locale: en_GB
[INFO] Index files
[INFO] 17 files indexed
[INFO] Quality profile for java: Sonar way with Findbugs
[INFO] Quality profile for xml: Sonar way (outdated copy)
[WARNING] ----------------------------------------------------------------
[WARNING] Sonargraph Integration: Skipping project gazelle-tm-rest-client [net.ihe.gazelle.tm.services:gazelle-tm-rest-client], since no Sonargraph rules are activated in current SonarQube quality profile [SonarQube].
[WARNING] ----------------------------------------------------------------
[INFO] Sensor JavaSquidSensor [java]
[INFO] Configured Java source version (sonar.java.source): 7
[INFO] JavaClasspath initialization
[INFO] JavaClasspath initialization (done) | time=1ms
[INFO] JavaTestClasspath initialization
[INFO] JavaTestClasspath initialization (done) | time=1ms
[INFO] Java Main Files AST scan
[INFO] 15 source files to be analyzed
[INFO] 15/15 source files have been analyzed
[WARNING] Classes not found during the analysis : [org.slf4j.impl.StaticLoggerBinder]
[INFO] Java Main Files AST scan (done) | time=468ms
[INFO] Java Test Files AST scan
[INFO] 1 source files to be analyzed
[INFO] 1/1 source files have been analyzed
[INFO] Java Test Files AST scan (done) | time=27ms
[INFO] Sensor JavaSquidSensor [java] (done) | time=512ms
[INFO] Sensor PmdSensor [pmd]
[INFO] Execute PMD 5.4.2...
[INFO] Java version: 1.7
[INFO] PMD configuration: /home/jenkins/.hudson/jobs/gazelle-tm-rest-services/workspace/gazelle-tm-rest-client/target/sonar/pmd.xml
[INFO] PMD configuration: /home/jenkins/.hudson/jobs/gazelle-tm-rest-services/workspace/gazelle-tm-rest-client/target/sonar/pmd-unit-tests.xml
[INFO] Execute PMD 5.4.2 done: 150 ms
[INFO] Sensor PmdSensor [pmd] (done) | time=150ms
[INFO] Sensor Sonar-Sonargraph-Plugin [3.5] [Sonargraph]
[INFO] ----------------------------------------------------------------
[INFO] Sonargraph: Skipping project gazelle-tm-rest-client [net.ihe.gazelle.tm.services:gazelle-tm-rest-client], since no Sonargraph rules are activated in current SonarQube quality profile.
[INFO] ----------------------------------------------------------------
[INFO] Sensor Sonar-Sonargraph-Plugin [3.5] [Sonargraph] (done) | time=0ms
[INFO] Sensor FindBugs Sensor [findbugs]
[INFO] Loading findbugs plugin: /home/jenkins/.hudson/jobs/gazelle-tm-rest-services/workspace/gazelle-tm-rest-client/target/sonar/findbugs/fb-contrib.jar
[INFO] Loading findbugs plugin: /home/jenkins/.hudson/jobs/gazelle-tm-rest-services/workspace/gazelle-tm-rest-client/target/sonar/findbugs/findsecbugs-plugin.jar
[INFO] Findbugs output report: /home/jenkins/.hudson/jobs/gazelle-tm-rest-services/workspace/gazelle-tm-rest-client/target/sonar/findbugs-result.xml
The following classes needed for analysis were missing:
  org.slf4j.impl.StaticLoggerBinder
[INFO] Sensor FindBugs Sensor [findbugs] (done) | time=1631ms
[INFO] Sensor SurefireSensor [java]
[INFO] Property 'sonar.junit.reportsPath' is deprecated. Use property 'sonar.junit.reportPaths' instead.
[INFO] parsing [/home/jenkins/.hudson/jobs/gazelle-tm-rest-services/workspace/gazelle-tm-rest-client/target/surefire-reports]
[INFO] Sensor SurefireSensor [java] (done) | time=4ms
[INFO] Sensor JaCoCoSensor [java]
[INFO] Sensor JaCoCoSensor [java] (done) | time=1ms
[INFO] Sensor SonarJavaXmlFileSensor [java]
[INFO] 1 source files to be analyzed
[INFO] Sensor SonarJavaXmlFileSensor [java] (done) | time=58ms
[INFO] 1/1 source files have been analyzed
[INFO] Sensor XML Sensor [xml]
[INFO] Sensor XML Sensor [xml] (done) | time=12ms
[INFO] SCM Publisher is disabled
[INFO] -------------  Scan gazelle-tm-rest-serices
[INFO] Base dir: /home/jenkins/.hudson/jobs/gazelle-tm-rest-services/workspace
[INFO] Working dir: /home/jenkins/.hudson/jobs/gazelle-tm-rest-services/workspace/target/sonar
[INFO] Source paths: pom.xml
[INFO] Source encoding: UTF-8, default locale: en_GB
[INFO] Index files
[INFO] 1 file indexed
[INFO] Quality profile for xml: Sonar way (outdated copy)
[WARNING] ----------------------------------------------------------------
[WARNING] Sonargraph Integration: Skipping project gazelle-tm-rest-serices [net.ihe.gazelle.tm.services:gazelle-tm-rest-services], since no Sonargraph rules are activated in current SonarQube quality profile [SonarQube].
[WARNING] ----------------------------------------------------------------
[WARNING] ----------------------------------------------------------------
[WARNING] Sonargraph Integration: Skipping project gazelle-tm-rest-serices [net.ihe.gazelle.tm.services:gazelle-tm-rest-services], since no Sonargraph rules are activated in current SonarQube quality profile [SonarQube].
[WARNING] ----------------------------------------------------------------
[INFO] Sensor Sonar-Sonargraph-Plugin [3.5] [Sonargraph]
[INFO] ----------------------------------------------------------------
[INFO] Sonargraph: Skipping project gazelle-tm-rest-serices [net.ihe.gazelle.tm.services:gazelle-tm-rest-services], since no Sonargraph rules are activated in current SonarQube quality profile.
[INFO] ----------------------------------------------------------------
[INFO] Sensor Sonar-Sonargraph-Plugin [3.5] [Sonargraph] (done) | time=0ms
[INFO] Sensor SonarJavaXmlFileSensor [java]
[INFO] 1 source files to be analyzed
[INFO] Sensor SonarJavaXmlFileSensor [java] (done) | time=48ms
[INFO] 1/1 source files have been analyzed
[INFO] Sensor XML Sensor [xml]
[INFO] Sensor XML Sensor [xml] (done) | time=9ms
[INFO] Sensor Zero Coverage Sensor
[INFO] Sensor Zero Coverage Sensor (done) | time=47ms
[INFO] Sensor CPD Block Indexer
[INFO] Sensor CPD Block Indexer (done) | time=49ms
[INFO] SCM Publisher is disabled
[INFO] 12 files had no CPD blocks
[INFO] Calculating CPD for 36 files
[INFO] CPD calculation finished
[INFO] Analysis report generated in 121ms, dir size=261 KB
[INFO] Analysis reports compressed in 74ms, zip size=140 KB
[INFO] Analysis report uploaded in 42ms
[INFO] ANALYSIS SUCCESSFUL, you can browse https://gazelle.ihe.net/sonar/dashboard/index/net.ihe.gazelle.tm.services:gazelle-tm-rest-services
[INFO] Note that you will be able to access the updated dashboard once the server has processed the submitted analysis report
[INFO] More about the report processing at https://gazelle.ihe.net/sonar/api/ce/task?id=AV5hyzjhRMpl2pUuF5v1
[INFO] Task total time: 12.462 s
Started calculate disk usage of build
Finished Calculation of disk usage of build in 0 seconds
Started calculate disk usage of workspace
Finished Calculation of disk usage of workspace in 0 seconds
[INFO] ------------------------------------------------------------------------
[INFO] Reactor Summary:
[INFO] 
[INFO] gazelle-tm-rest-serices ............................ SUCCESS [ 14.112 s]
[INFO] gazelle-tm-rest-data ............................... SUCCESS [  5.303 s]
[INFO] gazelle-tm-rest-client ............................. SUCCESS [ 22.093 s]
[INFO] ------------------------------------------------------------------------
[INFO] BUILD SUCCESS
[INFO] ------------------------------------------------------------------------
[INFO] Total time: 51.332 s
[INFO] Finished at: 2017-09-08T16:01:02+02:00
[INFO] Final Memory: 61M/1438M
[INFO] ------------------------------------------------------------------------
[JENKINS] Archiving /home/jenkins/.hudson/jobs/gazelle-tm-rest-services/workspace/gazelle-tm-rest-data/pom.xml to net.ihe.gazelle.tm.services/gazelle-tm-rest-data/1.0.2-SNAPSHOT/gazelle-tm-rest-data-1.0.2-SNAPSHOT.pom
[JENKINS] Archiving /home/jenkins/.hudson/jobs/gazelle-tm-rest-services/workspace/gazelle-tm-rest-data/target/gazelle-tm-rest-data.jar to net.ihe.gazelle.tm.services/gazelle-tm-rest-data/1.0.2-SNAPSHOT/gazelle-tm-rest-data-1.0.2-SNAPSHOT.jar
[JENKINS] Archiving /home/jenkins/.hudson/jobs/gazelle-tm-rest-services/workspace/gazelle-tm-rest-data/target/gazelle-tm-rest-data-sources.jar to net.ihe.gazelle.tm.services/gazelle-tm-rest-data/1.0.2-SNAPSHOT/gazelle-tm-rest-data-1.0.2-SNAPSHOT-sources.jar
[JENKINS] Archiving /home/jenkins/.hudson/jobs/gazelle-tm-rest-services/workspace/gazelle-tm-rest-data/target/gazelle-tm-rest-data-tests.jar to net.ihe.gazelle.tm.services/gazelle-tm-rest-data/1.0.2-SNAPSHOT/gazelle-tm-rest-data-1.0.2-SNAPSHOT-tests.jar
[JENKINS] Archiving /home/jenkins/.hudson/jobs/gazelle-tm-rest-services/workspace/gazelle-tm-rest-client/pom.xml to net.ihe.gazelle.tm.services/gazelle-tm-rest-client/1.0.2-SNAPSHOT/gazelle-tm-rest-client-1.0.2-SNAPSHOT.pom
[JENKINS] Archiving /home/jenkins/.hudson/jobs/gazelle-tm-rest-services/workspace/gazelle-tm-rest-client/target/gazelle-tm-rest-client.jar to net.ihe.gazelle.tm.services/gazelle-tm-rest-client/1.0.2-SNAPSHOT/gazelle-tm-rest-client-1.0.2-SNAPSHOT.jar
[JENKINS] Archiving /home/jenkins/.hudson/jobs/gazelle-tm-rest-services/workspace/gazelle-tm-rest-client/target/gazelle-tm-rest-client-sources.jar to net.ihe.gazelle.tm.services/gazelle-tm-rest-client/1.0.2-SNAPSHOT/gazelle-tm-rest-client-1.0.2-SNAPSHOT-sources.jar
[JENKINS] Archiving /home/jenkins/.hudson/jobs/gazelle-tm-rest-services/workspace/gazelle-tm-rest-client/target/gazelle-tm-rest-client-tests.jar to net.ihe.gazelle.tm.services/gazelle-tm-rest-client/1.0.2-SNAPSHOT/gazelle-tm-rest-client-1.0.2-SNAPSHOT-tests.jar
[JENKINS] Archiving /home/jenkins/.hudson/jobs/gazelle-tm-rest-services/workspace/pom.xml to net.ihe.gazelle.tm.services/gazelle-tm-rest-services/1.0.2-SNAPSHOT/gazelle-tm-rest-services-1.0.2-SNAPSHOT.pom
[JENKINS] Archiving /home/jenkins/.hudson/jobs/gazelle-tm-rest-services/workspace/target/gazelle-tm-rest-services-tests.jar to net.ihe.gazelle.tm.services/gazelle-tm-rest-services/1.0.2-SNAPSHOT/gazelle-tm-rest-services-1.0.2-SNAPSHOT-tests.jar
[JENKINS] Archiving /home/jenkins/.hudson/jobs/gazelle-tm-rest-services/workspace/target/gazelle-tm-rest-services-metadata.zip to net.ihe.gazelle.tm.services/gazelle-tm-rest-services/1.0.2-SNAPSHOT/gazelle-tm-rest-services-1.0.2-SNAPSHOT-metadata.zip
channel stopped
[BFA] Scanning build for known causes...
[BFA] No failure causes found
[BFA] Done. 0s
Started calculate disk usage of build
Finished Calculation of disk usage of build in 0 seconds
Started calculate disk usage of workspace
Finished Calculation of disk usage of workspace in 0 seconds
Finished: UNSTABLE