UnstableConsole Output

Started calculate disk usage of build
Finished Calculation of disk usage of build in 0 seconds
Started calculate disk usage of workspace
Finished Calculation of disk usage of workspace in 0 seconds
[INFO]                                                                         
[INFO] ------------------------------------------------------------------------
[INFO] Building gazelle-tm-rest-client 1.0.2-SNAPSHOT
[INFO] ------------------------------------------------------------------------
[INFO] Downloading: https://gazelle.ihe.net/nexus/content/groups/public/net/ihe/gazelle/maven/gazelle-seam-tools-jar/3.0.21/gazelle-seam-tools-jar-3.0.21.pom
[INFO] Downloaded: https://gazelle.ihe.net/nexus/content/groups/public/net/ihe/gazelle/maven/gazelle-seam-tools-jar/3.0.21/gazelle-seam-tools-jar-3.0.21.pom (7 KB at 1.1 KB/sec)
[INFO] Downloading: https://gazelle.ihe.net/nexus/content/groups/public/net/ihe/gazelle/maven/gazelle-tools-jar/3.0.21/gazelle-tools-jar-3.0.21.pom
[INFO] Downloaded: https://gazelle.ihe.net/nexus/content/groups/public/net/ihe/gazelle/maven/gazelle-tools-jar/3.0.21/gazelle-tools-jar-3.0.21.pom (2 KB at 0.4 KB/sec)
[INFO] Downloading: https://gazelle.ihe.net/nexus/content/groups/public/net/ihe/gazelle/maven/gazelle-seam-tools-jar/3.0.21/gazelle-seam-tools-jar-3.0.21.jar
[INFO] Downloading: https://gazelle.ihe.net/nexus/content/groups/public/net/ihe/gazelle/maven/gazelle-tools-jar/3.0.21/gazelle-tools-jar-3.0.21.jar
[INFO] Downloaded: https://gazelle.ihe.net/nexus/content/groups/public/net/ihe/gazelle/maven/gazelle-seam-tools-jar/3.0.21/gazelle-seam-tools-jar-3.0.21.jar (223 KB at 34.9 KB/sec)
[INFO] Downloaded: https://gazelle.ihe.net/nexus/content/groups/public/net/ihe/gazelle/maven/gazelle-tools-jar/3.0.21/gazelle-tools-jar-3.0.21.jar (34 KB at 5.0 KB/sec)
[INFO] 
[INFO] --- maven-clean-plugin:2.5:clean (default-clean) @ gazelle-tm-rest-client ---
[INFO] Deleting /home/jenkins/.hudson/jobs/gazelle-tm-rest-services/workspace/gazelle-tm-rest-client/target
[INFO] 
[INFO] --- maven-enforcer-plugin:1.2:enforce (enforce-java-version) @ gazelle-tm-rest-client ---
[INFO] 
[INFO] --- maven-enforcer-plugin:1.2:enforce (enforce-maven-version) @ gazelle-tm-rest-client ---
[INFO] 
[INFO] --- buildnumber-maven-plugin:1.2:create-timestamp (get-build-timestamp) @ gazelle-tm-rest-client ---
[INFO] 
[INFO] --- buildnumber-maven-plugin:1.2:create (get-scm-revision) @ gazelle-tm-rest-client ---
[INFO] 
[INFO] --- maven-buildmetadata-plugin:1.1.0.IHE.3:provide-buildmetadata (default) @ gazelle-tm-rest-client ---
[INFO] Executing: /bin/sh -c cd /home/jenkins/.hudson/jobs/gazelle-tm-rest-services/workspace/gazelle-tm-rest-client && svn --non-interactive log -v -r '{2017-08-09 14:00:43 +0000}:{2017-09-09 14:00:43 +0000}' svn+ssh://scm.gforge.inria.fr/svn/gazelle/Maven/gazelle-tm-rest-services/trunk/gazelle-tm-rest-client
[INFO] Working directory: /home/jenkins/.hudson/jobs/gazelle-tm-rest-services/workspace/gazelle-tm-rest-client
[INFO] Executing: /bin/sh -c cd /home/jenkins/.hudson/jobs/gazelle-tm-rest-services/workspace/gazelle-tm-rest-client && svn --non-interactive log -v -r '{2017-07-10 14:00:43 +0000}:{2017-09-09 14:00:43 +0000}' svn+ssh://scm.gforge.inria.fr/svn/gazelle/Maven/gazelle-tm-rest-services/trunk/gazelle-tm-rest-client
[INFO] Working directory: /home/jenkins/.hudson/jobs/gazelle-tm-rest-services/workspace/gazelle-tm-rest-client
[INFO] Executing: /bin/sh -c cd /home/jenkins/.hudson/jobs/gazelle-tm-rest-services/workspace/gazelle-tm-rest-client && svn --non-interactive log -v -r '{2017-06-10 14:00:44 +0000}:{2017-09-09 14:00:44 +0000}' svn+ssh://scm.gforge.inria.fr/svn/gazelle/Maven/gazelle-tm-rest-services/trunk/gazelle-tm-rest-client
[INFO] Working directory: /home/jenkins/.hudson/jobs/gazelle-tm-rest-services/workspace/gazelle-tm-rest-client
[INFO] Executing: /bin/sh -c cd /home/jenkins/.hudson/jobs/gazelle-tm-rest-services/workspace/gazelle-tm-rest-client && svn --non-interactive log -v -r '{2017-05-11 14:00:44 +0000}:{2017-09-09 14:00:44 +0000}' svn+ssh://scm.gforge.inria.fr/svn/gazelle/Maven/gazelle-tm-rest-services/trunk/gazelle-tm-rest-client
[INFO] Working directory: /home/jenkins/.hudson/jobs/gazelle-tm-rest-services/workspace/gazelle-tm-rest-client
[INFO] Executing: /bin/sh -c cd /home/jenkins/.hudson/jobs/gazelle-tm-rest-services/workspace/gazelle-tm-rest-client && svn --non-interactive log -v -r '{2017-04-11 14:00:44 +0000}:{2017-09-09 14:00:44 +0000}' svn+ssh://scm.gforge.inria.fr/svn/gazelle/Maven/gazelle-tm-rest-services/trunk/gazelle-tm-rest-client
[INFO] Working directory: /home/jenkins/.hudson/jobs/gazelle-tm-rest-services/workspace/gazelle-tm-rest-client
[INFO] Executing: /bin/sh -c cd /home/jenkins/.hudson/jobs/gazelle-tm-rest-services/workspace/gazelle-tm-rest-client && svn --non-interactive log -v -r '{2017-03-12 14:00:45 +0000}:{2017-09-09 14:00:45 +0000}' svn+ssh://scm.gforge.inria.fr/svn/gazelle/Maven/gazelle-tm-rest-services/trunk/gazelle-tm-rest-client
[INFO] Working directory: /home/jenkins/.hudson/jobs/gazelle-tm-rest-services/workspace/gazelle-tm-rest-client
[INFO] Writing properties '/home/jenkins/.hudson/jobs/gazelle-tm-rest-services/workspace/gazelle-tm-rest-client/target/classes/META-INF/build.properties'...
[INFO] Writing XML report '/home/jenkins/.hudson/jobs/gazelle-tm-rest-services/workspace/gazelle-tm-rest-client/target/buildmetadata.xml'...
[INFO] 
[INFO] --- maven-resources-plugin:2.7:resources (default-resources) @ gazelle-tm-rest-client ---
[INFO] Using 'UTF-8' encoding to copy filtered resources.
[INFO] skip non existing resourceDirectory /home/jenkins/.hudson/jobs/gazelle-tm-rest-services/workspace/gazelle-tm-rest-client/src/main/resources
[INFO] 
[INFO] --- maven-compiler-plugin:3.5.1:compile (default-compile) @ gazelle-tm-rest-client ---
[INFO] Changes detected - recompiling the module!
[INFO] Compiling 15 source files to /home/jenkins/.hudson/jobs/gazelle-tm-rest-services/workspace/gazelle-tm-rest-client/target/classes
[WARNING] bootstrap class path not set in conjunction with -source 1.6
[WARNING] No SupportedSourceVersion annotation found on net.ihe.gazelle.common.interfacegenerator.InterfaceGeneratorProcessor, returning RELEASE_6.
[INFO] Hibernate JPA 2 Static-Metamodel Generator [WORKING]
[INFO] 
[INFO] --- maven-resources-plugin:2.7:testResources (default-testResources) @ gazelle-tm-rest-client ---
[INFO] Using 'UTF-8' encoding to copy filtered resources.
[INFO] Copying 1 resource
[INFO] 
[INFO] --- maven-compiler-plugin:3.5.1:testCompile (default-testCompile) @ gazelle-tm-rest-client ---
[INFO] Changes detected - recompiling the module!
[INFO] Compiling 1 source file to /home/jenkins/.hudson/jobs/gazelle-tm-rest-services/workspace/gazelle-tm-rest-client/target/test-classes
[WARNING] bootstrap class path not set in conjunction with -source 1.6
[WARNING] No SupportedSourceVersion annotation found on net.ihe.gazelle.common.interfacegenerator.InterfaceGeneratorProcessor, returning RELEASE_6.
[INFO] Hibernate JPA 2 Static-Metamodel Generator [WORKING]
[INFO] 
[INFO] --- maven-surefire-plugin:2.19.1:test (default-test) @ gazelle-tm-rest-client ---

-------------------------------------------------------
 T E S T S
-------------------------------------------------------
Running net.ihe.gazelle.tm.ws.client.wsClientTest
Tests run: 20, Failures: 0, Errors: 20, Skipped: 0, Time elapsed: 0.157 sec <<< FAILURE! - in net.ihe.gazelle.tm.ws.client.wsClientTest
getATest(net.ihe.gazelle.tm.ws.client.wsClientTest)  Time elapsed: 0.017 sec  <<< ERROR!
java.lang.NoClassDefFoundError: org/apache/http/client/methods/HttpRequestBase
	at net.ihe.gazelle.tm.ws.client.wsClientTest.getATest(wsClientTest.java:28)
Caused by: java.lang.ClassNotFoundException: org.apache.http.client.methods.HttpRequestBase
	at net.ihe.gazelle.tm.ws.client.wsClientTest.getATest(wsClientTest.java:28)

getTestTypes(net.ihe.gazelle.tm.ws.client.wsClientTest)  Time elapsed: 0.001 sec  <<< ERROR!
java.lang.NoClassDefFoundError: org/apache/http/client/methods/HttpRequestBase
	at net.ihe.gazelle.tm.ws.client.wsClientTest.getTestTypes(wsClientTest.java:34)
Caused by: java.lang.ClassNotFoundException: org.apache.http.client.methods.HttpRequestBase
	at net.ihe.gazelle.tm.ws.client.wsClientTest.getTestTypes(wsClientTest.java:34)

getTestStep(net.ihe.gazelle.tm.ws.client.wsClientTest)  Time elapsed: 0.001 sec  <<< ERROR!
java.lang.NoClassDefFoundError: org/apache/http/client/methods/HttpRequestBase
	at net.ihe.gazelle.tm.ws.client.wsClientTest.getTestStep(wsClientTest.java:64)
Caused by: java.lang.ClassNotFoundException: org.apache.http.client.methods.HttpRequestBase
	at net.ihe.gazelle.tm.ws.client.wsClientTest.getTestStep(wsClientTest.java:64)

getIntegrationProfilesWithoutAnswer(net.ihe.gazelle.tm.ws.client.wsClientTest)  Time elapsed: 0.001 sec  <<< ERROR!
java.lang.NoClassDefFoundError: org/apache/http/client/methods/HttpRequestBase
	at net.ihe.gazelle.tm.ws.client.wsClientTest.getIntegrationProfilesWithoutAnswer(wsClientTest.java:46)
Caused by: java.lang.ClassNotFoundException: org.apache.http.client.methods.HttpRequestBase
	at net.ihe.gazelle.tm.ws.client.wsClientTest.getIntegrationProfilesWithoutAnswer(wsClientTest.java:46)

getIntegrationProfilesWithAnswer(net.ihe.gazelle.tm.ws.client.wsClientTest)  Time elapsed: 0.001 sec  <<< ERROR!
java.lang.NoClassDefFoundError: org/apache/http/client/methods/HttpRequestBase
	at net.ihe.gazelle.tm.ws.client.wsClientTest.getIntegrationProfilesWithAnswer(wsClientTest.java:76)
Caused by: java.lang.ClassNotFoundException: org.apache.http.client.methods.HttpRequestBase
	at net.ihe.gazelle.tm.ws.client.wsClientTest.getIntegrationProfilesWithAnswer(wsClientTest.java:76)

getTestForIntegrationProfileWithAnswer(net.ihe.gazelle.tm.ws.client.wsClientTest)  Time elapsed: 0.001 sec  <<< ERROR!
java.lang.NoClassDefFoundError: org/apache/http/client/methods/HttpRequestBase
	at net.ihe.gazelle.tm.ws.client.wsClientTest.getTestForIntegrationProfileWithAnswer(wsClientTest.java:82)
Caused by: java.lang.ClassNotFoundException: org.apache.http.client.methods.HttpRequestBase
	at net.ihe.gazelle.tm.ws.client.wsClientTest.getTestForIntegrationProfileWithAnswer(wsClientTest.java:82)

getTestForIntegrationProfileWithoutAnswer(net.ihe.gazelle.tm.ws.client.wsClientTest)  Time elapsed: 0.001 sec  <<< ERROR!
java.lang.NoClassDefFoundError: org/apache/http/client/methods/HttpRequestBase
	at net.ihe.gazelle.tm.ws.client.wsClientTest.getTestForIntegrationProfileWithoutAnswer(wsClientTest.java:52)
Caused by: java.lang.ClassNotFoundException: org.apache.http.client.methods.HttpRequestBase
	at net.ihe.gazelle.tm.ws.client.wsClientTest.getTestForIntegrationProfileWithoutAnswer(wsClientTest.java:52)

getTestSteps(net.ihe.gazelle.tm.ws.client.wsClientTest)  Time elapsed: 0.124 sec  <<< ERROR!
java.lang.NoClassDefFoundError: org/apache/http/client/methods/HttpRequestBase
	at net.ihe.gazelle.tm.ws.client.wsClientTest.getTestSteps(wsClientTest.java:89)
Caused by: java.lang.ClassNotFoundException: org.apache.http.client.methods.HttpRequestBase
	at net.ihe.gazelle.tm.ws.client.wsClientTest.getTestSteps(wsClientTest.java:89)

getTestsWithoutAnswer(net.ihe.gazelle.tm.ws.client.wsClientTest)  Time elapsed: 0.001 sec  <<< ERROR!
java.lang.NoClassDefFoundError: org/apache/http/client/methods/HttpRequestBase
	at net.ihe.gazelle.tm.ws.client.wsClientTest.getTestsWithoutAnswer(wsClientTest.java:22)
Caused by: java.lang.ClassNotFoundException: org.apache.http.client.methods.HttpRequestBase
	at net.ihe.gazelle.tm.ws.client.wsClientTest.getTestsWithoutAnswer(wsClientTest.java:22)

getTestsWithAnswer(net.ihe.gazelle.tm.ws.client.wsClientTest)  Time elapsed: 0.001 sec  <<< ERROR!
java.lang.NoClassDefFoundError: org/apache/http/client/methods/HttpRequestBase
	at net.ihe.gazelle.tm.ws.client.wsClientTest.getTestsWithAnswer(wsClientTest.java:58)
Caused by: java.lang.ClassNotFoundException: org.apache.http.client.methods.HttpRequestBase
	at net.ihe.gazelle.tm.ws.client.wsClientTest.getTestsWithAnswer(wsClientTest.java:58)

getTestDescription(net.ihe.gazelle.tm.ws.client.wsClientTest)  Time elapsed: 0.001 sec  <<< ERROR!
java.lang.NoClassDefFoundError: org/apache/http/client/methods/HttpRequestBase
	at net.ihe.gazelle.tm.ws.client.wsClientTest.getTestDescription(wsClientTest.java:70)
Caused by: java.lang.ClassNotFoundException: org.apache.http.client.methods.HttpRequestBase
	at net.ihe.gazelle.tm.ws.client.wsClientTest.getTestDescription(wsClientTest.java:70)

getRules(net.ihe.gazelle.tm.ws.client.wsClientTest)  Time elapsed: 0.001 sec  <<< ERROR!
java.lang.NoClassDefFoundError: org/apache/http/client/methods/HttpRequestBase
	at net.ihe.gazelle.tm.ws.client.wsClientTest.getRules(wsClientTest.java:97)
Caused by: java.lang.ClassNotFoundException: org.apache.http.client.methods.HttpRequestBase
	at net.ihe.gazelle.tm.ws.client.wsClientTest.getRules(wsClientTest.java:97)

getIntegrationProfileRules(net.ihe.gazelle.tm.ws.client.wsClientTest)  Time elapsed: 0.001 sec  <<< ERROR!
java.lang.NoClassDefFoundError: org/apache/http/client/methods/HttpRequestBase
	at net.ihe.gazelle.tm.ws.client.wsClientTest.getIntegrationProfileRules(wsClientTest.java:103)
Caused by: java.lang.ClassNotFoundException: org.apache.http.client.methods.HttpRequestBase
	at net.ihe.gazelle.tm.ws.client.wsClientTest.getIntegrationProfileRules(wsClientTest.java:103)

getintegrationProfilesWithRules(net.ihe.gazelle.tm.ws.client.wsClientTest)  Time elapsed: 0 sec  <<< ERROR!
java.lang.NoClassDefFoundError: org/apache/http/client/methods/HttpRequestBase
	at net.ihe.gazelle.tm.ws.client.wsClientTest.getintegrationProfilesWithRules(wsClientTest.java:109)
Caused by: java.lang.ClassNotFoundException: org.apache.http.client.methods.HttpRequestBase
	at net.ihe.gazelle.tm.ws.client.wsClientTest.getintegrationProfilesWithRules(wsClientTest.java:109)

getintegrationProfilesWithRulesByDomain(net.ihe.gazelle.tm.ws.client.wsClientTest)  Time elapsed: 0 sec  <<< ERROR!
java.lang.NoClassDefFoundError: org/apache/http/client/methods/HttpRequestBase
	at net.ihe.gazelle.tm.ws.client.wsClientTest.getintegrationProfilesWithRulesByDomain(wsClientTest.java:115)
Caused by: java.lang.ClassNotFoundException: org.apache.http.client.methods.HttpRequestBase
	at net.ihe.gazelle.tm.ws.client.wsClientTest.getintegrationProfilesWithRulesByDomain(wsClientTest.java:115)

getintegrationProfilesWithTests(net.ihe.gazelle.tm.ws.client.wsClientTest)  Time elapsed: 0.001 sec  <<< ERROR!
java.lang.NoClassDefFoundError: org/apache/http/client/methods/HttpRequestBase
	at net.ihe.gazelle.tm.ws.client.wsClientTest.getintegrationProfilesWithTests(wsClientTest.java:121)
Caused by: java.lang.ClassNotFoundException: org.apache.http.client.methods.HttpRequestBase
	at net.ihe.gazelle.tm.ws.client.wsClientTest.getintegrationProfilesWithTests(wsClientTest.java:121)

getintegrationProfilesWithTestsByDomain(net.ihe.gazelle.tm.ws.client.wsClientTest)  Time elapsed: 0.001 sec  <<< ERROR!
java.lang.NoClassDefFoundError: org/apache/http/client/methods/HttpRequestBase
	at net.ihe.gazelle.tm.ws.client.wsClientTest.getintegrationProfilesWithTestsByDomain(wsClientTest.java:127)
Caused by: java.lang.ClassNotFoundException: org.apache.http.client.methods.HttpRequestBase
	at net.ihe.gazelle.tm.ws.client.wsClientTest.getintegrationProfilesWithTestsByDomain(wsClientTest.java:127)

getRuleById(net.ihe.gazelle.tm.ws.client.wsClientTest)  Time elapsed: 0.001 sec  <<< ERROR!
java.lang.NoClassDefFoundError: org/apache/http/client/methods/HttpRequestBase
	at net.ihe.gazelle.tm.ws.client.wsClientTest.getRuleById(wsClientTest.java:133)
Caused by: java.lang.ClassNotFoundException: org.apache.http.client.methods.HttpRequestBase
	at net.ihe.gazelle.tm.ws.client.wsClientTest.getRuleById(wsClientTest.java:133)

getActors(net.ihe.gazelle.tm.ws.client.wsClientTest)  Time elapsed: 0 sec  <<< ERROR!
java.lang.NoClassDefFoundError: org/apache/http/client/methods/HttpRequestBase
	at net.ihe.gazelle.tm.ws.client.wsClientTest.getActors(wsClientTest.java:139)
Caused by: java.lang.ClassNotFoundException: org.apache.http.client.methods.HttpRequestBase
	at net.ihe.gazelle.tm.ws.client.wsClientTest.getActors(wsClientTest.java:139)

getTestsWithWrongResourcePath(net.ihe.gazelle.tm.ws.client.wsClientTest)  Time elapsed: 0 sec  <<< ERROR!
java.lang.NoClassDefFoundError: org/apache/http/client/methods/HttpRequestBase
	at net.ihe.gazelle.tm.ws.client.wsClientTest.getTestsWithWrongResourcePath(wsClientTest.java:40)
Caused by: java.lang.ClassNotFoundException: org.apache.http.client.methods.HttpRequestBase
	at net.ihe.gazelle.tm.ws.client.wsClientTest.getTestsWithWrongResourcePath(wsClientTest.java:40)


Results :

Tests in error: 
  wsClientTest.getATest:28 » NoClassDefFound org/apache/http/client/methods/Http...
  wsClientTest.getActors:139 » NoClassDefFound org/apache/http/client/methods/Ht...
  wsClientTest.getIntegrationProfileRules:103 » NoClassDefFound org/apache/http/...
  wsClientTest.getIntegrationProfilesWithAnswer:76 » NoClassDefFound org/apache/...
  wsClientTest.getIntegrationProfilesWithoutAnswer:46 » NoClassDefFound org/apac...
  wsClientTest.getRuleById:133 » NoClassDefFound org/apache/http/client/methods/...
  wsClientTest.getRules:97 » NoClassDefFound org/apache/http/client/methods/Http...
  wsClientTest.getTestDescription:70 » NoClassDefFound org/apache/http/client/me...
  wsClientTest.getTestForIntegrationProfileWithAnswer:82 » NoClassDefFound org/a...
  wsClientTest.getTestForIntegrationProfileWithoutAnswer:52 » NoClassDefFound or...
  wsClientTest.getTestStep:64 » NoClassDefFound org/apache/http/client/methods/H...
  wsClientTest.getTestSteps:89 » NoClassDefFound org/apache/http/client/methods/...
  wsClientTest.getTestTypes:34 » NoClassDefFound org/apache/http/client/methods/...
  wsClientTest.getTestsWithAnswer:58 » NoClassDefFound org/apache/http/client/me...
  wsClientTest.getTestsWithWrongResourcePath:40 » NoClassDefFound org/apache/htt...
  wsClientTest.getTestsWithoutAnswer:22 » NoClassDefFound org/apache/http/client...
  wsClientTest.getintegrationProfilesWithRules:109 » NoClassDefFound org/apache/...
  wsClientTest.getintegrationProfilesWithRulesByDomain:115 » NoClassDefFound org...
  wsClientTest.getintegrationProfilesWithTests:121 » NoClassDefFound org/apache/...
  wsClientTest.getintegrationProfilesWithTestsByDomain:127 » NoClassDefFound org...

Tests run: 20, Failures: 0, Errors: 20, Skipped: 0

[ERROR] There are test failures.

Please refer to /home/jenkins/.hudson/jobs/gazelle-tm-rest-services/workspace/gazelle-tm-rest-client/target/surefire-reports for the individual test results.
[JENKINS] Recording test results
[INFO] 
[INFO] --- maven-jar-plugin:2.6:jar (default-jar) @ gazelle-tm-rest-client ---
[INFO] Building jar: /home/jenkins/.hudson/jobs/gazelle-tm-rest-services/workspace/gazelle-tm-rest-client/target/gazelle-tm-rest-client.jar
[INFO] 
[INFO] --- maven-source-plugin:2.2.1:jar-no-fork (attach-sources) @ gazelle-tm-rest-client ---
[INFO] Building jar: /home/jenkins/.hudson/jobs/gazelle-tm-rest-services/workspace/gazelle-tm-rest-client/target/gazelle-tm-rest-client-sources.jar
[INFO] 
[INFO] --- maven-jar-plugin:2.6:test-jar (default) @ gazelle-tm-rest-client ---
[INFO] Building jar: /home/jenkins/.hudson/jobs/gazelle-tm-rest-services/workspace/gazelle-tm-rest-client/target/gazelle-tm-rest-client-tests.jar
[INFO] 
[INFO] --- maven-install-plugin:2.4:install (default-install) @ gazelle-tm-rest-client ---
[INFO] Installing /home/jenkins/.hudson/jobs/gazelle-tm-rest-services/workspace/gazelle-tm-rest-client/target/gazelle-tm-rest-client.jar to /home/jenkins/.m2/repository/net/ihe/gazelle/tm/services/gazelle-tm-rest-client/1.0.2-SNAPSHOT/gazelle-tm-rest-client-1.0.2-SNAPSHOT.jar
[INFO] Installing /home/jenkins/.hudson/jobs/gazelle-tm-rest-services/workspace/gazelle-tm-rest-client/pom.xml to /home/jenkins/.m2/repository/net/ihe/gazelle/tm/services/gazelle-tm-rest-client/1.0.2-SNAPSHOT/gazelle-tm-rest-client-1.0.2-SNAPSHOT.pom
[INFO] Installing /home/jenkins/.hudson/jobs/gazelle-tm-rest-services/workspace/gazelle-tm-rest-client/target/gazelle-tm-rest-client-sources.jar to /home/jenkins/.m2/repository/net/ihe/gazelle/tm/services/gazelle-tm-rest-client/1.0.2-SNAPSHOT/gazelle-tm-rest-client-1.0.2-SNAPSHOT-sources.jar
[INFO] Installing /home/jenkins/.hudson/jobs/gazelle-tm-rest-services/workspace/gazelle-tm-rest-client/target/gazelle-tm-rest-client-tests.jar to /home/jenkins/.m2/repository/net/ihe/gazelle/tm/services/gazelle-tm-rest-client/1.0.2-SNAPSHOT/gazelle-tm-rest-client-1.0.2-SNAPSHOT-tests.jar